Build failed in Jenkins: POI-DSL-Maven #773

classic Classic list List threaded Threaded
2 messages Options
Reply | Threaded
Open this post in threaded view
|

Build failed in Jenkins: POI-DSL-Maven #773

Apache Jenkins Server
See <https://builds.apache.org/job/POI-DSL-Maven/773/display/redirect?page=changes>

Changes:

[yegor] Bug 63054: improved evaluation of array formulas with error in arguments

------------------------------------------
[...truncated 86.39 KB...]
Tests run: 2, Failures: 0, Errors: 0, Skipped: 0, Time elapsed: 0 sec - in org.apache.poi.ss.formula.functions.TestQuotient
Running org.apache.poi.ss.formula.functions.TestComplex
Tests run: 2, Failures: 0, Errors: 0, Skipped: 0, Time elapsed: 0 sec - in org.apache.poi.ss.formula.functions.TestComplex
Running org.apache.poi.ss.formula.functions.TestOffset
Tests run: 3, Failures: 0, Errors: 0, Skipped: 0, Time elapsed: 0 sec - in org.apache.poi.ss.formula.functions.TestOffset
Running org.apache.poi.ss.formula.functions.TestSubtotal
Tests run: 11, Failures: 0, Errors: 0, Skipped: 0, Time elapsed: 0.002 sec - in org.apache.poi.ss.formula.functions.TestSubtotal
Running org.apache.poi.ss.formula.functions.TestCode
Tests run: 2, Failures: 0, Errors: 0, Skipped: 0, Time elapsed: 0 sec - in org.apache.poi.ss.formula.functions.TestCode
Running org.apache.poi.ss.formula.functions.TestSumifs
Tests run: 7, Failures: 0, Errors: 0, Skipped: 0, Time elapsed: 0.001 sec - in org.apache.poi.ss.formula.functions.TestSumifs
Running org.apache.poi.ss.formula.functions.TestFinanceLib
Tests run: 5, Failures: 0, Errors: 0, Skipped: 0, Time elapsed: 0 sec - in org.apache.poi.ss.formula.functions.TestFinanceLib
Running org.apache.poi.ss.formula.functions.TestWeekNumFunctionsFromSpreadsheet
Tests run: 7, Failures: 0, Errors: 0, Skipped: 0, Time elapsed: 0 sec - in org.apache.poi.ss.formula.functions.TestWeekNumFunctionsFromSpreadsheet
Running org.apache.poi.ss.formula.functions.TestTrim
Tests run: 3, Failures: 0, Errors: 0, Skipped: 0, Time elapsed: 0 sec - in org.apache.poi.ss.formula.functions.TestTrim
Running org.apache.poi.ss.formula.functions.TestTime
Tests run: 2, Failures: 0, Errors: 0, Skipped: 0, Time elapsed: 0 sec - in org.apache.poi.ss.formula.functions.TestTime
Running org.apache.poi.ss.formula.functions.TestLogicalFunctionsFromSpreadsheet
Tests run: 15, Failures: 0, Errors: 0, Skipped: 0, Time elapsed: 0.004 sec - in org.apache.poi.ss.formula.functions.TestLogicalFunctionsFromSpreadsheet
Running org.apache.poi.ss.formula.functions.TestFind
Tests run: 1, Failures: 0, Errors: 0, Skipped: 0, Time elapsed: 0.001 sec - in org.apache.poi.ss.formula.functions.TestFind
Running org.apache.poi.ss.formula.functions.TestDelta
Tests run: 2, Failures: 0, Errors: 0, Skipped: 0, Time elapsed: 0 sec - in org.apache.poi.ss.formula.functions.TestDelta
Running org.apache.poi.ss.formula.functions.TestRomanFunctionsFromSpreadsheet
Tests run: 35, Failures: 0, Errors: 0, Skipped: 0, Time elapsed: 0.002 sec - in org.apache.poi.ss.formula.functions.TestRomanFunctionsFromSpreadsheet
Running org.apache.poi.ss.formula.functions.TestTrunc
Tests run: 5, Failures: 0, Errors: 0, Skipped: 0, Time elapsed: 0 sec - in org.apache.poi.ss.formula.functions.TestTrunc
Running org.apache.poi.ss.formula.functions.TestDStarFunctionsFromSpreadsheet
Tests run: 12, Failures: 0, Errors: 0, Skipped: 0, Time elapsed: 0 sec - in org.apache.poi.ss.formula.functions.TestDStarFunctionsFromSpreadsheet
Running org.apache.poi.ss.formula.functions.TestHex2Dec
Tests run: 5, Failures: 0, Errors: 0, Skipped: 0, Time elapsed: 0 sec - in org.apache.poi.ss.formula.functions.TestHex2Dec
Running org.apache.poi.ss.formula.functions.TestTwoOperandNumericFunctionsFromSpreadsheet
Tests run: 34, Failures: 7, Errors: 0, Skipped: 0, Time elapsed: 0.011 sec <<< FAILURE! - in org.apache.poi.ss.formula.functions.TestTwoOperandNumericFunctionsFromSpreadsheet
processFunctionRow[POWER function with array arguments](org.apache.poi.ss.formula.functions.TestTwoOperandNumericFunctionsFromSpreadsheet)  Time elapsed: 0.004 sec  <<< FAILURE!
java.lang.AssertionError: In TwoOperandNumericFunctionTestCaseData.xls TwoArgNumericFunctions!B37 {=POWER(E9:E16,E9:E16)} 'POWER function with array arguments'. Actual: ERROR

processFunctionRow[POWER(E9:E16,E9:E16)](org.apache.poi.ss.formula.functions.TestTwoOperandNumericFunctionsFromSpreadsheet)  Time elapsed: 0.001 sec  <<< FAILURE!
org.junit.ComparisonFailure: In TwoOperandNumericFunctionTestCaseData.xls TwoArgNumericFunctions!B38 {=POWER(E9:E16,E9:E16)} 'POWER(E9:E16,E9:E16)' expected:<#[DIV/0]!> but was:<#[VALUE]!>

processFunctionRow[POWER(E9:E16,E9:E16)](org.apache.poi.ss.formula.functions.TestTwoOperandNumericFunctionsFromSpreadsheet)  Time elapsed: 0.001 sec  <<< FAILURE!
java.lang.AssertionError: In TwoOperandNumericFunctionTestCaseData.xls TwoArgNumericFunctions!B39 {=POWER(E9:E16,E9:E16)} 'POWER(E9:E16,E9:E16)'. Actual: ERROR

processFunctionRow[POWER(E9:E16,E9:E16)](org.apache.poi.ss.formula.functions.TestTwoOperandNumericFunctionsFromSpreadsheet)  Time elapsed: 0 sec  <<< FAILURE!
org.junit.ComparisonFailure: In TwoOperandNumericFunctionTestCaseData.xls TwoArgNumericFunctions!B40 {=POWER(E9:E16,E9:E16)} 'POWER(E9:E16,E9:E16)' expected:<#[N/A]> but was:<#[VALUE!]>

processFunctionRow[POWER(E9:E16,E9:E16)](org.apache.poi.ss.formula.functions.TestTwoOperandNumericFunctionsFromSpreadsheet)  Time elapsed: 0 sec  <<< FAILURE!
org.junit.ComparisonFailure: In TwoOperandNumericFunctionTestCaseData.xls TwoArgNumericFunctions!B41 {=POWER(E9:E16,E9:E16)} 'POWER(E9:E16,E9:E16)' expected:<#[NUM]!> but was:<#[VALUE]!>

processFunctionRow[POWER(E9:E16,E9:E16)](org.apache.poi.ss.formula.functions.TestTwoOperandNumericFunctionsFromSpreadsheet)  Time elapsed: 0.001 sec  <<< FAILURE!
org.junit.ComparisonFailure: In TwoOperandNumericFunctionTestCaseData.xls TwoArgNumericFunctions!B42 {=POWER(E9:E16,E9:E16)} 'POWER(E9:E16,E9:E16)' expected:<#[REF]!> but was:<#[VALUE]!>

processFunctionRow[POWER(E9:E16,E9:E16)](org.apache.poi.ss.formula.functions.TestTwoOperandNumericFunctionsFromSpreadsheet)  Time elapsed: 0 sec  <<< FAILURE!
java.lang.AssertionError: In TwoOperandNumericFunctionTestCaseData.xls TwoArgNumericFunctions!B44 {=POWER(E9:E16,E9:E16)} 'POWER(E9:E16,E9:E16)'. Actual: ERROR

Running org.apache.poi.ss.formula.functions.TestDays360
Tests run: 2, Failures: 0, Errors: 0, Skipped: 0, Time elapsed: 0.005 sec - in org.apache.poi.ss.formula.functions.TestDays360
Running org.apache.poi.ss.formula.functions.TestIrr
Tests run: 3, Failures: 0, Errors: 0, Skipped: 0, Time elapsed: 0.001 sec - in org.apache.poi.ss.formula.functions.TestIrr
Running org.apache.poi.ss.formula.functions.TestLen
Tests run: 3, Failures: 0, Errors: 0, Skipped: 0, Time elapsed: 0 sec - in org.apache.poi.ss.formula.functions.TestLen
Running org.apache.poi.ss.formula.functions.TestIPMT
Tests run: 1, Failures: 0, Errors: 0, Skipped: 0, Time elapsed: 0.001 sec - in org.apache.poi.ss.formula.functions.TestIPMT
Running org.apache.poi.ss.formula.functions.TestIndirect
Tests run: 3, Failures: 0, Errors: 0, Skipped: 0, Time elapsed: 0.002 sec - in org.apache.poi.ss.formula.functions.TestIndirect
Running org.apache.poi.ss.formula.functions.TestMatchFunctionsFromSpreadsheet
Tests run: 13, Failures: 0, Errors: 0, Skipped: 0, Time elapsed: 0 sec - in org.apache.poi.ss.formula.functions.TestMatchFunctionsFromSpreadsheet
Running org.apache.poi.ss.formula.functions.TestMathX
Tests run: 23, Failures: 0, Errors: 0, Skipped: 0, Time elapsed: 0.002 sec - in org.apache.poi.ss.formula.functions.TestMathX
Running org.apache.poi.ss.formula.functions.TestLeftRight
Tests run: 2, Failures: 0, Errors: 0, Skipped: 0, Time elapsed: 0 sec - in org.apache.poi.ss.formula.functions.TestLeftRight
Running org.apache.poi.ss.formula.functions.TestDeltaFunctionsFromSpreadsheet
Tests run: 7, Failures: 0, Errors: 0, Skipped: 0, Time elapsed: 0 sec - in org.apache.poi.ss.formula.functions.TestDeltaFunctionsFromSpreadsheet
Running org.apache.poi.ss.formula.functions.TestBin2Dec
Tests run: 5, Failures: 0, Errors: 0, Skipped: 0, Time elapsed: 0 sec - in org.apache.poi.ss.formula.functions.TestBin2Dec
Running org.apache.poi.ss.formula.functions.TestOct2Dec
Tests run: 2, Failures: 0, Errors: 0, Skipped: 0, Time elapsed: 0 sec - in org.apache.poi.ss.formula.functions.TestOct2Dec
Running org.apache.poi.ss.formula.functions.TestComplexFunctionsFromSpreadsheet
Tests run: 12, Failures: 0, Errors: 0, Skipped: 0, Time elapsed: 0 sec - in org.apache.poi.ss.formula.functions.TestComplexFunctionsFromSpreadsheet
Running org.apache.poi.ss.formula.functions.TestText
Tests run: 4, Failures: 0, Errors: 0, Skipped: 0, Time elapsed: 0.001 sec - in org.apache.poi.ss.formula.functions.TestText
Running org.apache.poi.ss.formula.functions.TestSumif
Tests run: 3, Failures: 0, Errors: 0, Skipped: 0, Time elapsed: 0 sec - in org.apache.poi.ss.formula.functions.TestSumif
Running org.apache.poi.ss.formula.functions.TestPPMT
Tests run: 1, Failures: 0, Errors: 0, Skipped: 0, Time elapsed: 0.001 sec - in org.apache.poi.ss.formula.functions.TestPPMT
Running org.apache.poi.ss.formula.functions.TestRoundFuncs
Tests run: 5, Failures: 0, Errors: 0, Skipped: 1, Time elapsed: 0.001 sec - in org.apache.poi.ss.formula.functions.TestRoundFuncs
Running org.apache.poi.ss.formula.function.TestReadMissingBuiltInFuncs
Tests run: 7, Failures: 0, Errors: 0, Skipped: 0, Time elapsed: 0 sec - in org.apache.poi.ss.formula.function.TestReadMissingBuiltInFuncs
Running org.apache.poi.ss.formula.function.TestFunctionMetadataRegistry
Tests run: 1, Failures: 0, Errors: 0, Skipped: 0, Time elapsed: 0 sec - in org.apache.poi.ss.formula.function.TestFunctionMetadataRegistry
Running org.apache.poi.ss.formula.function.TestParseMissingBuiltInFuncs
Tests run: 7, Failures: 0, Errors: 0, Skipped: 0, Time elapsed: 0 sec - in org.apache.poi.ss.formula.function.TestParseMissingBuiltInFuncs
Running org.apache.poi.ss.formula.TestCellCacheEntry
Tests run: 1, Failures: 0, Errors: 0, Skipped: 0, Time elapsed: 0 sec - in org.apache.poi.ss.formula.TestCellCacheEntry
Running org.apache.poi.ss.util.TestExpandedDouble
Tests run: 3, Failures: 0, Errors: 0, Skipped: 0, Time elapsed: 0.002 sec - in org.apache.poi.ss.util.TestExpandedDouble
Running org.apache.poi.ss.util.TestAreaReference
Tests run: 2, Failures: 0, Errors: 0, Skipped: 0, Time elapsed: 0 sec - in org.apache.poi.ss.util.TestAreaReference
Running org.apache.poi.ss.util.TestNumberToTextConverter
Tests run: 2, Failures: 0, Errors: 0, Skipped: 0, Time elapsed: 0.003 sec - in org.apache.poi.ss.util.TestNumberToTextConverter
Running org.apache.poi.ss.util.TestSheetBuilder
Tests run: 3, Failures: 0, Errors: 0, Skipped: 0, Time elapsed: 0 sec - in org.apache.poi.ss.util.TestSheetBuilder
Running org.apache.poi.ss.util.TestCellRangeAddress
Tests run: 14, Failures: 0, Errors: 0, Skipped: 0, Time elapsed: 0.001 sec - in org.apache.poi.ss.util.TestCellRangeAddress
Running org.apache.poi.ss.util.TestCellReference
Tests run: 26, Failures: 0, Errors: 0, Skipped: 0, Time elapsed: 0.531 sec - in org.apache.poi.ss.util.TestCellReference
Running org.apache.poi.ss.util.cellwalk.TestCellWalk
Tests run: 1, Failures: 0, Errors: 0, Skipped: 0, Time elapsed: 0.001 sec - in org.apache.poi.ss.util.cellwalk.TestCellWalk
Running org.apache.poi.ss.util.TestSheetUtil
Tests run: 7, Failures: 0, Errors: 0, Skipped: 0, Time elapsed: 0.001 sec - in org.apache.poi.ss.util.TestSheetUtil
Running org.apache.poi.ss.util.TestHSSFCellUtil
Tests run: 13, Failures: 0, Errors: 0, Skipped: 0, Time elapsed: 0.007 sec - in org.apache.poi.ss.util.TestHSSFCellUtil
Running org.apache.poi.ss.util.TestWorkbookUtil
Tests run: 1, Failures: 0, Errors: 0, Skipped: 0, Time elapsed: 0 sec - in org.apache.poi.ss.util.TestWorkbookUtil
Running org.apache.poi.ss.util.TestRegionUtil
Tests run: 10, Failures: 0, Errors: 0, Skipped: 0, Time elapsed: 0.005 sec - in org.apache.poi.ss.util.TestRegionUtil
Running org.apache.poi.ss.util.TestPropertyTemplate
Tests run: 8, Failures: 0, Errors: 0, Skipped: 0, Time elapsed: 0.008 sec - in org.apache.poi.ss.util.TestPropertyTemplate
Running org.apache.poi.ss.util.TestCellRangeUtil
Tests run: 1, Failures: 0, Errors: 0, Skipped: 0, Time elapsed: 0.003 sec - in org.apache.poi.ss.util.TestCellRangeUtil
Running org.apache.poi.ss.util.TestNumberComparer
Tests run: 4, Failures: 0, Errors: 0, Skipped: 0, Time elapsed: 0.019 sec - in org.apache.poi.ss.util.TestNumberComparer
Running org.apache.poi.ss.util.TestDateFormatConverter
Tests run: 3, Failures: 0, Errors: 0, Skipped: 0, Time elapsed: 0.371 sec - in org.apache.poi.ss.util.TestDateFormatConverter
Running org.apache.poi.ss.util.TestCellAddress
Tests run: 6, Failures: 0, Errors: 0, Skipped: 0, Time elapsed: 0 sec - in org.apache.poi.ss.util.TestCellAddress
Running org.apache.poi.ss.usermodel.charts.TestDataSources
Tests run: 6, Failures: 0, Errors: 0, Skipped: 0, Time elapsed: 0.002 sec - in org.apache.poi.ss.usermodel.charts.TestDataSources
Running org.apache.poi.ss.usermodel.TestDataFormatter
Tests run: 34, Failures: 0, Errors: 0, Skipped: 1, Time elapsed: 0.02 sec - in org.apache.poi.ss.usermodel.TestDataFormatter
Running org.apache.poi.ss.usermodel.TestHSSFBorderStyle
Tests run: 1, Failures: 0, Errors: 0, Skipped: 0, Time elapsed: 0 sec - in org.apache.poi.ss.usermodel.TestHSSFBorderStyle
Running org.apache.poi.ss.usermodel.TestFractionFormat
Tests run: 2, Failures: 0, Errors: 0, Skipped: 0, Time elapsed: 0.044 sec - in org.apache.poi.ss.usermodel.TestFractionFormat
Running org.apache.poi.ss.usermodel.TestExcelStyleDateFormatter
Tests run: 4, Failures: 0, Errors: 0, Skipped: 0, Time elapsed: 0.006 sec - in org.apache.poi.ss.usermodel.TestExcelStyleDateFormatter
Running org.apache.poi.ss.usermodel.TestDateUtil
Tests run: 5, Failures: 0, Errors: 0, Skipped: 0, Time elapsed: 0 sec - in org.apache.poi.ss.usermodel.TestDateUtil
Running org.apache.poi.ss.usermodel.TestIndexedColors
Tests run: 3, Failures: 0, Errors: 0, Skipped: 0, Time elapsed: 0 sec - in org.apache.poi.ss.usermodel.TestIndexedColors
Running org.apache.poi.hpsf.extractor.TestHPSFPropertiesExtractor
Tests run: 8, Failures: 0, Errors: 0, Skipped: 0, Time elapsed: 0.014 sec - in org.apache.poi.hpsf.extractor.TestHPSFPropertiesExtractor
Running org.apache.poi.hpsf.TestVariantSupport
Tests run: 2, Failures: 0, Errors: 0, Skipped: 0, Time elapsed: 0.002 sec - in org.apache.poi.hpsf.TestVariantSupport
Running org.apache.poi.hpsf.basic.TestEmptyProperties
Tests run: 3, Failures: 0, Errors: 0, Skipped: 0, Time elapsed: 0.004 sec - in org.apache.poi.hpsf.basic.TestEmptyProperties
Running org.apache.poi.hpsf.basic.TestWriteWellKnown
Tests run: 3, Failures: 0, Errors: 0, Skipped: 0, Time elapsed: 0.01 sec - in org.apache.poi.hpsf.basic.TestWriteWellKnown
Running org.apache.poi.hpsf.basic.TestUnicode
Tests run: 1, Failures: 0, Errors: 0, Skipped: 0, Time elapsed: 0 sec - in org.apache.poi.hpsf.basic.TestUnicode
Running org.apache.poi.hpsf.basic.TestHPSFBugs
Tests run: 4, Failures: 0, Errors: 0, Skipped: 0, Time elapsed: 0.004 sec - in org.apache.poi.hpsf.basic.TestHPSFBugs
Running org.apache.poi.hpsf.basic.TestWrite
Tests run: 10, Failures: 0, Errors: 0, Skipped: 0, Time elapsed: 0 sec - in org.apache.poi.hpsf.basic.TestWrite
Running org.apache.poi.hpsf.basic.TestReadAllFiles
Tests run: 88, Failures: 0, Errors: 0, Skipped: 0, Time elapsed: 0.211 sec - in org.apache.poi.hpsf.basic.TestReadAllFiles
Running org.apache.poi.hpsf.basic.TestMetaDataIPI
Tests run: 7, Failures: 0, Errors: 0, Skipped: 0, Time elapsed: 0.119 sec - in org.apache.poi.hpsf.basic.TestMetaDataIPI
Running org.apache.poi.hpsf.basic.TestBasic
Tests run: 6, Failures: 0, Errors: 0, Skipped: 0, Time elapsed: 0.002 sec - in org.apache.poi.hpsf.basic.TestBasic
Running org.apache.poi.hpsf.basic.TestClassID
Tests run: 3, Failures: 0, Errors: 0, Skipped: 0, Time elapsed: 0 sec - in org.apache.poi.hpsf.basic.TestClassID
Running org.apache.poi.ddf.TestEscherContainerRecord
Tests run: 6, Failures: 0, Errors: 0, Skipped: 0, Time elapsed: 0 sec - in org.apache.poi.ddf.TestEscherContainerRecord
Running org.apache.poi.ddf.TestEscherDgRecord
Tests run: 3, Failures: 0, Errors: 0, Skipped: 0, Time elapsed: 0 sec - in org.apache.poi.ddf.TestEscherDgRecord
Running org.apache.poi.ddf.TestUnknownEscherRecord
Tests run: 3, Failures: 0, Errors: 0, Skipped: 0, Time elapsed: 0 sec - in org.apache.poi.ddf.TestUnknownEscherRecord
Running org.apache.poi.ddf.TestEscherSpgrRecord
Tests run: 3, Failures: 0, Errors: 0, Skipped: 0, Time elapsed: 0 sec - in org.apache.poi.ddf.TestEscherSpgrRecord
Running org.apache.poi.ddf.TestEscherProperty
Tests run: 1, Failures: 0, Errors: 0, Skipped: 0, Time elapsed: 0 sec - in org.apache.poi.ddf.TestEscherProperty
Running org.apache.poi.ddf.TestEscherBoolProperty
Tests run: 1, Failures: 0, Errors: 0, Skipped: 0, Time elapsed: 0 sec - in org.apache.poi.ddf.TestEscherBoolProperty
Running org.apache.poi.ddf.TestEscherDump
Tests run: 3, Failures: 0, Errors: 0, Skipped: 0, Time elapsed: 0.016 sec - in org.apache.poi.ddf.TestEscherDump
Running org.apache.poi.ddf.TestEscherPropertyFactory
Tests run: 1, Failures: 0, Errors: 0, Skipped: 0, Time elapsed: 0 sec - in org.apache.poi.ddf.TestEscherPropertyFactory
Running org.apache.poi.ddf.TestEscherDggRecord
Tests run: 4, Failures: 0, Errors: 0, Skipped: 0, Time elapsed: 0 sec - in org.apache.poi.ddf.TestEscherDggRecord
Running org.apache.poi.ddf.TestEscherClientDataRecord
Tests run: 3, Failures: 0, Errors: 0, Skipped: 0, Time elapsed: 0 sec - in org.apache.poi.ddf.TestEscherClientDataRecord
Running org.apache.poi.ddf.TestEscherClientAnchorRecord
Tests run: 3, Failures: 0, Errors: 0, Skipped: 0, Time elapsed: 0 sec - in org.apache.poi.ddf.TestEscherClientAnchorRecord
Running org.apache.poi.ddf.TestEscherSplitMenuColorsRecord
Tests run: 3, Failures: 0, Errors: 0, Skipped: 0, Time elapsed: 0 sec - in org.apache.poi.ddf.TestEscherSplitMenuColorsRecord
Running org.apache.poi.ddf.TestEscherBlipRecord
Tests run: 4, Failures: 0, Errors: 0, Skipped: 0, Time elapsed: 0.015 sec - in org.apache.poi.ddf.TestEscherBlipRecord
Running org.apache.poi.ddf.TestEscherBSERecord
Tests run: 3, Failures: 0, Errors: 0, Skipped: 0, Time elapsed: 0 sec - in org.apache.poi.ddf.TestEscherBSERecord
Running org.apache.poi.ddf.TestEscherOptRecord
Tests run: 6, Failures: 0, Errors: 0, Skipped: 0, Time elapsed: 0 sec - in org.apache.poi.ddf.TestEscherOptRecord
Running org.apache.poi.ddf.TestEscherSpRecord
Tests run: 3, Failures: 0, Errors: 0, Skipped: 0, Time elapsed: 0 sec - in org.apache.poi.ddf.TestEscherSpRecord
Running org.apache.poi.ddf.TestEscherChildAnchorRecord
Tests run: 3, Failures: 0, Errors: 0, Skipped: 0, Time elapsed: 0 sec - in org.apache.poi.ddf.TestEscherChildAnchorRecord

Results :

Failed tests:
  TestTwoOperandNumericFunctionsFromSpreadsheet>BaseTestFunctionsFromSpreadsheet.processFunctionRow:164 In TwoOperandNumericFunctionTestCaseData.xls TwoArgNumericFunctions!B37 {=POWER(E9:E16,E9:E16)} 'POWER function with array arguments'. Actual: ERROR
org.apache.poi.ss.formula.functions.TestTwoOperandNumericFunctionsFromSpreadsheet.processFunctionRow[POWER(E9:E16,E9:E16)](org.apache.poi.ss.formula.functions.TestTwoOperandNumericFunctionsFromSpreadsheet)
  Run 1: TestTwoOperandNumericFunctionsFromSpreadsheet>BaseTestFunctionsFromSpreadsheet.processFunctionRow:157 In TwoOperandNumericFunctionTestCaseData.xls TwoArgNumericFunctions!B38 {=POWER(E9:E16,E9:E16)} 'POWER(E9:E16,E9:E16)' expected:<#[DIV/0]!> but was:<#[VALUE]!>
  Run 2: TestTwoOperandNumericFunctionsFromSpreadsheet>BaseTestFunctionsFromSpreadsheet.processFunctionRow:164 In TwoOperandNumericFunctionTestCaseData.xls TwoArgNumericFunctions!B39 {=POWER(E9:E16,E9:E16)} 'POWER(E9:E16,E9:E16)'. Actual: ERROR
  Run 3: TestTwoOperandNumericFunctionsFromSpreadsheet>BaseTestFunctionsFromSpreadsheet.processFunctionRow:157 In TwoOperandNumericFunctionTestCaseData.xls TwoArgNumericFunctions!B40 {=POWER(E9:E16,E9:E16)} 'POWER(E9:E16,E9:E16)' expected:<#[N/A]> but was:<#[VALUE!]>
  Run 4: TestTwoOperandNumericFunctionsFromSpreadsheet>BaseTestFunctionsFromSpreadsheet.processFunctionRow:157 In TwoOperandNumericFunctionTestCaseData.xls TwoArgNumericFunctions!B41 {=POWER(E9:E16,E9:E16)} 'POWER(E9:E16,E9:E16)' expected:<#[NUM]!> but was:<#[VALUE]!>
  Run 5: TestTwoOperandNumericFunctionsFromSpreadsheet>BaseTestFunctionsFromSpreadsheet.processFunctionRow:157 In TwoOperandNumericFunctionTestCaseData.xls TwoArgNumericFunctions!B42 {=POWER(E9:E16,E9:E16)} 'POWER(E9:E16,E9:E16)' expected:<#[REF]!> but was:<#[VALUE]!>
  Run 6: PASS
  Run 7: TestTwoOperandNumericFunctionsFromSpreadsheet>BaseTestFunctionsFromSpreadsheet.processFunctionRow:164 In TwoOperandNumericFunctionTestCaseData.xls TwoArgNumericFunctions!B44 {=POWER(E9:E16,E9:E16)} 'POWER(E9:E16,E9:E16)'. Actual: ERROR


Tests run: 6789, Failures: 2, Errors: 0, Skipped: 800

[INFO] ------------------------------------------------------------------------
[INFO] Reactor Summary:
[INFO]
[INFO] Apache POI - the Java API for Microsoft Documents . SUCCESS [  0.002 s]
[INFO] Apache POI Main package ........................... FAILURE [01:01 min]
[INFO] Apache POI Scratchpad package ..................... SKIPPED
[INFO] Apache POI - Openxmlformats Schema package ........ SKIPPED
[INFO] Apache POI - Openxmlformats Encryption Schema package  SKIPPED
[INFO] Apache POI - Openxmlformats Security-Schema package  SKIPPED
[INFO] Apache POI OOXML package .......................... SKIPPED
[INFO] Apache POI ExcelAnt package ....................... SKIPPED
[INFO] Apache POI Examples package ....................... SKIPPED
[INFO] ------------------------------------------------------------------------
[INFO] BUILD FAILURE
[INFO] ------------------------------------------------------------------------
[INFO] Total time: 01:01 min
[INFO] Finished at: 2019-01-08T16:06:48+00:00
[INFO] Final Memory: 30M/804M
[INFO] ------------------------------------------------------------------------
[ERROR] Failed to execute goal org.apache.maven.plugins:maven-surefire-plugin:2.19.1:test (default-test) on project poi-main: There are test failures.
[ERROR]
[ERROR] Please refer to <https://builds.apache.org/job/POI-DSL-Maven/ws/sonar/main/target/surefire-reports> for the individual test results.
[ERROR] -> [Help 1]
[ERROR]
[ERROR] To see the full stack trace of the errors, re-run Maven with the -e switch.
[ERROR] Re-run Maven using the -X switch to enable full debug logging.
[ERROR]
[ERROR] For more information about the errors and possible solutions, please read the following articles:
[ERROR] [Help 1] http://cwiki.apache.org/confluence/display/MAVEN/MojoFailureException
[ERROR]
[ERROR] After correcting the problems, you can resume the build with the command
[ERROR]   mvn <goals> -rf :poi-main
Build step 'Invoke top-level Maven targets' marked build as failure
Recording test results

---------------------------------------------------------------------
To unsubscribe, e-mail: [hidden email]
For additional commands, e-mail: [hidden email]

Reply | Threaded
Open this post in threaded view
|

Jenkins build is back to normal : POI-DSL-Maven #774

Apache Jenkins Server
See <https://builds.apache.org/job/POI-DSL-Maven/774/display/redirect?page=changes>


---------------------------------------------------------------------
To unsubscribe, e-mail: [hidden email]
For additional commands, e-mail: [hidden email]