Build failed in Jenkins: POI-DSL-Maven #450

classic Classic list List threaded Threaded
2 messages Options
Reply | Threaded
Open this post in threaded view
|

Build failed in Jenkins: POI-DSL-Maven #450

Apache Jenkins Server
See <https://builds.apache.org/job/POI-DSL-Maven/450/display/redirect?page=changes>

Changes:

[tallison] related to Bug 61991 -- include docx in test suite to trigger inclusion of CTPictureBase

------------------------------------------
[...truncated 1.64 MB...]
             .stk                      = 4
             .istdBase                 = 4095
        .info3                =  (193 )
             .cupx                     = 1
             .istdNext                 = 12
        .bchUpe               =  (40 )
        .grfstd               =  (3328 )
             .fAutoRedef               = false
             .fHidden                  = false
             .f97LidsSet               = false
             .fCopyLang                = false
             .fPersonalCompose         = false
             .fPersonalReply           = false
             .fPersonal                = false
             .fNoHtmlExport            = false
             .fSemiHidden              = true
             .fLocked                  = false
             .fInternalUse             = true
             .fUnhideWhenUsed          = true
             .fQFormat                 = false
             .fReserved                = 0
    [/StdfBase]
   
    StdfPost2000: [StdfPost2000]
        .info1                =  (0 )
             .istdLink                 = 0
             .fHasOriginalStyle        = false
             .fSpare                   = 0
        .rsid                 =  (0 )
        .info3                =  (0 )
             .iftcHtml                 = 0
             .unused                   = false
             .iPriority                = 0
    [/StdfPost2000]
   
    UPX: [UPX] [12, 0]
Tests run: 2, Failures: 0, Errors: 0, Skipped: 0, Time elapsed: 0.042 sec - in org.apache.poi.hwpf.dev.TestHWPFLister
Running org.apache.poi.hwpf.TestHWPFPictures
Tests run: 6, Failures: 0, Errors: 0, Skipped: 0, Time elapsed: 0.095 sec - in org.apache.poi.hwpf.TestHWPFPictures
Running org.apache.poi.hwpf.model.TestFontTable
Tests run: 1, Failures: 0, Errors: 0, Skipped: 0, Time elapsed: 0 sec - in org.apache.poi.hwpf.model.TestFontTable
Running org.apache.poi.hwpf.model.TestSectionTable
Tests run: 1, Failures: 0, Errors: 0, Skipped: 0, Time elapsed: 0 sec - in org.apache.poi.hwpf.model.TestSectionTable
Running org.apache.poi.hwpf.model.TestRevisionMarkAuthorTable
Tests run: 3, Failures: 0, Errors: 0, Skipped: 0, Time elapsed: 0.011 sec - in org.apache.poi.hwpf.model.TestRevisionMarkAuthorTable
Running org.apache.poi.hwpf.model.TestFileInformationBlock
Tests run: 1, Failures: 0, Errors: 0, Skipped: 0, Time elapsed: 0.002 sec - in org.apache.poi.hwpf.model.TestFileInformationBlock
Running org.apache.poi.hwpf.model.TestNotesTables
Tests run: 1, Failures: 0, Errors: 0, Skipped: 0, Time elapsed: 0.001 sec - in org.apache.poi.hwpf.model.TestNotesTables
Running org.apache.poi.hwpf.model.TestStyleSheet
Tests run: 2, Failures: 0, Errors: 0, Skipped: 0, Time elapsed: 0.002 sec - in org.apache.poi.hwpf.model.TestStyleSheet
Running org.apache.poi.hwpf.model.TestTextPieceTable
Tests run: 4, Failures: 0, Errors: 0, Skipped: 0, Time elapsed: 0.015 sec - in org.apache.poi.hwpf.model.TestTextPieceTable
Running org.apache.poi.hwpf.model.TestPlexOfCps
Tests run: 1, Failures: 0, Errors: 0, Skipped: 0, Time elapsed: 0.001 sec - in org.apache.poi.hwpf.model.TestPlexOfCps
Running org.apache.poi.hwpf.model.TestListTables
Tests run: 1, Failures: 0, Errors: 0, Skipped: 0, Time elapsed: 0 sec - in org.apache.poi.hwpf.model.TestListTables
Running org.apache.poi.hwpf.model.PlfLfoTest
Tests run: 2, Failures: 0, Errors: 0, Skipped: 0, Time elapsed: 0 sec - in org.apache.poi.hwpf.model.PlfLfoTest
Running org.apache.poi.hwpf.model.TestCHPBinTable
Tests run: 1, Failures: 0, Errors: 0, Skipped: 0, Time elapsed: 0 sec - in org.apache.poi.hwpf.model.TestCHPBinTable
Running org.apache.poi.hwpf.model.TestPAPBinTable
Tests run: 2, Failures: 0, Errors: 0, Skipped: 0, Time elapsed: 0.042 sec - in org.apache.poi.hwpf.model.TestPAPBinTable
Running org.apache.poi.hwpf.model.TestDocumentProperties
Tests run: 1, Failures: 0, Errors: 0, Skipped: 0, Time elapsed: 0.001 sec - in org.apache.poi.hwpf.model.TestDocumentProperties
Running org.apache.poi.hwpf.model.types.LVLFAbstractTypeTest
Tests run: 1, Failures: 0, Errors: 0, Skipped: 0, Time elapsed: 0 sec - in org.apache.poi.hwpf.model.types.LVLFAbstractTypeTest
Running org.apache.poi.hwpf.model.types.LFOLVLBaseAbstractTypeTest
Tests run: 1, Failures: 0, Errors: 0, Skipped: 0, Time elapsed: 0 sec - in org.apache.poi.hwpf.model.types.LFOLVLBaseAbstractTypeTest
Running org.apache.poi.hwpf.model.TestSavedByTable
Tests run: 1, Failures: 0, Errors: 0, Skipped: 0, Time elapsed: 0.03 sec - in org.apache.poi.hwpf.model.TestSavedByTable
Running org.apache.poi.hwpf.model.TestBookmarksTables
Tests run: 5, Failures: 0, Errors: 0, Skipped: 0, Time elapsed: 0.007 sec - in org.apache.poi.hwpf.model.TestBookmarksTables
Running org.apache.poi.hwpf.extractor.TestWordExtractorBugs
Tests run: 3, Failures: 0, Errors: 0, Skipped: 0, Time elapsed: 0.509 sec - in org.apache.poi.hwpf.extractor.TestWordExtractorBugs
Running org.apache.poi.hwpf.extractor.TestDifferentRoutes
Tests run: 2, Failures: 0, Errors: 0, Skipped: 0, Time elapsed: 0.005 sec - in org.apache.poi.hwpf.extractor.TestDifferentRoutes
Running org.apache.poi.hwpf.extractor.TestWordExtractor
Tests run: 18, Failures: 0, Errors: 0, Skipped: 0, Time elapsed: 0.088 sec - in org.apache.poi.hwpf.extractor.TestWordExtractor
Running org.apache.poi.hwpf.TestHWPFRangeParts
Tests run: 2, Failures: 0, Errors: 0, Skipped: 0, Time elapsed: 0.007 sec - in org.apache.poi.hwpf.TestHWPFRangeParts
Running org.apache.poi.hwpf.TestFieldsTables
Tests run: 1, Failures: 0, Errors: 0, Skipped: 0, Time elapsed: 0.001 sec - in org.apache.poi.hwpf.TestFieldsTables
Running org.apache.poi.hwpf.usermodel.TestRangeSymbols
Tests run: 2, Failures: 0, Errors: 0, Skipped: 0, Time elapsed: 0.001 sec - in org.apache.poi.hwpf.usermodel.TestRangeSymbols
Running org.apache.poi.hwpf.usermodel.TestProblems
Tests run: 10, Failures: 0, Errors: 0, Skipped: 0, Time elapsed: 0.031 sec - in org.apache.poi.hwpf.usermodel.TestProblems
Running org.apache.poi.hwpf.usermodel.TestBug46610
Tests run: 3, Failures: 0, Errors: 0, Skipped: 0, Time elapsed: 0.015 sec - in org.apache.poi.hwpf.usermodel.TestBug46610
Running org.apache.poi.hwpf.usermodel.TestBug49820
Tests run: 1, Failures: 0, Errors: 0, Skipped: 0, Time elapsed: 0.001 sec - in org.apache.poi.hwpf.usermodel.TestBug49820
Running org.apache.poi.hwpf.usermodel.TestBug50075
Tests run: 1, Failures: 0, Errors: 0, Skipped: 0, Time elapsed: 0.001 sec - in org.apache.poi.hwpf.usermodel.TestBug50075
Running org.apache.poi.hwpf.usermodel.TestRangeInsertion
Tests run: 3, Failures: 0, Errors: 0, Skipped: 0, Time elapsed: 0.002 sec - in org.apache.poi.hwpf.usermodel.TestRangeInsertion
Running org.apache.poi.hwpf.usermodel.TestLists
Tests run: 7, Failures: 0, Errors: 0, Skipped: 0, Time elapsed: 0.011 sec - in org.apache.poi.hwpf.usermodel.TestLists
Running org.apache.poi.hwpf.usermodel.TestOfficeDrawings
Tests run: 1, Failures: 0, Errors: 0, Skipped: 0, Time elapsed: 0.002 sec - in org.apache.poi.hwpf.usermodel.TestOfficeDrawings
Running org.apache.poi.hwpf.usermodel.TestBugs
Tests run: 39, Failures: 0, Errors: 0, Skipped: 0, Time elapsed: 0.584 sec - in org.apache.poi.hwpf.usermodel.TestBugs
Running org.apache.poi.hwpf.usermodel.TestHeaderStories
Tests run: 8, Failures: 0, Errors: 0, Skipped: 0, Time elapsed: 0.039 sec - in org.apache.poi.hwpf.usermodel.TestHeaderStories
Running org.apache.poi.hwpf.usermodel.TestPictures
Tests run: 16, Failures: 0, Errors: 0, Skipped: 2, Time elapsed: 0.038 sec - in org.apache.poi.hwpf.usermodel.TestPictures
Running org.apache.poi.hwpf.usermodel.TestRange
Tests run: 2, Failures: 0, Errors: 0, Skipped: 0, Time elapsed: 0.001 sec - in org.apache.poi.hwpf.usermodel.TestRange
Running org.apache.poi.hwpf.usermodel.TestHWPFOldDocument
Tests run: 12, Failures: 0, Errors: 0, Skipped: 0, Time elapsed: 0.06 sec - in org.apache.poi.hwpf.usermodel.TestHWPFOldDocument
Running org.apache.poi.hwpf.usermodel.TestRangeReplacement
Tests run: 4, Failures: 0, Errors: 0, Skipped: 0, Time elapsed: 0.002 sec - in org.apache.poi.hwpf.usermodel.TestRangeReplacement
Running org.apache.poi.hwpf.usermodel.TestBug47563
row 0
column 0, num paragraphs 1
column 1, num paragraphs 1
column 2, num paragraphs 1
column 3, num paragraphs 1
column 4, num paragraphs 1
row 0
column 0, num paragraphs 1
column 1, num paragraphs 1
column 2, num paragraphs 1
column 3, num paragraphs 1
column 4, num paragraphs 1
column 5, num paragraphs 1
row 0
column 0, num paragraphs 1
row 1
column 0, num paragraphs 1
row 2
column 0, num paragraphs 1
row 3
column 0, num paragraphs 1
row 4
column 0, num paragraphs 1
row 0
column 0, num paragraphs 1
row 1
column 0, num paragraphs 1
row 2
column 0, num paragraphs 1
row 3
column 0, num paragraphs 1
row 4
column 0, num paragraphs 1
row 5
column 0, num paragraphs 1
row 0
column 0, num paragraphs 1
column 1, num paragraphs 1
row 1
column 0, num paragraphs 1
column 1, num paragraphs 1
row 0
column 0, num paragraphs 1
column 1, num paragraphs 1
row 1
column 0, num paragraphs 1
column 1, num paragraphs 1
row 2
column 0, num paragraphs 1
column 1, num paragraphs 1
row 0
column 0, num paragraphs 1
column 1, num paragraphs 1
column 2, num paragraphs 1
row 1
column 0, num paragraphs 1
column 1, num paragraphs 1
column 2, num paragraphs 1
row 0
column 0, num paragraphs 1
column 1, num paragraphs 1
column 2, num paragraphs 1
row 1
column 0, num paragraphs 1
column 1, num paragraphs 1
column 2, num paragraphs 1
row 2
column 0, num paragraphs 1
column 1, num paragraphs 1
column 2, num paragraphs 1
Tests run: 1, Failures: 0, Errors: 0, Skipped: 0, Time elapsed: 0.027 sec - in org.apache.poi.hwpf.usermodel.TestBug47563
Running org.apache.poi.hwpf.usermodel.TestHWPFWrite
Tests run: 6, Failures: 0, Errors: 0, Skipped: 0, Time elapsed: 0.013 sec - in org.apache.poi.hwpf.usermodel.TestHWPFWrite
Running org.apache.poi.hwpf.usermodel.TestBorderCode
Tests run: 1, Failures: 0, Errors: 0, Skipped: 0, Time elapsed: 0 sec - in org.apache.poi.hwpf.usermodel.TestBorderCode
Running org.apache.poi.hwpf.usermodel.TestRangeProperties
Tests run: 5, Failures: 0, Errors: 0, Skipped: 0, Time elapsed: 0.006 sec - in org.apache.poi.hwpf.usermodel.TestRangeProperties
Running org.apache.poi.hwpf.usermodel.TestRangeDelete
Tests run: 4, Failures: 0, Errors: 0, Skipped: 0, Time elapsed: 0.002 sec - in org.apache.poi.hwpf.usermodel.TestRangeDelete
Running org.apache.poi.hwpf.usermodel.TestTableRow
Tests run: 2, Failures: 0, Errors: 0, Skipped: 0, Time elapsed: 0.001 sec - in org.apache.poi.hwpf.usermodel.TestTableRow
Running org.apache.poi.hwpf.sprm.TableSprmUncompressorTest
Tests run: 1, Failures: 0, Errors: 0, Skipped: 0, Time elapsed: 0 sec - in org.apache.poi.hwpf.sprm.TableSprmUncompressorTest
Running org.apache.poi.hwpf.sprm.TestSprms
Tests run: 2, Failures: 0, Errors: 0, Skipped: 0, Time elapsed: 0.005 sec - in org.apache.poi.hwpf.sprm.TestSprms
Running org.apache.poi.hwpf.converter.TestWordToTextConverter
Tests run: 3, Failures: 0, Errors: 0, Skipped: 0, Time elapsed: 0.068 sec - in org.apache.poi.hwpf.converter.TestWordToTextConverter
Running org.apache.poi.hwpf.converter.AbstractWordUtilsTest
Tests run: 1, Failures: 0, Errors: 0, Skipped: 0, Time elapsed: 0.001 sec - in org.apache.poi.hwpf.converter.AbstractWordUtilsTest
Running org.apache.poi.hwpf.converter.TestWordToFoConverter
Tests run: 8, Failures: 0, Errors: 0, Skipped: 0, Time elapsed: 0.08 sec - in org.apache.poi.hwpf.converter.TestWordToFoConverter
Running org.apache.poi.hwpf.converter.TestWordToHtmlConverter
Tests run: 21, Failures: 0, Errors: 0, Skipped: 0, Time elapsed: 0.234 sec - in org.apache.poi.hwpf.converter.TestWordToHtmlConverter
Running org.apache.poi.hwpf.converter.TestNumberFormatter
Tests run: 2, Failures: 0, Errors: 0, Skipped: 0, Time elapsed: 0.077 sec - in org.apache.poi.hwpf.converter.TestNumberFormatter

Results :

Tests in error:
  TestPicture.macImages:150 » IIO Can't create cache file!

Tests run: 794, Failures: 0, Errors: 1, Skipped: 10

[INFO] ------------------------------------------------------------------------
[INFO] Reactor Summary:
[INFO]
[INFO] Apache POI - the Java API for Microsoft Documents . SUCCESS [  0.003 s]
[INFO] Apache POI Main package ........................... SUCCESS [01:57 min]
[INFO] Apache POI Scratchpad package ..................... FAILURE [ 16.591 s]
[INFO] Apache POI - Openxmlformats Schema package ........ SKIPPED
[INFO] Apache POI - Openxmlformats Encryption Schema package  SKIPPED
[INFO] Apache POI - Openxmlformats Security-Schema package  SKIPPED
[INFO] Apache POI OOXML package .......................... SKIPPED
[INFO] Apache POI ExcelAnt package ....................... SKIPPED
[INFO] Apache POI Examples package ....................... SKIPPED
[INFO] ------------------------------------------------------------------------
[INFO] BUILD FAILURE
[INFO] ------------------------------------------------------------------------
[INFO] Total time: 02:14 min
[INFO] Finished at: 2018-01-23T20:13:29+00:00
[INFO] Final Memory: 38M/850M
[INFO] ------------------------------------------------------------------------
[ERROR] Failed to execute goal org.apache.maven.plugins:maven-surefire-plugin:2.19.1:test (default-test) on project poi-scratchpad: There are test failures.
[ERROR]
[ERROR] Please refer to <https://builds.apache.org/job/POI-DSL-Maven/ws/sonar/scratchpad/target/surefire-reports> for the individual test results.
[ERROR] -> [Help 1]
[ERROR]
[ERROR] To see the full stack trace of the errors, re-run Maven with the -e switch.
[ERROR] Re-run Maven using the -X switch to enable full debug logging.
[ERROR]
[ERROR] For more information about the errors and possible solutions, please read the following articles:
[ERROR] [Help 1] http://cwiki.apache.org/confluence/display/MAVEN/MojoFailureException
[ERROR]
[ERROR] After correcting the problems, you can resume the build with the command
[ERROR]   mvn <goals> -rf :poi-scratchpad
Build step 'Invoke top-level Maven targets' marked build as failure
Recording test results

---------------------------------------------------------------------
To unsubscribe, e-mail: [hidden email]
For additional commands, e-mail: [hidden email]

Reply | Threaded
Open this post in threaded view
|

Jenkins build is back to normal : POI-DSL-Maven #451

Apache Jenkins Server
See <https://builds.apache.org/job/POI-DSL-Maven/451/display/redirect?page=changes>


---------------------------------------------------------------------
To unsubscribe, e-mail: [hidden email]
For additional commands, e-mail: [hidden email]