Build failed in Jenkins: POI-DSL-Maven #437

classic Classic list List threaded Threaded
2 messages Options
Reply | Threaded
Open this post in threaded view
|

Build failed in Jenkins: POI-DSL-Maven #437

Apache Jenkins Server
See <https://builds.apache.org/job/POI-DSL-Maven/437/display/redirect?page=changes>

Changes:

[centic] Bug 61665: Enhance SSPerformanceTest some more to add a warmup run and allow to run with unsynchronized XmlBeans

[centic] Bug 61665: Update FAQ for performance test slightly

[centic] Update changelog

[centic] Fix bug 61787, which was introduced by bug 58067: Change how deleted content is detected to not incorrectly see too much text as deleted.

[centic] Bug 61798: Fix usage of getLastCellNum(), unfortunately this is a bit misleading compared to getFirstCellNum()...

[centic] Bug 61911: Avoid IndexOutOfBounds access when reading pictures

[centic] Fix IntelliJ warnings and code formatting, generalize ExcelToHtmlUtils, use try-with-resources, update/enhance JavaDoc somewhat

[gwoolsey] Added a couple missing null checks.

------------------------------------------
[...truncated 1.16 MB...]
Tests run: 1, Failures: 0, Errors: 0, Skipped: 0, Time elapsed: 0 sec - in org.apache.poi.xssf.usermodel.extensions.TestXSSFSheetComments
Running org.apache.poi.xssf.usermodel.TestXSSFSimpleShape
Tests run: 1, Failures: 0, Errors: 0, Skipped: 0, Time elapsed: 0.015 sec - in org.apache.poi.xssf.usermodel.TestXSSFSimpleShape
Running org.apache.poi.xssf.usermodel.TestXSSFDialogSheet
Tests run: 14, Failures: 0, Errors: 0, Skipped: 0, Time elapsed: 0.031 sec - in org.apache.poi.xssf.usermodel.TestXSSFDialogSheet
Running org.apache.poi.xssf.usermodel.TestXSSFChart
Tests run: 3, Failures: 0, Errors: 0, Skipped: 0, Time elapsed: 0.072 sec - in org.apache.poi.xssf.usermodel.TestXSSFChart
Running org.apache.poi.xssf.usermodel.TestSheetHiding
Tests run: 5, Failures: 0, Errors: 0, Skipped: 0, Time elapsed: 0.071 sec - in org.apache.poi.xssf.usermodel.TestSheetHiding
Running org.apache.poi.xssf.usermodel.TestXSSFEvaluationSheet
Tests run: 1, Failures: 0, Errors: 0, Skipped: 0, Time elapsed: 0.001 sec - in org.apache.poi.xssf.usermodel.TestXSSFEvaluationSheet
Running org.apache.poi.xssf.usermodel.TestXSSFTextRun
Tests run: 1, Failures: 0, Errors: 0, Skipped: 0, Time elapsed: 0.013 sec - in org.apache.poi.xssf.usermodel.TestXSSFTextRun
Running org.apache.poi.xssf.usermodel.TestXSSFBugs
Tests run: 140, Failures: 0, Errors: 0, Skipped: 8, Time elapsed: 12.103 sec - in org.apache.poi.xssf.usermodel.TestXSSFBugs
Running org.apache.poi.xssf.usermodel.TestTableStyles
Tests run: 2, Failures: 0, Errors: 0, Skipped: 0, Time elapsed: 0.292 sec - in org.apache.poi.xssf.usermodel.TestTableStyles
Running org.apache.poi.xssf.usermodel.TestSXSSFBugs
Tests run: 39, Failures: 0, Errors: 0, Skipped: 8, Time elapsed: 5.902 sec - in org.apache.poi.xssf.usermodel.TestSXSSFBugs
Running org.apache.poi.xssf.usermodel.TestXSSFPivotTableName
Tests run: 18, Failures: 0, Errors: 0, Skipped: 0, Time elapsed: 0.331 sec - in org.apache.poi.xssf.usermodel.TestXSSFPivotTableName
Running org.apache.poi.xssf.usermodel.TestXSSFRichTextString
Tests run: 18, Failures: 0, Errors: 0, Skipped: 0, Time elapsed: 0.034 sec - in org.apache.poi.xssf.usermodel.TestXSSFRichTextString
Running org.apache.poi.xssf.usermodel.TestXSSFOddHeader
Tests run: 1, Failures: 0, Errors: 0, Skipped: 0, Time elapsed: 0.003 sec - in org.apache.poi.xssf.usermodel.TestXSSFOddHeader
Running org.apache.poi.xssf.usermodel.TestXSSFExternalFunctions
Tests run: 2, Failures: 0, Errors: 0, Skipped: 0, Time elapsed: 0.008 sec - in org.apache.poi.xssf.usermodel.TestXSSFExternalFunctions
Running org.apache.poi.xssf.usermodel.TestXSSFDataValidation
Tests run: 7, Failures: 0, Errors: 0, Skipped: 0, Time elapsed: 0.426 sec - in org.apache.poi.xssf.usermodel.TestXSSFDataValidation
Running org.apache.poi.xssf.usermodel.TestXSSFFont
Tests run: 22, Failures: 0, Errors: 0, Skipped: 0, Time elapsed: 0.042 sec - in org.apache.poi.xssf.usermodel.TestXSSFFont
Running org.apache.poi.xssf.usermodel.TestMultiSheetFormulaEvaluatorOnXSSF
Tests run: 2, Failures: 0, Errors: 0, Skipped: 0, Time elapsed: 0.002 sec - in org.apache.poi.xssf.usermodel.TestMultiSheetFormulaEvaluatorOnXSSF
Running org.apache.poi.xssf.usermodel.helpers.TestHeaderFooterHelper
Tests run: 2, Failures: 0, Errors: 0, Skipped: 0, Time elapsed: 0 sec - in org.apache.poi.xssf.usermodel.helpers.TestHeaderFooterHelper
Running org.apache.poi.xssf.usermodel.helpers.TestColumnHelper
Tests run: 15, Failures: 0, Errors: 0, Skipped: 0, Time elapsed: 0.023 sec - in org.apache.poi.xssf.usermodel.helpers.TestColumnHelper
Running org.apache.poi.xssf.usermodel.TestXSSFForkedEvaluator
Tests run: 2, Failures: 0, Errors: 0, Skipped: 0, Time elapsed: 0.012 sec - in org.apache.poi.xssf.usermodel.TestXSSFForkedEvaluator
Running org.apache.poi.xssf.usermodel.TestXSSFSheetAutosizeColumn
Tests run: 7, Failures: 0, Errors: 0, Skipped: 0, Time elapsed: 0.061 sec - in org.apache.poi.xssf.usermodel.TestXSSFSheetAutosizeColumn
Running org.apache.poi.xssf.usermodel.TestFormulaEvaluatorOnXSSF
Tests run: 369, Failures: 0, Errors: 0, Skipped: 90, Time elapsed: 0.262 sec - in org.apache.poi.xssf.usermodel.TestFormulaEvaluatorOnXSSF
Running org.apache.poi.xssf.usermodel.TestXSSFSheet
Tests run: 95, Failures: 0, Errors: 0, Skipped: 0, Time elapsed: 3.597 sec - in org.apache.poi.xssf.usermodel.TestXSSFSheet
Running org.apache.poi.xssf.model.TestCalculationChain
Tests run: 1, Failures: 0, Errors: 0, Skipped: 0, Time elapsed: 0.343 sec - in org.apache.poi.xssf.model.TestCalculationChain
Running org.apache.poi.xssf.model.TestSharedStringsTable
Tests run: 4, Failures: 0, Errors: 0, Skipped: 0, Time elapsed: 0.076 sec - in org.apache.poi.xssf.model.TestSharedStringsTable
Running org.apache.poi.xssf.model.TestThemesTable
Tests run: 3, Failures: 0, Errors: 0, Skipped: 0, Time elapsed: 0.085 sec - in org.apache.poi.xssf.model.TestThemesTable
Running org.apache.poi.xssf.model.TestCommentsTable
Tests run: 7, Failures: 0, Errors: 0, Skipped: 0, Time elapsed: 0.065 sec - in org.apache.poi.xssf.model.TestCommentsTable
Running org.apache.poi.xssf.model.TestExternalLinksTable
Tests run: 4, Failures: 0, Errors: 0, Skipped: 0, Time elapsed: 0.035 sec - in org.apache.poi.xssf.model.TestExternalLinksTable
Running org.apache.poi.xssf.model.TestStylesTable
Tests run: 13, Failures: 0, Errors: 0, Skipped: 0, Time elapsed: 0.144 sec - in org.apache.poi.xssf.model.TestStylesTable
Running org.apache.poi.xssf.model.TestMapInfo
Tests run: 1, Failures: 0, Errors: 0, Skipped: 0, Time elapsed: 0.022 sec - in org.apache.poi.xssf.model.TestMapInfo
Running org.apache.poi.xssf.TestWorkbookProtection
Tests run: 8, Failures: 0, Errors: 0, Skipped: 0, Time elapsed: 0.516 sec - in org.apache.poi.xssf.TestWorkbookProtection
Running org.apache.poi.xssf.extractor.TestXSSFEventBasedExcelExtractor
Tests run: 12, Failures: 0, Errors: 0, Skipped: 0, Time elapsed: 0.306 sec - in org.apache.poi.xssf.extractor.TestXSSFEventBasedExcelExtractor
Running org.apache.poi.xssf.extractor.TestXSSFExportToXML
Tests run: 17, Failures: 0, Errors: 0, Skipped: 1, Time elapsed: 0.278 sec - in org.apache.poi.xssf.extractor.TestXSSFExportToXML
Running org.apache.poi.xssf.extractor.TestXSSFEventBasedExcelExtractorUsingFactory
Tests run: 12, Failures: 0, Errors: 0, Skipped: 0, Time elapsed: 0.212 sec - in org.apache.poi.xssf.extractor.TestXSSFEventBasedExcelExtractorUsingFactory
Running org.apache.poi.xssf.extractor.TestXSSFExcelExtractor
Tests run: 8, Failures: 0, Errors: 0, Skipped: 0, Time elapsed: 0.361 sec - in org.apache.poi.xssf.extractor.TestXSSFExcelExtractor
Running org.apache.poi.xssf.extractor.TestXSSFBEventBasedExcelExtractor
Tests run: 3, Failures: 0, Errors: 0, Skipped: 0, Time elapsed: 0.019 sec - in org.apache.poi.xssf.extractor.TestXSSFBEventBasedExcelExtractor
Running org.apache.poi.xssf.extractor.TestXSSFExcelExtractorUsingFactory
Tests run: 8, Failures: 0, Errors: 0, Skipped: 0, Time elapsed: 0.268 sec - in org.apache.poi.xssf.extractor.TestXSSFExcelExtractorUsingFactory
Running org.apache.poi.xssf.extractor.TestXSSFImportFromXML
Tests run: 5, Failures: 0, Errors: 0, Skipped: 0, Time elapsed: 5.71 sec - in org.apache.poi.xssf.extractor.TestXSSFImportFromXML
Running org.apache.poi.ss.util.TestXSSFPropertyTemplate
Tests run: 2, Failures: 0, Errors: 0, Skipped: 0, Time elapsed: 0.104 sec - in org.apache.poi.ss.util.TestXSSFPropertyTemplate
Running org.apache.poi.ss.util.TestXSSFCellUtil
Tests run: 13, Failures: 0, Errors: 0, Skipped: 0, Time elapsed: 0.058 sec - in org.apache.poi.ss.util.TestXSSFCellUtil
Running org.apache.poi.ss.util.TestSXSSFCellUtil
Tests run: 13, Failures: 0, Errors: 0, Skipped: 0, Time elapsed: 0.055 sec - in org.apache.poi.ss.util.TestSXSSFCellUtil
Running org.apache.poi.ss.format.TestCellFormatPart
Tests run: 6, Failures: 0, Errors: 0, Skipped: 0, Time elapsed: 0.306 sec - in org.apache.poi.ss.format.TestCellFormatPart
Running org.apache.poi.ss.formula.TestFormulaParser
Tests run: 9, Failures: 0, Errors: 0, Skipped: 0, Time elapsed: 0.035 sec - in org.apache.poi.ss.formula.TestFormulaParser
Running org.apache.poi.ss.formula.functions.TestVlookup
Tests run: 1, Failures: 0, Errors: 0, Skipped: 0, Time elapsed: 17.92 sec - in org.apache.poi.ss.formula.functions.TestVlookup
Running org.apache.poi.ss.formula.functions.TestProper
Tests run: 4, Failures: 0, Errors: 0, Skipped: 0, Time elapsed: 1.657 sec - in org.apache.poi.ss.formula.functions.TestProper
Running org.apache.poi.ss.formula.functions.TestSumifsXSSF
Tests run: 1, Failures: 0, Errors: 0, Skipped: 0, Time elapsed: 0.011 sec - in org.apache.poi.ss.formula.functions.TestSumifsXSSF
Running org.apache.poi.ss.formula.TestStructuredReferences
Tests run: 2, Failures: 0, Errors: 0, Skipped: 0, Time elapsed: 0.013 sec - in org.apache.poi.ss.formula.TestStructuredReferences
Running org.apache.poi.ss.formula.eval.TestXSSFCircularReferences
Tests run: 4, Failures: 0, Errors: 0, Skipped: 0, Time elapsed: 0.06 sec - in org.apache.poi.ss.formula.eval.TestXSSFCircularReferences
Running org.apache.poi.ss.usermodel.TestEmbedOLEPackage
Tests run: 2, Failures: 0, Errors: 0, Skipped: 0, Time elapsed: 0.054 sec - in org.apache.poi.ss.usermodel.TestEmbedOLEPackage
Running org.apache.poi.ss.usermodel.ConditionalFormattingEvalTest
Tests run: 5, Failures: 0, Errors: 0, Skipped: 0, Time elapsed: 0.717 sec - in org.apache.poi.ss.usermodel.ConditionalFormattingEvalTest
Running org.apache.poi.ss.usermodel.TestXSSFBorderStyle
Tests run: 1, Failures: 0, Errors: 0, Skipped: 0, Time elapsed: 0.007 sec - in org.apache.poi.ss.usermodel.TestXSSFBorderStyle
Running org.apache.poi.ss.extractor.TestEmbeddedExtractor
Tests run: 3, Failures: 0, Errors: 0, Skipped: 0, Time elapsed: 0.236 sec - in org.apache.poi.ss.extractor.TestEmbeddedExtractor
Running org.apache.poi.ss.TestWorkbookFactory
Tests run: 8, Failures: 0, Errors: 0, Skipped: 0, Time elapsed: 0.291 sec - in org.apache.poi.ss.TestWorkbookFactory
Running org.apache.poi.TestPOIXMLDocument
Tests run: 10, Failures: 0, Errors: 0, Skipped: 0, Time elapsed: 1.731 sec - in org.apache.poi.TestPOIXMLDocument
Running org.apache.poi.dev.TestOOXMLLister
Tests run: 2, Failures: 0, Errors: 0, Skipped: 0, Time elapsed: 0.008 sec - in org.apache.poi.dev.TestOOXMLLister
Running org.apache.poi.dev.TestOOXMLPrettyPrint
Tests run: 1, Failures: 0, Errors: 0, Skipped: 0, Time elapsed: 0.038 sec - in org.apache.poi.dev.TestOOXMLPrettyPrint
Running org.apache.poi.dev.TestRecordGenerator
Tests run: 3, Failures: 0, Errors: 0, Skipped: 3, Time elapsed: 0 sec - in org.apache.poi.dev.TestRecordGenerator
Running org.apache.poi.TestDetectAsOOXML
Tests run: 3, Failures: 0, Errors: 0, Skipped: 0, Time elapsed: 0.005 sec - in org.apache.poi.TestDetectAsOOXML
Running org.apache.poi.extractor.TestExtractorFactory
Tests run: 11, Failures: 0, Errors: 0, Skipped: 0, Time elapsed: 0.735 sec - in org.apache.poi.extractor.TestExtractorFactory
Running org.apache.poi.openxml4j.opc.TestListParts
Tests run: 1, Failures: 0, Errors: 0, Skipped: 0, Time elapsed: 0.004 sec - in org.apache.poi.openxml4j.opc.TestListParts
Running org.apache.poi.openxml4j.opc.TestPackage
Tests run: 23, Failures: 0, Errors: 0, Skipped: 1, Time elapsed: 0.666 sec - in org.apache.poi.openxml4j.opc.TestPackage
Running org.apache.poi.openxml4j.opc.TestRelationships
Tests run: 9, Failures: 0, Errors: 0, Skipped: 0, Time elapsed: 0.057 sec - in org.apache.poi.openxml4j.opc.TestRelationships
Running org.apache.poi.openxml4j.opc.TestPackagingURIHelper
Tests run: 5, Failures: 0, Errors: 0, Skipped: 0, Time elapsed: 0.001 sec - in org.apache.poi.openxml4j.opc.TestPackagingURIHelper
Running org.apache.poi.openxml4j.opc.internal.TestContentTypeManager
Tests run: 4, Failures: 0, Errors: 0, Skipped: 2, Time elapsed: 0.003 sec - in org.apache.poi.openxml4j.opc.internal.TestContentTypeManager
Running org.apache.poi.openxml4j.opc.internal.marshallers.TestZipPackagePropertiesMarshaller
Tests run: 4, Failures: 0, Errors: 0, Skipped: 0, Time elapsed: 0.001 sec - in org.apache.poi.openxml4j.opc.internal.marshallers.TestZipPackagePropertiesMarshaller
Running org.apache.poi.openxml4j.opc.TestPackageCoreProperties
Tests run: 7, Failures: 0, Errors: 0, Skipped: 0, Time elapsed: 0.048 sec - in org.apache.poi.openxml4j.opc.TestPackageCoreProperties
Running org.apache.poi.openxml4j.opc.TestZipPackage
Tests run: 8, Failures: 0, Errors: 0, Skipped: 0, Time elapsed: 0.675 sec - in org.apache.poi.openxml4j.opc.TestZipPackage
Running org.apache.poi.openxml4j.opc.TestPackageThumbnail
Tests run: 1, Failures: 0, Errors: 0, Skipped: 0, Time elapsed: 0.015 sec - in org.apache.poi.openxml4j.opc.TestPackageThumbnail
Running org.apache.poi.openxml4j.opc.compliance.TestOPCCompliancePartName
Tests run: 10, Failures: 0, Errors: 0, Skipped: 0, Time elapsed: 0.002 sec - in org.apache.poi.openxml4j.opc.compliance.TestOPCCompliancePartName
Running org.apache.poi.openxml4j.opc.compliance.TestOPCComplianceCoreProperties
Tests run: 11, Failures: 0, Errors: 0, Skipped: 0, Time elapsed: 0.067 sec - in org.apache.poi.openxml4j.opc.compliance.TestOPCComplianceCoreProperties
Running org.apache.poi.openxml4j.opc.compliance.TestOPCCompliancePackageModel
Tests run: 5, Failures: 0, Errors: 0, Skipped: 0, Time elapsed: 0.003 sec - in org.apache.poi.openxml4j.opc.compliance.TestOPCCompliancePackageModel
Running org.apache.poi.openxml4j.opc.TestFileHelper
Tests run: 1, Failures: 0, Errors: 0, Skipped: 0, Time elapsed: 0 sec - in org.apache.poi.openxml4j.opc.TestFileHelper
Running org.apache.poi.openxml4j.opc.TestPackagePartName
Tests run: 1, Failures: 0, Errors: 0, Skipped: 0, Time elapsed: 0 sec - in org.apache.poi.openxml4j.opc.TestPackagePartName
Running org.apache.poi.openxml4j.opc.TestContentType
Tests run: 7, Failures: 0, Errors: 0, Skipped: 0, Time elapsed: 0.007 sec - in org.apache.poi.openxml4j.opc.TestContentType
Running org.apache.poi.xslf.TestXSLFSlideShow
Tests run: 5, Failures: 0, Errors: 0, Skipped: 0, Time elapsed: 0.131 sec - in org.apache.poi.xslf.TestXSLFSlideShow
Running org.apache.poi.xslf.usermodel.TestXSLFTextShape
Tests run: 4, Failures: 0, Errors: 0, Skipped: 0, Time elapsed: 0.117 sec - in org.apache.poi.xslf.usermodel.TestXSLFTextShape
Running org.apache.poi.xslf.usermodel.TestXSLFTextRun
Tests run: 2, Failures: 0, Errors: 0, Skipped: 0, Time elapsed: 0.045 sec - in org.apache.poi.xslf.usermodel.TestXSLFTextRun
Running org.apache.poi.xslf.usermodel.TestXSLFFreeformShape
Tests run: 1, Failures: 0, Errors: 0, Skipped: 0, Time elapsed: 0.057 sec - in org.apache.poi.xslf.usermodel.TestXSLFFreeformShape
Running org.apache.poi.xslf.usermodel.TestXMLSlideShow
Tests run: 9, Failures: 0, Errors: 0, Skipped: 0, Time elapsed: 0.274 sec - in org.apache.poi.xslf.usermodel.TestXMLSlideShow
Running org.apache.poi.xslf.usermodel.TestXSLFSlideShowFactory
Tests run: 6, Failures: 0, Errors: 0, Skipped: 0, Time elapsed: 0.529 sec - in org.apache.poi.xslf.usermodel.TestXSLFSlideShowFactory
Running org.apache.poi.xslf.usermodel.TestXSLFAutoShape
Tests run: 4, Failures: 0, Errors: 0, Skipped: 0, Time elapsed: 0.096 sec - in org.apache.poi.xslf.usermodel.TestXSLFAutoShape
Running org.apache.poi.xslf.usermodel.TestXSLFShapeContainer
Tests run: 1, Failures: 0, Errors: 0, Skipped: 0, Time elapsed: 0.033 sec - in org.apache.poi.xslf.usermodel.TestXSLFShapeContainer
Running org.apache.poi.xslf.usermodel.TestXSLFSheet
Tests run: 1, Failures: 0, Errors: 0, Skipped: 0, Time elapsed: 0.052 sec - in org.apache.poi.xslf.usermodel.TestXSLFSheet
Running org.apache.poi.xslf.usermodel.TestXSLFSimpleShape
Tests run: 8, Failures: 0, Errors: 0, Skipped: 0, Time elapsed: 5.633 sec - in org.apache.poi.xslf.usermodel.TestXSLFSimpleShape
Running org.apache.poi.xslf.usermodel.TestXSLFTableStyles
Tests run: 1, Failures: 0, Errors: 0, Skipped: 0, Time elapsed: 0.014 sec - in org.apache.poi.xslf.usermodel.TestXSLFTableStyles
Running org.apache.poi.xslf.usermodel.TestXSLFTextParagraph
Tests run: 5, Failures: 0, Errors: 0, Skipped: 1, Time elapsed: 0.059 sec - in org.apache.poi.xslf.usermodel.TestXSLFTextParagraph
Running org.apache.poi.xslf.usermodel.TestXSLFTheme
Tests run: 1, Failures: 0, Errors: 0, Skipped: 0, Time elapsed: 0.145 sec - in org.apache.poi.xslf.usermodel.TestXSLFTheme
Running org.apache.poi.xslf.usermodel.TestXSLFPictureShape
Tests run: 6, Failures: 0, Errors: 0, Skipped: 0, Time elapsed: 0.328 sec - in org.apache.poi.xslf.usermodel.TestXSLFPictureShape
Running org.apache.poi.xslf.usermodel.TestXSLFHyperlink
Tests run: 3, Failures: 0, Errors: 0, Skipped: 0, Time elapsed: 0.105 sec - in org.apache.poi.xslf.usermodel.TestXSLFHyperlink
Running org.apache.poi.xslf.usermodel.TestXSLFConnectorShape
Tests run: 2, Failures: 0, Errors: 0, Skipped: 0, Time elapsed: 0.036 sec - in org.apache.poi.xslf.usermodel.TestXSLFConnectorShape
Running org.apache.poi.xslf.usermodel.TestXSLFSlide
Tests run: 4, Failures: 0, Errors: 0, Skipped: 0, Time elapsed: 0.717 sec - in org.apache.poi.xslf.usermodel.TestXSLFSlide
Running org.apache.poi.xslf.usermodel.TestXSLFColor
Tests run: 6, Failures: 0, Errors: 0, Skipped: 0, Time elapsed: 0.06 sec - in org.apache.poi.xslf.usermodel.TestXSLFColor
Running org.apache.poi.xslf.usermodel.TestXSLFSlideShow
Tests run: 6, Failures: 0, Errors: 0, Skipped: 0, Time elapsed: 0.161 sec - in org.apache.poi.xslf.usermodel.TestXSLFSlideShow
Running org.apache.poi.xslf.usermodel.TestXSLFNotes
Tests run: 3, Failures: 0, Errors: 0, Skipped: 0, Time elapsed: 0.075 sec - in org.apache.poi.xslf.usermodel.TestXSLFNotes
Running org.apache.poi.xslf.usermodel.TestXSLFChart
Tests run: 5, Failures: 0, Errors: 0, Skipped: 0, Time elapsed: 0.213 sec - in org.apache.poi.xslf.usermodel.TestXSLFChart
Running org.apache.poi.xslf.usermodel.TestPPTX2PNG
Tests run: 10, Failures: 0, Errors: 0, Skipped: 0, Time elapsed: 8.926 sec - in org.apache.poi.xslf.usermodel.TestPPTX2PNG
Running org.apache.poi.xslf.usermodel.TestXSLFShape
Tests run: 2, Failures: 0, Errors: 0, Skipped: 0, Time elapsed: 0.037 sec - in org.apache.poi.xslf.usermodel.TestXSLFShape
Running org.apache.poi.xslf.usermodel.TestXSLFTableRow
Tests run: 7, Failures: 0, Errors: 0, Skipped: 0, Time elapsed: 0.187 sec - in org.apache.poi.xslf.usermodel.TestXSLFTableRow
Running org.apache.poi.xslf.usermodel.TestXSLFTextBox
Tests run: 2, Failures: 0, Errors: 0, Skipped: 0, Time elapsed: 0.036 sec - in org.apache.poi.xslf.usermodel.TestXSLFTextBox
Running org.apache.poi.xslf.usermodel.TestXSLFTable
Tests run: 5, Failures: 0, Errors: 0, Skipped: 0, Time elapsed: 2.878 sec - in org.apache.poi.xslf.usermodel.TestXSLFTable
Running org.apache.poi.xslf.usermodel.TestXSLFGroupShape
Tests run: 2, Failures: 0, Errors: 0, Skipped: 0, Time elapsed: 0.041 sec - in org.apache.poi.xslf.usermodel.TestXSLFGroupShape
Running org.apache.poi.xslf.TestXSLFBugs
Tests run: 22, Failures: 0, Errors: 0, Skipped: 1, Time elapsed: 1.433 sec - in org.apache.poi.xslf.TestXSLFBugs
Running org.apache.poi.xslf.extractor.TestXSLFPowerPointExtractor
Tests run: 5, Failures: 0, Errors: 0, Skipped: 0, Time elapsed: 0.266 sec - in org.apache.poi.xslf.extractor.TestXSLFPowerPointExtractor
Running org.apache.poi.xslf.geom.TestFormulaParser
Tests run: 1, Failures: 0, Errors: 0, Skipped: 0, Time elapsed: 0 sec - in org.apache.poi.xslf.geom.TestFormulaParser

Results :

Failed tests:
  TestSignatureInfo.bug61182:215 expected:<[HDdvgXblLMiE6gZSoRSQUof6+aedrhK9i51we1n+4Q/ioqrQCeh5UkfQ8lD63nV4ZDbM4/pIVFi6VpMpN/HMnAUHeVdVUCVTgpn3Iz21Ymcd9/aerNov2BjHLhS8X3oUE+XTu2TbJLNmms0I9G4lfg6HWP9t7ZCXBXy6vyCMArc]=> but was:<[YSHeVavBdHwIiBgYTzDktqLWKp9HUgmVO0PMQuWwWsKvEiv9nhGhtnJYRqMXtEDSIOvPinup3EvupArb24l4GNycAYUoP6/mhUNCBEDMtcK9PKwWn9jzuR/07WmgFkYg0LyMybqr/UXkdvE9YglS1NWURF+y/aCsCdcOOp4LEcM]=>

Tests run: 2372, Failures: 1, Errors: 0, Skipped: 159

[INFO] ------------------------------------------------------------------------
[INFO] Reactor Summary:
[INFO]
[INFO] Apache POI - the Java API for Microsoft Documents . SUCCESS [  0.003 s]
[INFO] Apache POI Main package ........................... SUCCESS [01:42 min]
[INFO] Apache POI Scratchpad package ..................... SUCCESS [ 17.244 s]
[INFO] Apache POI - Openxmlformats Schema package ........ SUCCESS [01:31 min]
[INFO] Apache POI - Openxmlformats Encryption Schema package  SUCCESS [  0.979 s]
[INFO] Apache POI - Openxmlformats Security-Schema package  SUCCESS [ 11.170 s]
[INFO] Apache POI OOXML package .......................... FAILURE [02:51 min]
[INFO] Apache POI ExcelAnt package ....................... SKIPPED
[INFO] Apache POI Examples package ....................... SKIPPED
[INFO] ------------------------------------------------------------------------
[INFO] BUILD FAILURE
[INFO] ------------------------------------------------------------------------
[INFO] Total time: 06:35 min
[INFO] Finished at: 2017-12-28T12:10:55+00:00
[INFO] Final Memory: 55M/833M
[INFO] ------------------------------------------------------------------------
[ERROR] Failed to execute goal org.apache.maven.plugins:maven-surefire-plugin:2.19.1:test (default-test) on project poi-ooxml: There are test failures.
[ERROR]
[ERROR] Please refer to <https://builds.apache.org/job/POI-DSL-Maven/ws/sonar/ooxml/target/surefire-reports> for the individual test results.
[ERROR] -> [Help 1]
[ERROR]
[ERROR] To see the full stack trace of the errors, re-run Maven with the -e switch.
[ERROR] Re-run Maven using the -X switch to enable full debug logging.
[ERROR]
[ERROR] For more information about the errors and possible solutions, please read the following articles:
[ERROR] [Help 1] http://cwiki.apache.org/confluence/display/MAVEN/MojoFailureException
[ERROR]
[ERROR] After correcting the problems, you can resume the build with the command
[ERROR]   mvn <goals> -rf :poi-ooxml
Build step 'Invoke top-level Maven targets' marked build as failure
Recording test results

---------------------------------------------------------------------
To unsubscribe, e-mail: [hidden email]
For additional commands, e-mail: [hidden email]

Reply | Threaded
Open this post in threaded view
|

Jenkins build is back to normal : POI-DSL-Maven #438

Apache Jenkins Server
See <https://builds.apache.org/job/POI-DSL-Maven/438/display/redirect?page=changes>


---------------------------------------------------------------------
To unsubscribe, e-mail: [hidden email]
For additional commands, e-mail: [hidden email]