Build failed in Jenkins: POI-DSL-Maven #407

classic Classic list List threaded Threaded
5 messages Options
Reply | Threaded
Open this post in threaded view
|

Build failed in Jenkins: POI-DSL-Maven #407

Apache Jenkins Server
See <https://builds.apache.org/job/POI-DSL-Maven/407/display/redirect?page=changes>

Changes:

[fanningpj] [bug-61792] basic test

[fanningpj] [bug-61792] some changes to avoid iterating over chars of Strings

[fanningpj] upgrade to commons-codec 1.11

------------------------------------------
[...truncated 101.93 KB...]
Tests run: 9, Failures: 0, Errors: 0, Skipped: 0, Time elapsed: 0.001 sec - in org.apache.poi.ss.formula.functions.TestMatch
Running org.apache.poi.ss.formula.functions.TestMid
Tests run: 4, Failures: 0, Errors: 0, Skipped: 0, Time elapsed: 0 sec - in org.apache.poi.ss.formula.functions.TestMid
Running org.apache.poi.ss.formula.functions.TestMirr
Tests run: 4, Failures: 0, Errors: 0, Skipped: 0, Time elapsed: 0.001 sec - in org.apache.poi.ss.formula.functions.TestMirr
Running org.apache.poi.ss.formula.functions.TestCountFuncs
Tests run: 16, Failures: 0, Errors: 0, Skipped: 0, Time elapsed: 0.008 sec - in org.apache.poi.ss.formula.functions.TestCountFuncs
Running org.apache.poi.ss.formula.functions.TestIntercept
Tests run: 4, Failures: 0, Errors: 0, Skipped: 0, Time elapsed: 0.006 sec - in org.apache.poi.ss.formula.functions.TestIntercept
Running org.apache.poi.ss.formula.functions.TestSumifs
Tests run: 7, Failures: 0, Errors: 0, Skipped: 0, Time elapsed: 0.003 sec - in org.apache.poi.ss.formula.functions.TestSumifs
Running org.apache.poi.ss.formula.functions.TestWeekNumFunctionsFromSpreadsheet2013
Tests run: 7, Failures: 0, Errors: 0, Skipped: 0, Time elapsed: 0 sec - in org.apache.poi.ss.formula.functions.TestWeekNumFunctionsFromSpreadsheet2013
Running org.apache.poi.ss.formula.functions.TestSubtotal
Tests run: 11, Failures: 0, Errors: 0, Skipped: 0, Time elapsed: 0.005 sec - in org.apache.poi.ss.formula.functions.TestSubtotal
Running org.apache.poi.ss.formula.functions.TestComplex
Tests run: 2, Failures: 0, Errors: 0, Skipped: 0, Time elapsed: 0 sec - in org.apache.poi.ss.formula.functions.TestComplex
Running org.apache.poi.ss.formula.functions.TestAddress
Tests run: 1, Failures: 0, Errors: 0, Skipped: 0, Time elapsed: 0 sec - in org.apache.poi.ss.formula.functions.TestAddress
Running org.apache.poi.ss.formula.functions.TestBin2Dec
Tests run: 5, Failures: 0, Errors: 0, Skipped: 0, Time elapsed: 0 sec - in org.apache.poi.ss.formula.functions.TestBin2Dec
Running org.apache.poi.ss.formula.functions.TestSumif
Tests run: 3, Failures: 0, Errors: 0, Skipped: 0, Time elapsed: 0.001 sec - in org.apache.poi.ss.formula.functions.TestSumif
Running org.apache.poi.ss.formula.functions.TestText
Tests run: 4, Failures: 0, Errors: 0, Skipped: 0, Time elapsed: 0.002 sec - in org.apache.poi.ss.formula.functions.TestText
Running org.apache.poi.ss.formula.functions.TestValue
Tests run: 2, Failures: 0, Errors: 0, Skipped: 0, Time elapsed: 0 sec - in org.apache.poi.ss.formula.functions.TestValue
Running org.apache.poi.ss.formula.functions.TestStatsLib
Tests run: 9, Failures: 0, Errors: 0, Skipped: 0, Time elapsed: 0 sec - in org.apache.poi.ss.formula.functions.TestStatsLib
Running org.apache.poi.ss.formula.functions.TestIndexFunctionFromSpreadsheet
Tests run: 98, Failures: 0, Errors: 0, Skipped: 0, Time elapsed: 0.012 sec - in org.apache.poi.ss.formula.functions.TestIndexFunctionFromSpreadsheet
Running org.apache.poi.ss.formula.functions.TestLen
Tests run: 3, Failures: 0, Errors: 0, Skipped: 0, Time elapsed: 0.001 sec - in org.apache.poi.ss.formula.functions.TestLen
Running org.apache.poi.ss.formula.functions.TestDec2Hex
Tests run: 12, Failures: 0, Errors: 0, Skipped: 0, Time elapsed: 0.02 sec - in org.apache.poi.ss.formula.functions.TestDec2Hex
Running org.apache.poi.ss.formula.functions.TestNpv
Tests run: 2, Failures: 0, Errors: 0, Skipped: 0, Time elapsed: 0.001 sec - in org.apache.poi.ss.formula.functions.TestNpv
Running org.apache.poi.ss.formula.functions.TestOct2Dec
Tests run: 2, Failures: 0, Errors: 0, Skipped: 0, Time elapsed: 0 sec - in org.apache.poi.ss.formula.functions.TestOct2Dec
Running org.apache.poi.ss.formula.functions.TestAverage
Tests run: 3, Failures: 0, Errors: 0, Skipped: 0, Time elapsed: 0 sec - in org.apache.poi.ss.formula.functions.TestAverage
Running org.apache.poi.ss.formula.functions.TestDStarFunctionsFromSpreadsheet
Tests run: 4, Failures: 0, Errors: 0, Skipped: 0, Time elapsed: 0.001 sec - in org.apache.poi.ss.formula.functions.TestDStarFunctionsFromSpreadsheet
Running org.apache.poi.ss.formula.functions.TestPPMT
Tests run: 1, Failures: 0, Errors: 0, Skipped: 0, Time elapsed: 0.001 sec - in org.apache.poi.ss.formula.functions.TestPPMT
Running org.apache.poi.ss.formula.functions.TestDelta
Tests run: 2, Failures: 0, Errors: 0, Skipped: 0, Time elapsed: 0 sec - in org.apache.poi.ss.formula.functions.TestDelta
Running org.apache.poi.ss.formula.functions.TestIndex
Tests run: 3, Failures: 0, Errors: 0, Skipped: 0, Time elapsed: 0 sec - in org.apache.poi.ss.formula.functions.TestIndex
Running org.apache.poi.ss.formula.functions.TestMultiOperandNumericFunction
Tests run: 1, Failures: 0, Errors: 0, Skipped: 0, Time elapsed: 0 sec - in org.apache.poi.ss.formula.functions.TestMultiOperandNumericFunction
Running org.apache.poi.ss.formula.functions.TestImaginaryFunctionsFromSpreadsheet
Tests run: 7, Failures: 0, Errors: 0, Skipped: 0, Time elapsed: 0 sec - in org.apache.poi.ss.formula.functions.TestImaginaryFunctionsFromSpreadsheet
Running org.apache.poi.ss.formula.functions.TestWeekNumFunctionsFromSpreadsheet
Tests run: 7, Failures: 0, Errors: 0, Skipped: 0, Time elapsed: 0.001 sec - in org.apache.poi.ss.formula.functions.TestWeekNumFunctionsFromSpreadsheet
Running org.apache.poi.ss.formula.functions.TestCodeFunctionsFromSpreadsheet
Tests run: 4, Failures: 0, Errors: 0, Skipped: 0, Time elapsed: 0 sec - in org.apache.poi.ss.formula.functions.TestCodeFunctionsFromSpreadsheet
Running org.apache.poi.ss.formula.functions.TestFixed
Tests run: 2, Failures: 0, Errors: 0, Skipped: 0, Time elapsed: 0.003 sec - in org.apache.poi.ss.formula.functions.TestFixed
Running org.apache.poi.ss.formula.functions.TestCalendarFieldFunction
Tests run: 4, Failures: 0, Errors: 0, Skipped: 0, Time elapsed: 0.004 sec - in org.apache.poi.ss.formula.functions.TestCalendarFieldFunction
Running org.apache.poi.ss.formula.functions.TestIrr
Tests run: 3, Failures: 0, Errors: 0, Skipped: 0, Time elapsed: 0.002 sec - in org.apache.poi.ss.formula.functions.TestIrr
Running org.apache.poi.ss.formula.functions.TestTrim
Tests run: 3, Failures: 0, Errors: 0, Skipped: 0, Time elapsed: 0.001 sec - in org.apache.poi.ss.formula.functions.TestTrim
Running org.apache.poi.ss.formula.functions.TestTFunc
Tests run: 5, Failures: 0, Errors: 0, Skipped: 0, Time elapsed: 0 sec - in org.apache.poi.ss.formula.functions.TestTFunc
Running org.apache.poi.ss.formula.functions.TestImRealFunctionsFromSpreadsheet
Tests run: 7, Failures: 0, Errors: 0, Skipped: 0, Time elapsed: 0.001 sec - in org.apache.poi.ss.formula.functions.TestImRealFunctionsFromSpreadsheet
Running org.apache.poi.ss.formula.functions.TestDate
Tests run: 3, Failures: 0, Errors: 0, Skipped: 0, Time elapsed: 0.001 sec - in org.apache.poi.ss.formula.functions.TestDate
Running org.apache.poi.ss.formula.functions.TestWeekdayFunc
Tests run: 2, Failures: 0, Errors: 0, Skipped: 0, Time elapsed: 0.001 sec - in org.apache.poi.ss.formula.functions.TestWeekdayFunc
Running org.apache.poi.ss.util.TestCellRangeAddress
Tests run: 14, Failures: 0, Errors: 0, Skipped: 0, Time elapsed: 0.001 sec - in org.apache.poi.ss.util.TestCellRangeAddress
Running org.apache.poi.ss.util.TestDateFormatConverter
Tests run: 2, Failures: 0, Errors: 1, Skipped: 0, Time elapsed: 0.318 sec <<< FAILURE! - in org.apache.poi.ss.util.TestDateFormatConverter
testJavaDateFormatsInExcel(org.apache.poi.ss.util.TestDateFormatConverter)  Time elapsed: 0.318 sec  <<< ERROR!
java.io.IOException: Permission denied
        at org.apache.poi.ss.util.TestDateFormatConverter.outputLocaleDataFormats(TestDateFormatConverter.java:108)
        at org.apache.poi.ss.util.TestDateFormatConverter.testJavaDateFormatsInExcel(TestDateFormatConverter.java:120)

Running org.apache.poi.ss.util.TestPropertyTemplate
Tests run: 8, Failures: 0, Errors: 0, Skipped: 0, Time elapsed: 0.01 sec - in org.apache.poi.ss.util.TestPropertyTemplate
Running org.apache.poi.ss.util.TestNumberComparer
Tests run: 4, Failures: 0, Errors: 0, Skipped: 0, Time elapsed: 0.025 sec - in org.apache.poi.ss.util.TestNumberComparer
Running org.apache.poi.ss.util.TestSheetUtil
Tests run: 7, Failures: 0, Errors: 0, Skipped: 0, Time elapsed: 0.001 sec - in org.apache.poi.ss.util.TestSheetUtil
Running org.apache.poi.ss.util.TestCellRangeUtil
Tests run: 1, Failures: 0, Errors: 0, Skipped: 0, Time elapsed: 0.013 sec - in org.apache.poi.ss.util.TestCellRangeUtil
Running org.apache.poi.ss.util.TestCellReference
Tests run: 25, Failures: 0, Errors: 0, Skipped: 0, Time elapsed: 0.002 sec - in org.apache.poi.ss.util.TestCellReference
Running org.apache.poi.ss.util.TestAreaReference
Tests run: 2, Failures: 0, Errors: 0, Skipped: 0, Time elapsed: 0 sec - in org.apache.poi.ss.util.TestAreaReference
Running org.apache.poi.ss.util.TestExpandedDouble
Tests run: 3, Failures: 0, Errors: 0, Skipped: 0, Time elapsed: 0.001 sec - in org.apache.poi.ss.util.TestExpandedDouble
Running org.apache.poi.ss.util.TestHSSFCellUtil
Tests run: 13, Failures: 0, Errors: 0, Skipped: 0, Time elapsed: 0.004 sec - in org.apache.poi.ss.util.TestHSSFCellUtil
Running org.apache.poi.ss.util.TestSheetBuilder
Tests run: 3, Failures: 0, Errors: 0, Skipped: 0, Time elapsed: 0.001 sec - in org.apache.poi.ss.util.TestSheetBuilder
Running org.apache.poi.ss.util.TestNumberToTextConverter
Tests run: 2, Failures: 0, Errors: 0, Skipped: 0, Time elapsed: 0.016 sec - in org.apache.poi.ss.util.TestNumberToTextConverter
Running org.apache.poi.ss.util.TestRegionUtil
Tests run: 10, Failures: 0, Errors: 0, Skipped: 0, Time elapsed: 0.01 sec - in org.apache.poi.ss.util.TestRegionUtil
Running org.apache.poi.ss.util.TestCellAddress
Tests run: 6, Failures: 0, Errors: 0, Skipped: 0, Time elapsed: 0.001 sec - in org.apache.poi.ss.util.TestCellAddress
Running org.apache.poi.ss.util.TestWorkbookUtil
Tests run: 1, Failures: 0, Errors: 0, Skipped: 0, Time elapsed: 0 sec - in org.apache.poi.ss.util.TestWorkbookUtil
Running org.apache.poi.ss.util.cellwalk.TestCellWalk
Tests run: 1, Failures: 0, Errors: 0, Skipped: 0, Time elapsed: 0.002 sec - in org.apache.poi.ss.util.cellwalk.TestCellWalk
Running org.apache.poi.ss.format.TestCellFormat
Nov 21, 2017 12:06:17 AM org.apache.poi.ss.format.CellFormatPart getColor
WARNING: Unknown color: "Red"
Tests run: 40, Failures: 0, Errors: 0, Skipped: 0, Time elapsed: 0.094 sec - in org.apache.poi.ss.format.TestCellFormat
Running org.apache.poi.ss.format.TestCellFormatCondition
Tests run: 1, Failures: 0, Errors: 0, Skipped: 0, Time elapsed: 0.001 sec - in org.apache.poi.ss.format.TestCellFormatCondition
Running org.apache.poi.ss.format.TestCellFormatResult
Tests run: 1, Failures: 0, Errors: 0, Skipped: 0, Time elapsed: 0 sec - in org.apache.poi.ss.format.TestCellFormatResult
Running org.apache.poi.ss.TestSpreadsheetVersion
Tests run: 2, Failures: 0, Errors: 0, Skipped: 0, Time elapsed: 0 sec - in org.apache.poi.ss.TestSpreadsheetVersion
Running org.apache.poi.ss.usermodel.TestDateUtil
Tests run: 5, Failures: 0, Errors: 0, Skipped: 0, Time elapsed: 0.001 sec - in org.apache.poi.ss.usermodel.TestDateUtil
Running org.apache.poi.ss.usermodel.TestIndexedColors
Tests run: 3, Failures: 0, Errors: 0, Skipped: 0, Time elapsed: 0.001 sec - in org.apache.poi.ss.usermodel.TestIndexedColors
Running org.apache.poi.ss.usermodel.TestFractionFormat
Tests run: 2, Failures: 0, Errors: 0, Skipped: 0, Time elapsed: 0.057 sec - in org.apache.poi.ss.usermodel.TestFractionFormat
Running org.apache.poi.ss.usermodel.TestExcelStyleDateFormatter
Tests run: 4, Failures: 0, Errors: 0, Skipped: 0, Time elapsed: 0.003 sec - in org.apache.poi.ss.usermodel.TestExcelStyleDateFormatter
Running org.apache.poi.ss.usermodel.TestHSSFBorderStyle
Tests run: 1, Failures: 0, Errors: 0, Skipped: 0, Time elapsed: 0.001 sec - in org.apache.poi.ss.usermodel.TestHSSFBorderStyle
Running org.apache.poi.ss.usermodel.charts.TestDataSources
Tests run: 6, Failures: 0, Errors: 0, Skipped: 0, Time elapsed: 0.013 sec - in org.apache.poi.ss.usermodel.charts.TestDataSources
Running org.apache.poi.ss.usermodel.TestDataFormatter
Tests run: 33, Failures: 0, Errors: 0, Skipped: 1, Time elapsed: 0.028 sec - in org.apache.poi.ss.usermodel.TestDataFormatter
Running org.apache.poi.TestPOIDocumentMain
Tests run: 6, Failures: 0, Errors: 0, Skipped: 0, Time elapsed: 0.005 sec - in org.apache.poi.TestPOIDocumentMain

Results :

Failed tests:
  TestTempFile.testSetTempFileCreationStrategy
Expected: an instance of java.lang.IllegalArgumentException
     but: <org.junit.internal.runners.model.MultipleFailureException: There were 2 errors:
  java.lang.IllegalArgumentException(strategy == null)
  java.io.IOException(Permission denied)> is a org.junit.internal.runners.model.MultipleFailureException
Stacktrace was: org.junit.internal.runners.model.MultipleFailureException: There were 2 errors:
  java.lang.IllegalArgumentException(strategy == null)
  java.io.IOException(Permission denied)
        at org.junit.runners.model.MultipleFailureException.assertEmpty(MultipleFailureException.java:67)
        at org.junit.internal.runners.statements.RunAfters.evaluate(RunAfters.java:39)
        at org.junit.rules.ExpectedException$ExpectedExceptionStatement.evaluate(ExpectedException.java:239)
        at org.junit.rules.RunRules.evaluate(RunRules.java:20)
        at org.junit.runners.ParentRunner.runLeaf(ParentRunner.java:325)
        at org.junit.runners.BlockJUnit4ClassRunner.runChild(BlockJUnit4ClassRunner.java:78)
        at org.junit.runners.BlockJUnit4ClassRunner.runChild(BlockJUnit4ClassRunner.java:57)
        at org.junit.runners.ParentRunner$3.run(ParentRunner.java:290)
        at org.junit.runners.ParentRunner$1.schedule(ParentRunner.java:71)
        at org.junit.runners.ParentRunner.runChildren(ParentRunner.java:288)
        at org.junit.runners.ParentRunner.access$000(ParentRunner.java:58)
        at org.junit.runners.ParentRunner$2.evaluate(ParentRunner.java:268)
        at org.junit.runners.ParentRunner.run(ParentRunner.java:363)
        at org.junit.runners.Suite.runChild(Suite.java:128)
        at org.junit.runners.Suite.runChild(Suite.java:27)
        at org.junit.runners.ParentRunner$3.run(ParentRunner.java:290)
        at org.junit.runners.ParentRunner$1.schedule(ParentRunner.java:71)
        at org.junit.runners.ParentRunner.runChildren(ParentRunner.java:288)
        at org.junit.runners.ParentRunner.access$000(ParentRunner.java:58)
        at org.junit.runners.ParentRunner$2.evaluate(ParentRunner.java:268)
        at org.junit.runners.ParentRunner.run(ParentRunner.java:363)
        at org.apache.maven.surefire.junitcore.JUnitCore.run(JUnitCore.java:55)
        at org.apache.maven.surefire.junitcore.JUnitCoreWrapper.createRequestAndRun(JUnitCoreWrapper.java:137)
        at org.apache.maven.surefire.junitcore.JUnitCoreWrapper.executeEager(JUnitCoreWrapper.java:107)
        at org.apache.maven.surefire.junitcore.JUnitCoreWrapper.execute(JUnitCoreWrapper.java:83)
        at org.apache.maven.surefire.junitcore.JUnitCoreWrapper.execute(JUnitCoreWrapper.java:75)
        at org.apache.maven.surefire.junitcore.JUnitCoreProvider.invoke(JUnitCoreProvider.java:161)
        at org.apache.maven.surefire.booter.ForkedBooter.invokeProviderInSameClassLoader(ForkedBooter.java:290)
        at org.apache.maven.surefire.booter.ForkedBooter.runSuitesInProcess(ForkedBooter.java:242)
        at org.apache.maven.surefire.booter.ForkedBooter.main(ForkedBooter.java:121)

Tests in error:
  TestWrite.dictionary:475 » IO Permission denied
  TestWrite.dictionaryWithInvalidCodepage »  Unexpected exception, expected<org....
  TestWrite.inPlaceNPOIFSWrite:526 » IO Permission denied
  TestWrite.withoutAFormatID »  Unexpected exception, expected<org.apache.poi.hp...
  TestWriteWellKnown.testWriteWellKnown:170 » IO Permission denied
  TestCellStyle.testDataStyle:104 » IO Permission denied
  TestCellStyle.testWriteSheetFont:64 » IO Permission denied
  TestCellStyle.testWriteSheetStyle:176 » IO Permission denied
  TestFormulas.test27272_1:927 » IO Permission denied
  TestFormulas.test27272_2:939 » IO Permission denied
  TestFormulas.testComplexSheetRefs:914 » IO Permission denied
  TestFormulas.testRVAoperands:637 » IO Permission denied
  TestHSSFWorkbook.inPlaceWrite:1270 » IO Permission denied
  TestHSSFWorkbook.testRewriteFileBug58480:1137 » IO Permission denied
  TestHSSFWorkbook.testWriteToNewFile:1310 » IO Permission denied
  TestPOIFSDump.testFailToWrite »  Unexpected exception, expected<java.lang.Inde...
  TestNPOIFSFileSystem.createWriteRead:1005->writeOutFileAndReadBack:103 » IO Pe...
  TestDataSource.testFileWritable:58 » IO Permission denied
  TestDataSource.testRewritableFile:86 » IO Permission denied
  TestDateFormatConverter.testJavaDateFormatsInExcel:120->outputLocaleDataFormats:108 » IO
  TestHexDump.testMain:268 » IO Permission denied
org.apache.poi.util.TestTempFile.createTempFileWithDefaultSuffix(org.apache.poi.util.TestTempFile)
  Run 1: TestTempFile.createTempFileWithDefaultSuffix:109 » IO Permission denied
  Run 2: TestTempFile.tearDown:81 » IO Permission denied

org.apache.poi.util.TestTempFile.testCreateTempDirectory(org.apache.poi.util.TestTempFile)
  Run 1: TestTempFile.testCreateTempDirectory:117 » IO Could not create temporary direc...
  Run 2: TestTempFile.tearDown:81 » IO Permission denied

org.apache.poi.util.TestTempFile.testCreateTempFile(org.apache.poi.util.TestTempFile)
  Run 1: TestTempFile.testCreateTempFile:89 » IO Permission denied
  Run 2: TestTempFile.tearDown:81 » IO Permission denied


Tests run: 6527, Failures: 1, Errors: 24, Skipped: 776

[INFO] ------------------------------------------------------------------------
[INFO] Reactor Summary:
[INFO]
[INFO] Apache POI - the Java API for Microsoft Documents . SUCCESS [  0.002 s]
[INFO] Apache POI Main package ........................... FAILURE [01:22 min]
[INFO] Apache POI Scratchpad package ..................... SKIPPED
[INFO] Apache POI - Openxmlformats Schema package ........ SKIPPED
[INFO] Apache POI - Openxmlformats Encryption Schema package  SKIPPED
[INFO] Apache POI - Openxmlformats Security-Schema package  SKIPPED
[INFO] Apache POI OOXML package .......................... SKIPPED
[INFO] Apache POI ExcelAnt package ....................... SKIPPED
[INFO] Apache POI Examples package ....................... SKIPPED
[INFO] ------------------------------------------------------------------------
[INFO] BUILD FAILURE
[INFO] ------------------------------------------------------------------------
[INFO] Total time: 01:22 min
[INFO] Finished at: 2017-11-21T00:06:17+00:00
[INFO] Final Memory: 32M/781M
[INFO] ------------------------------------------------------------------------
[ERROR] Failed to execute goal org.apache.maven.plugins:maven-surefire-plugin:2.19.1:test (default-test) on project poi-main: There are test failures.
[ERROR]
[ERROR] Please refer to <https://builds.apache.org/job/POI-DSL-Maven/ws/sonar/main/target/surefire-reports> for the individual test results.
[ERROR] -> [Help 1]
[ERROR]
[ERROR] To see the full stack trace of the errors, re-run Maven with the -e switch.
[ERROR] Re-run Maven using the -X switch to enable full debug logging.
[ERROR]
[ERROR] For more information about the errors and possible solutions, please read the following articles:
[ERROR] [Help 1] http://cwiki.apache.org/confluence/display/MAVEN/MojoFailureException
[ERROR]
[ERROR] After correcting the problems, you can resume the build with the command
[ERROR]   mvn <goals> -rf :poi-main
Build step 'Invoke top-level Maven targets' marked build as failure

---------------------------------------------------------------------
To unsubscribe, e-mail: [hidden email]
For additional commands, e-mail: [hidden email]

Reply | Threaded
Open this post in threaded view
|

Build failed in Jenkins: POI-DSL-Maven #408

Apache Jenkins Server
See <https://builds.apache.org/job/POI-DSL-Maven/408/display/redirect?page=changes>

Changes:

[centic] Try to set java.io.tmpdir for tests to avoid the strange permission errors that we see in CI-builds

[centic] Adjust version of commons-codec in docu pages as well

[centic] Ensure that no old version of commons-codec is lingering around and causes hard to find build errors locally

[centic] Try if using a local temporary directory avoids the permission errors in unit tests in the Maven runs:
* Collect JUnit results
* Set java.io.tmpdir in Maven unit test runs

------------------------------------------
[...truncated 1.12 MB...]
  Data of length 260
  00000000 14 00 00 00 03 00 20 0E E6 0F 00 00 1E 00 01 30 ...... .æ......0
  00000000 01 00 00 00 0B 00 00 00 71 75 69 63 6B 2E 68 74 ........quick.ht
  00000000 6D 6C 00 00 02 01 02 37 01 00 00 00 00 00 00 00 ml.....7........

    AttachSize [3616] (PR_ATTACH_SIZE) [E6, 0F, 00, 00]
    DisplayName [12289] (PR_DISPLAY_NAME) quick.html
    AttachEncoding [14082] (PR_ATTACH_ENCODING) []
    AttachExtension [14083] (PR_ATTACH_EXTENSION) .html
    AttachMethod [14085] (PR_ATTACH_METHOD) [01, 00, 00, 00]
    AttachLongFilename [14087] (PR_ATTACH_LONG_FILENAME) quick.html
    RenderingPosition [14091] (PR_RENDERING_POSITION) [37, 00, 00, 00]
    AttachFlags [14100] (PR_ATTACH_FLAGS) [00, 00, 00, 00]
    (unknown 7ffa) [32762] [00, 00, 00, 00]
    (unknown 7ffb) [32763] Sat Jan 01 00:00:00 UTC 4501
    (unknown 7ffc) [32764] Sat Jan 01 00:00:00 UTC 4501
    (unknown 7ffd) [32765] [00, 00, 00, 00]
    (unknown 7ffe) [32766] [00, 00]
    (unknown 7fff) [32767] [00, 00]
    AttachNum [3617] (PR_ATTACH_NUM) [E5, 82, 00, 00]
    MappingSignature [4088] (PR_MAPPING_SIGNATURE) [A1, 19, 43, 18, D0, D9, 7A, 4B, 97, B4, 04, 30, 9E, 21, A6, 29]
    StoreRecordKey [4090] (PR_STORE_RECORD_KEY) [A1, 19, 43, 18, D0, D9, 7A, 4B, 97, B4, 04, 30, 9E, 21, A6, 29]
    ObjectType [4094] (PR_Object_TYPE) [07, 00, 00, 00]
    StoreSupportMask [13325] (PR_STORE_SUPPORT_MASK) [FD, 3F, A5, 06]
    (unknown 340f) [13327] [FD, 3F, A5, 06]


Attachment # 3

Level 2 : Type 6 : ID AttachRenderData [36866] (attAttachRenddata)
  Data of length 14
  00000000 01 00 56 00 00 00 20 00 20 00 00 00 00 00       ..V... . .....

Level 2 : Type 3 : ID AttachModifyDate [32787] (PR_LAST_MODIFICATION_TIME)
      Wed Apr 28 12:40:56 UTC 2010
  Data of length 14
  00000000 DA 07 04 00 1C 00 0C 00 28 00 38 00 03 00       Ú.......(.8...

Level 2 : Type 6 : ID AttachData [32783] (PR_ATTACH_DATA_BIN)
  Data of length 18638
  00000000 25 50 44 46 2D 31 2E 33 0D 25 E2 E3 CF D3 0D 0A %PDF-1.3.%âãÏÓ..
  00000000 31 20 30 20 6F 62 6A 0D 3C 3C 20 2F 4C 65 6E 67 1 0 obj.<< /Leng
  00000000 74 68 20 32 20 30 20 52 20 2F 46 69 6C 74 65 72 th 2 0 R /Filter

Level 2 : Type 1 : ID AttachTitle [32784] (PR_ATTACH_FILENAME)
      quick.pdf
  Data of length 10
  00000000 71 75 69 63 6B 2E 70 64 66 00                   quick.pdf.

Level 2 : Type 6 : ID AttachMetaFile [32785] (PR_ATTACH_RENDERING)
  Data of length 3512
  00000000 01 00 09 00 00 03 DC 06 00 00 00 00 21 06 00 00 ......Ü.....!...
  00000000 00 00 05 00 00 00 09 02 00 00 00 00 05 00 00 00 ................
  00000000 01 02 FF FF FF 00 A5 00 00 00 41 0B C6 00 88 00 ......¥...A.Æ...

Level 2 : Type 6 : ID Attachment [36869]
  Data of length 260
  00000000 14 00 00 00 03 00 20 0E FE 56 00 00 1E 00 01 30 ...... .þV.....0
  00000000 01 00 00 00 0A 00 00 00 71 75 69 63 6B 2E 70 64 ........quick.pd
  00000000 66 00 00 00 02 01 02 37 01 00 00 00 00 00 00 00 f......7........

    AttachSize [3616] (PR_ATTACH_SIZE) [FE, 56, 00, 00]
    DisplayName [12289] (PR_DISPLAY_NAME) quick.pdf
    AttachEncoding [14082] (PR_ATTACH_ENCODING) []
    AttachExtension [14083] (PR_ATTACH_EXTENSION) .pdf
    AttachMethod [14085] (PR_ATTACH_METHOD) [01, 00, 00, 00]
    AttachLongFilename [14087] (PR_ATTACH_LONG_FILENAME) quick.pdf
    RenderingPosition [14091] (PR_RENDERING_POSITION) [56, 00, 00, 00]
    AttachFlags [14100] (PR_ATTACH_FLAGS) [00, 00, 00, 00]
    (unknown 7ffa) [32762] [00, 00, 00, 00]
    (unknown 7ffb) [32763] Sat Jan 01 00:00:00 UTC 4501
    (unknown 7ffc) [32764] Sat Jan 01 00:00:00 UTC 4501
    (unknown 7ffd) [32765] [00, 00, 00, 00]
    (unknown 7ffe) [32766] [00, 00]
    (unknown 7fff) [32767] [00, 00]
    AttachNum [3617] (PR_ATTACH_NUM) [05, 83, 00, 00]
    MappingSignature [4088] (PR_MAPPING_SIGNATURE) [A1, 19, 43, 18, D0, D9, 7A, 4B, 97, B4, 04, 30, 9E, 21, A6, 29]
    StoreRecordKey [4090] (PR_STORE_RECORD_KEY) [A1, 19, 43, 18, D0, D9, 7A, 4B, 97, B4, 04, 30, 9E, 21, A6, 29]
    ObjectType [4094] (PR_Object_TYPE) [07, 00, 00, 00]
    StoreSupportMask [13325] (PR_STORE_SUPPORT_MASK) [FD, 3F, A5, 06]
    (unknown 340f) [13327] [FD, 3F, A5, 06]


Attachment # 4

Level 2 : Type 6 : ID AttachRenderData [36866] (attAttachRenddata)
  Data of length 14
  00000000 01 00 A4 00 00 00 20 00 20 00 00 00 00 00       ..¤... . .....

Level 2 : Type 3 : ID AttachModifyDate [32787] (PR_LAST_MODIFICATION_TIME)
      Wed Apr 28 12:40:56 UTC 2010
  Data of length 14
  00000000 DA 07 04 00 1C 00 0C 00 28 00 38 00 03 00       Ú.......(.8...

Level 2 : Type 6 : ID AttachData [32783] (PR_ATTACH_DATA_BIN)
  Data of length 235
  00000000 54 68 65 20 71 75 69 63 6B 20 62 72 6F 77 6E 20 The quick brown
  00000000 66 6F 78 20 6A 75 6D 70 73 20 6F 76 65 72 20 74 fox jumps over t
  00000000 68 65 20 6C 61 7A 79 20 64 6F 67 0D 0A 0D 0A 4C he lazy dog....L

Level 2 : Type 1 : ID AttachTitle [32784] (PR_ATTACH_FILENAME)
      quick.txt
  Data of length 10
  00000000 71 75 69 63 6B 2E 74 78 74 00                   quick.txt.

Level 2 : Type 6 : ID AttachMetaFile [32785] (PR_ATTACH_RENDERING)
  Data of length 3512
  00000000 01 00 09 00 00 03 DC 06 00 00 00 00 21 06 00 00 ......Ü.....!...
  00000000 00 00 05 00 00 00 09 02 00 00 00 00 05 00 00 00 ................
  00000000 01 02 FF FF FF 00 A5 00 00 00 41 0B C6 00 88 00 ......¥...A.Æ...

Level 2 : Type 6 : ID Attachment [36869]
  Data of length 260
  00000000 14 00 00 00 03 00 20 0E 1B 0F 00 00 1E 00 01 30 ...... ........0
  00000000 01 00 00 00 0A 00 00 00 71 75 69 63 6B 2E 74 78 ........quick.tx
  00000000 74 00 00 00 02 01 02 37 01 00 00 00 00 00 00 00 t......7........

    AttachSize [3616] (PR_ATTACH_SIZE) [1B, 0F, 00, 00]
    DisplayName [12289] (PR_DISPLAY_NAME) quick.txt
    AttachEncoding [14082] (PR_ATTACH_ENCODING) []
    AttachExtension [14083] (PR_ATTACH_EXTENSION) .txt
    AttachMethod [14085] (PR_ATTACH_METHOD) [01, 00, 00, 00]
    AttachLongFilename [14087] (PR_ATTACH_LONG_FILENAME) quick.txt
    RenderingPosition [14091] (PR_RENDERING_POSITION) [A4, 00, 00, 00]
    AttachFlags [14100] (PR_ATTACH_FLAGS) [00, 00, 00, 00]
    (unknown 7ffa) [32762] [00, 00, 00, 00]
    (unknown 7ffb) [32763] Sat Jan 01 00:00:00 UTC 4501
    (unknown 7ffc) [32764] Sat Jan 01 00:00:00 UTC 4501
    (unknown 7ffd) [32765] [00, 00, 00, 00]
    (unknown 7ffe) [32766] [00, 00]
    (unknown 7fff) [32767] [00, 00]
    AttachNum [3617] (PR_ATTACH_NUM) [25, 83, 00, 00]
    MappingSignature [4088] (PR_MAPPING_SIGNATURE) [A1, 19, 43, 18, D0, D9, 7A, 4B, 97, B4, 04, 30, 9E, 21, A6, 29]
    StoreRecordKey [4090] (PR_STORE_RECORD_KEY) [A1, 19, 43, 18, D0, D9, 7A, 4B, 97, B4, 04, 30, 9E, 21, A6, 29]
    ObjectType [4094] (PR_Object_TYPE) [07, 00, 00, 00]
    StoreSupportMask [13325] (PR_STORE_SUPPORT_MASK) [FD, 3F, A5, 06]
    (unknown 340f) [13327] [FD, 3F, A5, 06]


Attachment # 5

Level 2 : Type 6 : ID AttachRenderData [36866] (attAttachRenddata)
  Data of length 14
  00000000 01 00 C3 00 00 00 20 00 20 00 00 00 00 00       ..Ã... . .....

Level 2 : Type 3 : ID AttachModifyDate [32787] (PR_LAST_MODIFICATION_TIME)
      Wed Apr 28 12:40:56 UTC 2010
  Data of length 14
  00000000 DA 07 04 00 1C 00 0C 00 28 00 38 00 03 00       Ú.......(.8...

Level 2 : Type 6 : ID AttachData [32783] (PR_ATTACH_DATA_BIN)
  Data of length 143
  00000000 3C 3F 78 6D 6C 20 76 65 72 73 69 6F 6E 3D 22 31 <?xml version="1
  00000000 2E 30 22 20 65 6E 63 6F 64 69 6E 67 3D 22 55 54 .0" encoding="UT
  00000000 46 2D 38 22 20 73 74 61 6E 64 61 6C 6F 6E 65 3D F-8" standalone=

Level 2 : Type 1 : ID AttachTitle [32784] (PR_ATTACH_FILENAME)
      quick.xml
  Data of length 10
  00000000 71 75 69 63 6B 2E 78 6D 6C 00                   quick.xml.

Level 2 : Type 6 : ID AttachMetaFile [32785] (PR_ATTACH_RENDERING)
  Data of length 3512
  00000000 01 00 09 00 00 03 DC 06 00 00 00 00 21 06 00 00 ......Ü.....!...
  00000000 00 00 05 00 00 00 09 02 00 00 00 00 05 00 00 00 ................
  00000000 01 02 FF FF FF 00 A5 00 00 00 41 0B C6 00 88 00 ......¥...A.Æ...

Level 2 : Type 6 : ID Attachment [36869]
  Data of length 260
  00000000 14 00 00 00 03 00 20 0E BF 0E 00 00 1E 00 01 30 ...... .¿......0
  00000000 01 00 00 00 0A 00 00 00 71 75 69 63 6B 2E 78 6D ........quick.xm
  00000000 6C 00 00 00 02 01 02 37 01 00 00 00 00 00 00 00 l......7........

    AttachSize [3616] (PR_ATTACH_SIZE) [BF, 0E, 00, 00]
    DisplayName [12289] (PR_DISPLAY_NAME) quick.xml
    AttachEncoding [14082] (PR_ATTACH_ENCODING) []
    AttachExtension [14083] (PR_ATTACH_EXTENSION) .xml
    AttachMethod [14085] (PR_ATTACH_METHOD) [01, 00, 00, 00]
    AttachLongFilename [14087] (PR_ATTACH_LONG_FILENAME) quick.xml
    RenderingPosition [14091] (PR_RENDERING_POSITION) [C3, 00, 00, 00]
    AttachFlags [14100] (PR_ATTACH_FLAGS) [00, 00, 00, 00]
    (unknown 7ffa) [32762] [00, 00, 00, 00]
    (unknown 7ffb) [32763] Sat Jan 01 00:00:00 UTC 4501
    (unknown 7ffc) [32764] Sat Jan 01 00:00:00 UTC 4501
    (unknown 7ffd) [32765] [00, 00, 00, 00]
    (unknown 7ffe) [32766] [00, 00]
    (unknown 7fff) [32767] [00, 00]
    AttachNum [3617] (PR_ATTACH_NUM) [45, 83, 00, 00]
    MappingSignature [4088] (PR_MAPPING_SIGNATURE) [A1, 19, 43, 18, D0, D9, 7A, 4B, 97, B4, 04, 30, 9E, 21, A6, 29]
    StoreRecordKey [4090] (PR_STORE_RECORD_KEY) [A1, 19, 43, 18, D0, D9, 7A, 4B, 97, B4, 04, 30, 9E, 21, A6, 29]
    ObjectType [4094] (PR_Object_TYPE) [07, 00, 00, 00]
    StoreSupportMask [13325] (PR_STORE_SUPPORT_MASK) [FD, 3F, A5, 06]
    (unknown 340f) [13327] [FD, 3F, A5, 06]

Tests run: 3, Failures: 0, Errors: 0, Skipped: 0, Time elapsed: 0.075 sec - in org.apache.poi.hmef.dev.TestHMEFDumper
Running org.apache.poi.hmef.TestCompressedRTF
Tests run: 4, Failures: 0, Errors: 0, Skipped: 0, Time elapsed: 0.005 sec - in org.apache.poi.hmef.TestCompressedRTF
Running org.apache.poi.hmef.TestHMEFMessage
Tests run: 10, Failures: 0, Errors: 0, Skipped: 0, Time elapsed: 0.023 sec - in org.apache.poi.hmef.TestHMEFMessage
Running org.apache.poi.hmef.extractor.TestHMEFContentsExtractor
Extracting...
Extraction completed
Tests run: 3, Failures: 0, Errors: 0, Skipped: 0, Time elapsed: 0.004 sec - in org.apache.poi.hmef.extractor.TestHMEFContentsExtractor
Running org.apache.poi.TestPOIDocumentScratchpad
Tests run: 4, Failures: 0, Errors: 0, Skipped: 0, Time elapsed: 0.005 sec - in org.apache.poi.TestPOIDocumentScratchpad
Running org.apache.poi.hwmf.TestHwmfParsing
Tests run: 7, Failures: 0, Errors: 0, Skipped: 5, Time elapsed: 0.027 sec - in org.apache.poi.hwmf.TestHwmfParsing

Results :

Tests in error:
  TestHWPFPictures.testMacImages:152 » IIO Can't create cache file!

Tests run: 792, Failures: 0, Errors: 1, Skipped: 10

[INFO] ------------------------------------------------------------------------
[INFO] Reactor Summary:
[INFO]
[INFO] Apache POI - the Java API for Microsoft Documents . SUCCESS [  0.002 s]
[INFO] Apache POI Main package ........................... SUCCESS [01:24 min]
[INFO] Apache POI Scratchpad package ..................... FAILURE [ 15.446 s]
[INFO] Apache POI - Openxmlformats Schema package ........ SKIPPED
[INFO] Apache POI - Openxmlformats Encryption Schema package  SKIPPED
[INFO] Apache POI - Openxmlformats Security-Schema package  SKIPPED
[INFO] Apache POI OOXML package .......................... SKIPPED
[INFO] Apache POI ExcelAnt package ....................... SKIPPED
[INFO] Apache POI Examples package ....................... SKIPPED
[INFO] ------------------------------------------------------------------------
[INFO] BUILD FAILURE
[INFO] ------------------------------------------------------------------------
[INFO] Total time: 01:40 min
[INFO] Finished at: 2017-11-21T20:06:40+00:00
[INFO] Final Memory: 37M/811M
[INFO] ------------------------------------------------------------------------
[ERROR] Failed to execute goal org.apache.maven.plugins:maven-surefire-plugin:2.19.1:test (default-test) on project poi-scratchpad: There are test failures.
[ERROR]
[ERROR] Please refer to <https://builds.apache.org/job/POI-DSL-Maven/ws/sonar/scratchpad/target/surefire-reports> for the individual test results.
[ERROR] -> [Help 1]
[ERROR]
[ERROR] To see the full stack trace of the errors, re-run Maven with the -e switch.
[ERROR] Re-run Maven using the -X switch to enable full debug logging.
[ERROR]
[ERROR] For more information about the errors and possible solutions, please read the following articles:
[ERROR] [Help 1] http://cwiki.apache.org/confluence/display/MAVEN/MojoFailureException
[ERROR]
[ERROR] After correcting the problems, you can resume the build with the command
[ERROR]   mvn <goals> -rf :poi-scratchpad
Build step 'Invoke top-level Maven targets' marked build as failure
Recording test results

---------------------------------------------------------------------
To unsubscribe, e-mail: [hidden email]
For additional commands, e-mail: [hidden email]

Reply | Threaded
Open this post in threaded view
|

Build failed in Jenkins: POI-DSL-Maven #409

Apache Jenkins Server
See <https://builds.apache.org/job/POI-DSL-Maven/409/display/redirect?page=changes>

Changes:

[fanningpj] add forbidden api checks for non-Locale toLowerCase and toUpperCase

[fanningpj] add forbidden api checks for non-Locale toLowerCase and toUpperCase

[fanningpj] remove more uses of Character.toUpperCase

[fanningpj] Note the upgrade of commons-codec

------------------------------------------
[...truncated 1.10 MB...]
  Data of length 260
  00000000 14 00 00 00 03 00 20 0E E6 0F 00 00 1E 00 01 30 ...... .æ......0
  00000000 01 00 00 00 0B 00 00 00 71 75 69 63 6B 2E 68 74 ........quick.ht
  00000000 6D 6C 00 00 02 01 02 37 01 00 00 00 00 00 00 00 ml.....7........

    AttachSize [3616] (PR_ATTACH_SIZE) [E6, 0F, 00, 00]
    DisplayName [12289] (PR_DISPLAY_NAME) quick.html
    AttachEncoding [14082] (PR_ATTACH_ENCODING) []
    AttachExtension [14083] (PR_ATTACH_EXTENSION) .html
    AttachMethod [14085] (PR_ATTACH_METHOD) [01, 00, 00, 00]
    AttachLongFilename [14087] (PR_ATTACH_LONG_FILENAME) quick.html
    RenderingPosition [14091] (PR_RENDERING_POSITION) [37, 00, 00, 00]
    AttachFlags [14100] (PR_ATTACH_FLAGS) [00, 00, 00, 00]
    (unknown 7ffa) [32762] [00, 00, 00, 00]
    (unknown 7ffb) [32763] Sat Jan 01 00:00:00 UTC 4501
    (unknown 7ffc) [32764] Sat Jan 01 00:00:00 UTC 4501
    (unknown 7ffd) [32765] [00, 00, 00, 00]
    (unknown 7ffe) [32766] [00, 00]
    (unknown 7fff) [32767] [00, 00]
    AttachNum [3617] (PR_ATTACH_NUM) [E5, 82, 00, 00]
    MappingSignature [4088] (PR_MAPPING_SIGNATURE) [A1, 19, 43, 18, D0, D9, 7A, 4B, 97, B4, 04, 30, 9E, 21, A6, 29]
    StoreRecordKey [4090] (PR_STORE_RECORD_KEY) [A1, 19, 43, 18, D0, D9, 7A, 4B, 97, B4, 04, 30, 9E, 21, A6, 29]
    ObjectType [4094] (PR_Object_TYPE) [07, 00, 00, 00]
    StoreSupportMask [13325] (PR_STORE_SUPPORT_MASK) [FD, 3F, A5, 06]
    (unknown 340f) [13327] [FD, 3F, A5, 06]


Attachment # 3

Level 2 : Type 6 : ID AttachRenderData [36866] (attAttachRenddata)
  Data of length 14
  00000000 01 00 56 00 00 00 20 00 20 00 00 00 00 00       ..V... . .....

Level 2 : Type 3 : ID AttachModifyDate [32787] (PR_LAST_MODIFICATION_TIME)
      Wed Apr 28 12:40:56 UTC 2010
  Data of length 14
  00000000 DA 07 04 00 1C 00 0C 00 28 00 38 00 03 00       Ú.......(.8...

Level 2 : Type 6 : ID AttachData [32783] (PR_ATTACH_DATA_BIN)
  Data of length 18638
  00000000 25 50 44 46 2D 31 2E 33 0D 25 E2 E3 CF D3 0D 0A %PDF-1.3.%âãÏÓ..
  00000000 31 20 30 20 6F 62 6A 0D 3C 3C 20 2F 4C 65 6E 67 1 0 obj.<< /Leng
  00000000 74 68 20 32 20 30 20 52 20 2F 46 69 6C 74 65 72 th 2 0 R /Filter

Level 2 : Type 1 : ID AttachTitle [32784] (PR_ATTACH_FILENAME)
      quick.pdf
  Data of length 10
  00000000 71 75 69 63 6B 2E 70 64 66 00                   quick.pdf.

Level 2 : Type 6 : ID AttachMetaFile [32785] (PR_ATTACH_RENDERING)
  Data of length 3512
  00000000 01 00 09 00 00 03 DC 06 00 00 00 00 21 06 00 00 ......Ü.....!...
  00000000 00 00 05 00 00 00 09 02 00 00 00 00 05 00 00 00 ................
  00000000 01 02 FF FF FF 00 A5 00 00 00 41 0B C6 00 88 00 ......¥...A.Æ...

Level 2 : Type 6 : ID Attachment [36869]
  Data of length 260
  00000000 14 00 00 00 03 00 20 0E FE 56 00 00 1E 00 01 30 ...... .þV.....0
  00000000 01 00 00 00 0A 00 00 00 71 75 69 63 6B 2E 70 64 ........quick.pd
  00000000 66 00 00 00 02 01 02 37 01 00 00 00 00 00 00 00 f......7........

    AttachSize [3616] (PR_ATTACH_SIZE) [FE, 56, 00, 00]
    DisplayName [12289] (PR_DISPLAY_NAME) quick.pdf
    AttachEncoding [14082] (PR_ATTACH_ENCODING) []
    AttachExtension [14083] (PR_ATTACH_EXTENSION) .pdf
    AttachMethod [14085] (PR_ATTACH_METHOD) [01, 00, 00, 00]
    AttachLongFilename [14087] (PR_ATTACH_LONG_FILENAME) quick.pdf
    RenderingPosition [14091] (PR_RENDERING_POSITION) [56, 00, 00, 00]
    AttachFlags [14100] (PR_ATTACH_FLAGS) [00, 00, 00, 00]
    (unknown 7ffa) [32762] [00, 00, 00, 00]
    (unknown 7ffb) [32763] Sat Jan 01 00:00:00 UTC 4501
    (unknown 7ffc) [32764] Sat Jan 01 00:00:00 UTC 4501
    (unknown 7ffd) [32765] [00, 00, 00, 00]
    (unknown 7ffe) [32766] [00, 00]
    (unknown 7fff) [32767] [00, 00]
    AttachNum [3617] (PR_ATTACH_NUM) [05, 83, 00, 00]
    MappingSignature [4088] (PR_MAPPING_SIGNATURE) [A1, 19, 43, 18, D0, D9, 7A, 4B, 97, B4, 04, 30, 9E, 21, A6, 29]
    StoreRecordKey [4090] (PR_STORE_RECORD_KEY) [A1, 19, 43, 18, D0, D9, 7A, 4B, 97, B4, 04, 30, 9E, 21, A6, 29]
    ObjectType [4094] (PR_Object_TYPE) [07, 00, 00, 00]
    StoreSupportMask [13325] (PR_STORE_SUPPORT_MASK) [FD, 3F, A5, 06]
    (unknown 340f) [13327] [FD, 3F, A5, 06]


Attachment # 4

Level 2 : Type 6 : ID AttachRenderData [36866] (attAttachRenddata)
  Data of length 14
  00000000 01 00 A4 00 00 00 20 00 20 00 00 00 00 00       ..¤... . .....

Level 2 : Type 3 : ID AttachModifyDate [32787] (PR_LAST_MODIFICATION_TIME)
      Wed Apr 28 12:40:56 UTC 2010
  Data of length 14
  00000000 DA 07 04 00 1C 00 0C 00 28 00 38 00 03 00       Ú.......(.8...

Level 2 : Type 6 : ID AttachData [32783] (PR_ATTACH_DATA_BIN)
  Data of length 235
  00000000 54 68 65 20 71 75 69 63 6B 20 62 72 6F 77 6E 20 The quick brown
  00000000 66 6F 78 20 6A 75 6D 70 73 20 6F 76 65 72 20 74 fox jumps over t
  00000000 68 65 20 6C 61 7A 79 20 64 6F 67 0D 0A 0D 0A 4C he lazy dog....L

Level 2 : Type 1 : ID AttachTitle [32784] (PR_ATTACH_FILENAME)
      quick.txt
  Data of length 10
  00000000 71 75 69 63 6B 2E 74 78 74 00                   quick.txt.

Level 2 : Type 6 : ID AttachMetaFile [32785] (PR_ATTACH_RENDERING)
  Data of length 3512
  00000000 01 00 09 00 00 03 DC 06 00 00 00 00 21 06 00 00 ......Ü.....!...
  00000000 00 00 05 00 00 00 09 02 00 00 00 00 05 00 00 00 ................
  00000000 01 02 FF FF FF 00 A5 00 00 00 41 0B C6 00 88 00 ......¥...A.Æ...

Level 2 : Type 6 : ID Attachment [36869]
  Data of length 260
  00000000 14 00 00 00 03 00 20 0E 1B 0F 00 00 1E 00 01 30 ...... ........0
  00000000 01 00 00 00 0A 00 00 00 71 75 69 63 6B 2E 74 78 ........quick.tx
  00000000 74 00 00 00 02 01 02 37 01 00 00 00 00 00 00 00 t......7........

    AttachSize [3616] (PR_ATTACH_SIZE) [1B, 0F, 00, 00]
    DisplayName [12289] (PR_DISPLAY_NAME) quick.txt
    AttachEncoding [14082] (PR_ATTACH_ENCODING) []
    AttachExtension [14083] (PR_ATTACH_EXTENSION) .txt
    AttachMethod [14085] (PR_ATTACH_METHOD) [01, 00, 00, 00]
    AttachLongFilename [14087] (PR_ATTACH_LONG_FILENAME) quick.txt
    RenderingPosition [14091] (PR_RENDERING_POSITION) [A4, 00, 00, 00]
    AttachFlags [14100] (PR_ATTACH_FLAGS) [00, 00, 00, 00]
    (unknown 7ffa) [32762] [00, 00, 00, 00]
    (unknown 7ffb) [32763] Sat Jan 01 00:00:00 UTC 4501
    (unknown 7ffc) [32764] Sat Jan 01 00:00:00 UTC 4501
    (unknown 7ffd) [32765] [00, 00, 00, 00]
    (unknown 7ffe) [32766] [00, 00]
    (unknown 7fff) [32767] [00, 00]
    AttachNum [3617] (PR_ATTACH_NUM) [25, 83, 00, 00]
    MappingSignature [4088] (PR_MAPPING_SIGNATURE) [A1, 19, 43, 18, D0, D9, 7A, 4B, 97, B4, 04, 30, 9E, 21, A6, 29]
    StoreRecordKey [4090] (PR_STORE_RECORD_KEY) [A1, 19, 43, 18, D0, D9, 7A, 4B, 97, B4, 04, 30, 9E, 21, A6, 29]
    ObjectType [4094] (PR_Object_TYPE) [07, 00, 00, 00]
    StoreSupportMask [13325] (PR_STORE_SUPPORT_MASK) [FD, 3F, A5, 06]
    (unknown 340f) [13327] [FD, 3F, A5, 06]


Attachment # 5

Level 2 : Type 6 : ID AttachRenderData [36866] (attAttachRenddata)
  Data of length 14
  00000000 01 00 C3 00 00 00 20 00 20 00 00 00 00 00       ..Ã... . .....

Level 2 : Type 3 : ID AttachModifyDate [32787] (PR_LAST_MODIFICATION_TIME)
      Wed Apr 28 12:40:56 UTC 2010
  Data of length 14
  00000000 DA 07 04 00 1C 00 0C 00 28 00 38 00 03 00       Ú.......(.8...

Level 2 : Type 6 : ID AttachData [32783] (PR_ATTACH_DATA_BIN)
  Data of length 143
  00000000 3C 3F 78 6D 6C 20 76 65 72 73 69 6F 6E 3D 22 31 <?xml version="1
  00000000 2E 30 22 20 65 6E 63 6F 64 69 6E 67 3D 22 55 54 .0" encoding="UT
  00000000 46 2D 38 22 20 73 74 61 6E 64 61 6C 6F 6E 65 3D F-8" standalone=

Level 2 : Type 1 : ID AttachTitle [32784] (PR_ATTACH_FILENAME)
      quick.xml
  Data of length 10
  00000000 71 75 69 63 6B 2E 78 6D 6C 00                   quick.xml.

Level 2 : Type 6 : ID AttachMetaFile [32785] (PR_ATTACH_RENDERING)
  Data of length 3512
  00000000 01 00 09 00 00 03 DC 06 00 00 00 00 21 06 00 00 ......Ü.....!...
  00000000 00 00 05 00 00 00 09 02 00 00 00 00 05 00 00 00 ................
  00000000 01 02 FF FF FF 00 A5 00 00 00 41 0B C6 00 88 00 ......¥...A.Æ...

Level 2 : Type 6 : ID Attachment [36869]
  Data of length 260
  00000000 14 00 00 00 03 00 20 0E BF 0E 00 00 1E 00 01 30 ...... .¿......0
  00000000 01 00 00 00 0A 00 00 00 71 75 69 63 6B 2E 78 6D ........quick.xm
  00000000 6C 00 00 00 02 01 02 37 01 00 00 00 00 00 00 00 l......7........

    AttachSize [3616] (PR_ATTACH_SIZE) [BF, 0E, 00, 00]
    DisplayName [12289] (PR_DISPLAY_NAME) quick.xml
    AttachEncoding [14082] (PR_ATTACH_ENCODING) []
    AttachExtension [14083] (PR_ATTACH_EXTENSION) .xml
    AttachMethod [14085] (PR_ATTACH_METHOD) [01, 00, 00, 00]
    AttachLongFilename [14087] (PR_ATTACH_LONG_FILENAME) quick.xml
    RenderingPosition [14091] (PR_RENDERING_POSITION) [C3, 00, 00, 00]
    AttachFlags [14100] (PR_ATTACH_FLAGS) [00, 00, 00, 00]
    (unknown 7ffa) [32762] [00, 00, 00, 00]
    (unknown 7ffb) [32763] Sat Jan 01 00:00:00 UTC 4501
    (unknown 7ffc) [32764] Sat Jan 01 00:00:00 UTC 4501
    (unknown 7ffd) [32765] [00, 00, 00, 00]
    (unknown 7ffe) [32766] [00, 00]
    (unknown 7fff) [32767] [00, 00]
    AttachNum [3617] (PR_ATTACH_NUM) [45, 83, 00, 00]
    MappingSignature [4088] (PR_MAPPING_SIGNATURE) [A1, 19, 43, 18, D0, D9, 7A, 4B, 97, B4, 04, 30, 9E, 21, A6, 29]
    StoreRecordKey [4090] (PR_STORE_RECORD_KEY) [A1, 19, 43, 18, D0, D9, 7A, 4B, 97, B4, 04, 30, 9E, 21, A6, 29]
    ObjectType [4094] (PR_Object_TYPE) [07, 00, 00, 00]
    StoreSupportMask [13325] (PR_STORE_SUPPORT_MASK) [FD, 3F, A5, 06]
    (unknown 340f) [13327] [FD, 3F, A5, 06]

Tests run: 3, Failures: 0, Errors: 0, Skipped: 0, Time elapsed: 0.331 sec - in org.apache.poi.hmef.dev.TestHMEFDumper
Running org.apache.poi.hmef.TestCompressedRTF
Tests run: 4, Failures: 0, Errors: 0, Skipped: 0, Time elapsed: 0.007 sec - in org.apache.poi.hmef.TestCompressedRTF
Running org.apache.poi.hmef.TestHMEFMessage
Tests run: 10, Failures: 0, Errors: 0, Skipped: 0, Time elapsed: 0.018 sec - in org.apache.poi.hmef.TestHMEFMessage
Running org.apache.poi.hmef.extractor.TestHMEFContentsExtractor
Extracting...
Extraction completed
Tests run: 3, Failures: 0, Errors: 0, Skipped: 0, Time elapsed: 0.006 sec - in org.apache.poi.hmef.extractor.TestHMEFContentsExtractor
Running org.apache.poi.TestPOIDocumentScratchpad
Tests run: 4, Failures: 0, Errors: 0, Skipped: 0, Time elapsed: 0.007 sec - in org.apache.poi.TestPOIDocumentScratchpad
Running org.apache.poi.hwmf.TestHwmfParsing
Tests run: 7, Failures: 0, Errors: 0, Skipped: 5, Time elapsed: 0.034 sec - in org.apache.poi.hwmf.TestHwmfParsing

Results :

Tests in error:
  TestHWPFPictures.testMacImages:152 » IIO Can't create cache file!

Tests run: 792, Failures: 0, Errors: 1, Skipped: 10

[INFO] ------------------------------------------------------------------------
[INFO] Reactor Summary:
[INFO]
[INFO] Apache POI - the Java API for Microsoft Documents . SUCCESS [  0.002 s]
[INFO] Apache POI Main package ........................... SUCCESS [01:39 min]
[INFO] Apache POI Scratchpad package ..................... FAILURE [ 17.817 s]
[INFO] Apache POI - Openxmlformats Schema package ........ SKIPPED
[INFO] Apache POI - Openxmlformats Encryption Schema package  SKIPPED
[INFO] Apache POI - Openxmlformats Security-Schema package  SKIPPED
[INFO] Apache POI OOXML package .......................... SKIPPED
[INFO] Apache POI ExcelAnt package ....................... SKIPPED
[INFO] Apache POI Examples package ....................... SKIPPED
[INFO] ------------------------------------------------------------------------
[INFO] BUILD FAILURE
[INFO] ------------------------------------------------------------------------
[INFO] Total time: 01:57 min
[INFO] Finished at: 2017-11-22T00:07:06+00:00
[INFO] Final Memory: 36M/809M
[INFO] ------------------------------------------------------------------------
[ERROR] Failed to execute goal org.apache.maven.plugins:maven-surefire-plugin:2.19.1:test (default-test) on project poi-scratchpad: There are test failures.
[ERROR]
[ERROR] Please refer to <https://builds.apache.org/job/POI-DSL-Maven/ws/sonar/scratchpad/target/surefire-reports> for the individual test results.
[ERROR] -> [Help 1]
[ERROR]
[ERROR] To see the full stack trace of the errors, re-run Maven with the -e switch.
[ERROR] Re-run Maven using the -X switch to enable full debug logging.
[ERROR]
[ERROR] For more information about the errors and possible solutions, please read the following articles:
[ERROR] [Help 1] http://cwiki.apache.org/confluence/display/MAVEN/MojoFailureException
[ERROR]
[ERROR] After correcting the problems, you can resume the build with the command
[ERROR]   mvn <goals> -rf :poi-scratchpad
Build step 'Invoke top-level Maven targets' marked build as failure
Recording test results

---------------------------------------------------------------------
To unsubscribe, e-mail: [hidden email]
For additional commands, e-mail: [hidden email]

Reply | Threaded
Open this post in threaded view
|

Build failed in Jenkins: POI-DSL-Maven #410

Apache Jenkins Server
See <https://builds.apache.org/job/POI-DSL-Maven/410/display/redirect?page=changes>

Changes:

[fanningpj] use codepoint iterator in a few places

------------------------------------------
[...truncated 1.10 MB...]
  Data of length 260
  00000000 14 00 00 00 03 00 20 0E E6 0F 00 00 1E 00 01 30 ...... .æ......0
  00000000 01 00 00 00 0B 00 00 00 71 75 69 63 6B 2E 68 74 ........quick.ht
  00000000 6D 6C 00 00 02 01 02 37 01 00 00 00 00 00 00 00 ml.....7........

    AttachSize [3616] (PR_ATTACH_SIZE) [E6, 0F, 00, 00]
    DisplayName [12289] (PR_DISPLAY_NAME) quick.html
    AttachEncoding [14082] (PR_ATTACH_ENCODING) []
    AttachExtension [14083] (PR_ATTACH_EXTENSION) .html
    AttachMethod [14085] (PR_ATTACH_METHOD) [01, 00, 00, 00]
    AttachLongFilename [14087] (PR_ATTACH_LONG_FILENAME) quick.html
    RenderingPosition [14091] (PR_RENDERING_POSITION) [37, 00, 00, 00]
    AttachFlags [14100] (PR_ATTACH_FLAGS) [00, 00, 00, 00]
    (unknown 7ffa) [32762] [00, 00, 00, 00]
    (unknown 7ffb) [32763] Sat Jan 01 00:00:00 UTC 4501
    (unknown 7ffc) [32764] Sat Jan 01 00:00:00 UTC 4501
    (unknown 7ffd) [32765] [00, 00, 00, 00]
    (unknown 7ffe) [32766] [00, 00]
    (unknown 7fff) [32767] [00, 00]
    AttachNum [3617] (PR_ATTACH_NUM) [E5, 82, 00, 00]
    MappingSignature [4088] (PR_MAPPING_SIGNATURE) [A1, 19, 43, 18, D0, D9, 7A, 4B, 97, B4, 04, 30, 9E, 21, A6, 29]
    StoreRecordKey [4090] (PR_STORE_RECORD_KEY) [A1, 19, 43, 18, D0, D9, 7A, 4B, 97, B4, 04, 30, 9E, 21, A6, 29]
    ObjectType [4094] (PR_Object_TYPE) [07, 00, 00, 00]
    StoreSupportMask [13325] (PR_STORE_SUPPORT_MASK) [FD, 3F, A5, 06]
    (unknown 340f) [13327] [FD, 3F, A5, 06]


Attachment # 3

Level 2 : Type 6 : ID AttachRenderData [36866] (attAttachRenddata)
  Data of length 14
  00000000 01 00 56 00 00 00 20 00 20 00 00 00 00 00       ..V... . .....

Level 2 : Type 3 : ID AttachModifyDate [32787] (PR_LAST_MODIFICATION_TIME)
      Wed Apr 28 12:40:56 UTC 2010
  Data of length 14
  00000000 DA 07 04 00 1C 00 0C 00 28 00 38 00 03 00       Ú.......(.8...

Level 2 : Type 6 : ID AttachData [32783] (PR_ATTACH_DATA_BIN)
  Data of length 18638
  00000000 25 50 44 46 2D 31 2E 33 0D 25 E2 E3 CF D3 0D 0A %PDF-1.3.%âãÏÓ..
  00000000 31 20 30 20 6F 62 6A 0D 3C 3C 20 2F 4C 65 6E 67 1 0 obj.<< /Leng
  00000000 74 68 20 32 20 30 20 52 20 2F 46 69 6C 74 65 72 th 2 0 R /Filter

Level 2 : Type 1 : ID AttachTitle [32784] (PR_ATTACH_FILENAME)
      quick.pdf
  Data of length 10
  00000000 71 75 69 63 6B 2E 70 64 66 00                   quick.pdf.

Level 2 : Type 6 : ID AttachMetaFile [32785] (PR_ATTACH_RENDERING)
  Data of length 3512
  00000000 01 00 09 00 00 03 DC 06 00 00 00 00 21 06 00 00 ......Ü.....!...
  00000000 00 00 05 00 00 00 09 02 00 00 00 00 05 00 00 00 ................
  00000000 01 02 FF FF FF 00 A5 00 00 00 41 0B C6 00 88 00 ......¥...A.Æ...

Level 2 : Type 6 : ID Attachment [36869]
  Data of length 260
  00000000 14 00 00 00 03 00 20 0E FE 56 00 00 1E 00 01 30 ...... .þV.....0
  00000000 01 00 00 00 0A 00 00 00 71 75 69 63 6B 2E 70 64 ........quick.pd
  00000000 66 00 00 00 02 01 02 37 01 00 00 00 00 00 00 00 f......7........

    AttachSize [3616] (PR_ATTACH_SIZE) [FE, 56, 00, 00]
    DisplayName [12289] (PR_DISPLAY_NAME) quick.pdf
    AttachEncoding [14082] (PR_ATTACH_ENCODING) []
    AttachExtension [14083] (PR_ATTACH_EXTENSION) .pdf
    AttachMethod [14085] (PR_ATTACH_METHOD) [01, 00, 00, 00]
    AttachLongFilename [14087] (PR_ATTACH_LONG_FILENAME) quick.pdf
    RenderingPosition [14091] (PR_RENDERING_POSITION) [56, 00, 00, 00]
    AttachFlags [14100] (PR_ATTACH_FLAGS) [00, 00, 00, 00]
    (unknown 7ffa) [32762] [00, 00, 00, 00]
    (unknown 7ffb) [32763] Sat Jan 01 00:00:00 UTC 4501
    (unknown 7ffc) [32764] Sat Jan 01 00:00:00 UTC 4501
    (unknown 7ffd) [32765] [00, 00, 00, 00]
    (unknown 7ffe) [32766] [00, 00]
    (unknown 7fff) [32767] [00, 00]
    AttachNum [3617] (PR_ATTACH_NUM) [05, 83, 00, 00]
    MappingSignature [4088] (PR_MAPPING_SIGNATURE) [A1, 19, 43, 18, D0, D9, 7A, 4B, 97, B4, 04, 30, 9E, 21, A6, 29]
    StoreRecordKey [4090] (PR_STORE_RECORD_KEY) [A1, 19, 43, 18, D0, D9, 7A, 4B, 97, B4, 04, 30, 9E, 21, A6, 29]
    ObjectType [4094] (PR_Object_TYPE) [07, 00, 00, 00]
    StoreSupportMask [13325] (PR_STORE_SUPPORT_MASK) [FD, 3F, A5, 06]
    (unknown 340f) [13327] [FD, 3F, A5, 06]


Attachment # 4

Level 2 : Type 6 : ID AttachRenderData [36866] (attAttachRenddata)
  Data of length 14
  00000000 01 00 A4 00 00 00 20 00 20 00 00 00 00 00       ..¤... . .....

Level 2 : Type 3 : ID AttachModifyDate [32787] (PR_LAST_MODIFICATION_TIME)
      Wed Apr 28 12:40:56 UTC 2010
  Data of length 14
  00000000 DA 07 04 00 1C 00 0C 00 28 00 38 00 03 00       Ú.......(.8...

Level 2 : Type 6 : ID AttachData [32783] (PR_ATTACH_DATA_BIN)
  Data of length 235
  00000000 54 68 65 20 71 75 69 63 6B 20 62 72 6F 77 6E 20 The quick brown
  00000000 66 6F 78 20 6A 75 6D 70 73 20 6F 76 65 72 20 74 fox jumps over t
  00000000 68 65 20 6C 61 7A 79 20 64 6F 67 0D 0A 0D 0A 4C he lazy dog....L

Level 2 : Type 1 : ID AttachTitle [32784] (PR_ATTACH_FILENAME)
      quick.txt
  Data of length 10
  00000000 71 75 69 63 6B 2E 74 78 74 00                   quick.txt.

Level 2 : Type 6 : ID AttachMetaFile [32785] (PR_ATTACH_RENDERING)
  Data of length 3512
  00000000 01 00 09 00 00 03 DC 06 00 00 00 00 21 06 00 00 ......Ü.....!...
  00000000 00 00 05 00 00 00 09 02 00 00 00 00 05 00 00 00 ................
  00000000 01 02 FF FF FF 00 A5 00 00 00 41 0B C6 00 88 00 ......¥...A.Æ...

Level 2 : Type 6 : ID Attachment [36869]
  Data of length 260
  00000000 14 00 00 00 03 00 20 0E 1B 0F 00 00 1E 00 01 30 ...... ........0
  00000000 01 00 00 00 0A 00 00 00 71 75 69 63 6B 2E 74 78 ........quick.tx
  00000000 74 00 00 00 02 01 02 37 01 00 00 00 00 00 00 00 t......7........

    AttachSize [3616] (PR_ATTACH_SIZE) [1B, 0F, 00, 00]
    DisplayName [12289] (PR_DISPLAY_NAME) quick.txt
    AttachEncoding [14082] (PR_ATTACH_ENCODING) []
    AttachExtension [14083] (PR_ATTACH_EXTENSION) .txt
    AttachMethod [14085] (PR_ATTACH_METHOD) [01, 00, 00, 00]
    AttachLongFilename [14087] (PR_ATTACH_LONG_FILENAME) quick.txt
    RenderingPosition [14091] (PR_RENDERING_POSITION) [A4, 00, 00, 00]
    AttachFlags [14100] (PR_ATTACH_FLAGS) [00, 00, 00, 00]
    (unknown 7ffa) [32762] [00, 00, 00, 00]
    (unknown 7ffb) [32763] Sat Jan 01 00:00:00 UTC 4501
    (unknown 7ffc) [32764] Sat Jan 01 00:00:00 UTC 4501
    (unknown 7ffd) [32765] [00, 00, 00, 00]
    (unknown 7ffe) [32766] [00, 00]
    (unknown 7fff) [32767] [00, 00]
    AttachNum [3617] (PR_ATTACH_NUM) [25, 83, 00, 00]
    MappingSignature [4088] (PR_MAPPING_SIGNATURE) [A1, 19, 43, 18, D0, D9, 7A, 4B, 97, B4, 04, 30, 9E, 21, A6, 29]
    StoreRecordKey [4090] (PR_STORE_RECORD_KEY) [A1, 19, 43, 18, D0, D9, 7A, 4B, 97, B4, 04, 30, 9E, 21, A6, 29]
    ObjectType [4094] (PR_Object_TYPE) [07, 00, 00, 00]
    StoreSupportMask [13325] (PR_STORE_SUPPORT_MASK) [FD, 3F, A5, 06]
    (unknown 340f) [13327] [FD, 3F, A5, 06]


Attachment # 5

Level 2 : Type 6 : ID AttachRenderData [36866] (attAttachRenddata)
  Data of length 14
  00000000 01 00 C3 00 00 00 20 00 20 00 00 00 00 00       ..Ã... . .....

Level 2 : Type 3 : ID AttachModifyDate [32787] (PR_LAST_MODIFICATION_TIME)
      Wed Apr 28 12:40:56 UTC 2010
  Data of length 14
  00000000 DA 07 04 00 1C 00 0C 00 28 00 38 00 03 00       Ú.......(.8...

Level 2 : Type 6 : ID AttachData [32783] (PR_ATTACH_DATA_BIN)
  Data of length 143
  00000000 3C 3F 78 6D 6C 20 76 65 72 73 69 6F 6E 3D 22 31 <?xml version="1
  00000000 2E 30 22 20 65 6E 63 6F 64 69 6E 67 3D 22 55 54 .0" encoding="UT
  00000000 46 2D 38 22 20 73 74 61 6E 64 61 6C 6F 6E 65 3D F-8" standalone=

Level 2 : Type 1 : ID AttachTitle [32784] (PR_ATTACH_FILENAME)
      quick.xml
  Data of length 10
  00000000 71 75 69 63 6B 2E 78 6D 6C 00                   quick.xml.

Level 2 : Type 6 : ID AttachMetaFile [32785] (PR_ATTACH_RENDERING)
  Data of length 3512
  00000000 01 00 09 00 00 03 DC 06 00 00 00 00 21 06 00 00 ......Ü.....!...
  00000000 00 00 05 00 00 00 09 02 00 00 00 00 05 00 00 00 ................
  00000000 01 02 FF FF FF 00 A5 00 00 00 41 0B C6 00 88 00 ......¥...A.Æ...

Level 2 : Type 6 : ID Attachment [36869]
  Data of length 260
  00000000 14 00 00 00 03 00 20 0E BF 0E 00 00 1E 00 01 30 ...... .¿......0
  00000000 01 00 00 00 0A 00 00 00 71 75 69 63 6B 2E 78 6D ........quick.xm
  00000000 6C 00 00 00 02 01 02 37 01 00 00 00 00 00 00 00 l......7........

    AttachSize [3616] (PR_ATTACH_SIZE) [BF, 0E, 00, 00]
    DisplayName [12289] (PR_DISPLAY_NAME) quick.xml
    AttachEncoding [14082] (PR_ATTACH_ENCODING) []
    AttachExtension [14083] (PR_ATTACH_EXTENSION) .xml
    AttachMethod [14085] (PR_ATTACH_METHOD) [01, 00, 00, 00]
    AttachLongFilename [14087] (PR_ATTACH_LONG_FILENAME) quick.xml
    RenderingPosition [14091] (PR_RENDERING_POSITION) [C3, 00, 00, 00]
    AttachFlags [14100] (PR_ATTACH_FLAGS) [00, 00, 00, 00]
    (unknown 7ffa) [32762] [00, 00, 00, 00]
    (unknown 7ffb) [32763] Sat Jan 01 00:00:00 UTC 4501
    (unknown 7ffc) [32764] Sat Jan 01 00:00:00 UTC 4501
    (unknown 7ffd) [32765] [00, 00, 00, 00]
    (unknown 7ffe) [32766] [00, 00]
    (unknown 7fff) [32767] [00, 00]
    AttachNum [3617] (PR_ATTACH_NUM) [45, 83, 00, 00]
    MappingSignature [4088] (PR_MAPPING_SIGNATURE) [A1, 19, 43, 18, D0, D9, 7A, 4B, 97, B4, 04, 30, 9E, 21, A6, 29]
    StoreRecordKey [4090] (PR_STORE_RECORD_KEY) [A1, 19, 43, 18, D0, D9, 7A, 4B, 97, B4, 04, 30, 9E, 21, A6, 29]
    ObjectType [4094] (PR_Object_TYPE) [07, 00, 00, 00]
    StoreSupportMask [13325] (PR_STORE_SUPPORT_MASK) [FD, 3F, A5, 06]
    (unknown 340f) [13327] [FD, 3F, A5, 06]

Tests run: 3, Failures: 0, Errors: 0, Skipped: 0, Time elapsed: 0.156 sec - in org.apache.poi.hmef.dev.TestHMEFDumper
Running org.apache.poi.hmef.TestCompressedRTF
Tests run: 4, Failures: 0, Errors: 0, Skipped: 0, Time elapsed: 0 sec - in org.apache.poi.hmef.TestCompressedRTF
Running org.apache.poi.hmef.TestHMEFMessage
Tests run: 10, Failures: 0, Errors: 0, Skipped: 0, Time elapsed: 0 sec - in org.apache.poi.hmef.TestHMEFMessage
Running org.apache.poi.hmef.extractor.TestHMEFContentsExtractor
Extracting...
Extraction completed
Tests run: 3, Failures: 0, Errors: 0, Skipped: 0, Time elapsed: 0 sec - in org.apache.poi.hmef.extractor.TestHMEFContentsExtractor
Running org.apache.poi.TestPOIDocumentScratchpad
Tests run: 4, Failures: 0, Errors: 0, Skipped: 0, Time elapsed: 0 sec - in org.apache.poi.TestPOIDocumentScratchpad
Running org.apache.poi.hwmf.TestHwmfParsing
Tests run: 7, Failures: 0, Errors: 0, Skipped: 5, Time elapsed: 0 sec - in org.apache.poi.hwmf.TestHwmfParsing

Results :

Tests in error:
  TestHWPFPictures.testMacImages:152 » IIO Can't create cache file!

Tests run: 792, Failures: 0, Errors: 1, Skipped: 10

[INFO] ------------------------------------------------------------------------
[INFO] Reactor Summary:
[INFO]
[INFO] Apache POI - the Java API for Microsoft Documents . SUCCESS [  0.002 s]
[INFO] Apache POI Main package ........................... SUCCESS [01:18 min]
[INFO] Apache POI Scratchpad package ..................... FAILURE [ 15.620 s]
[INFO] Apache POI - Openxmlformats Schema package ........ SKIPPED
[INFO] Apache POI - Openxmlformats Encryption Schema package  SKIPPED
[INFO] Apache POI - Openxmlformats Security-Schema package  SKIPPED
[INFO] Apache POI OOXML package .......................... SKIPPED
[INFO] Apache POI ExcelAnt package ....................... SKIPPED
[INFO] Apache POI Examples package ....................... SKIPPED
[INFO] ------------------------------------------------------------------------
[INFO] BUILD FAILURE
[INFO] ------------------------------------------------------------------------
[INFO] Total time: 01:34 min
[INFO] Finished at: 2017-11-22T04:05:54+00:00
[INFO] Final Memory: 36M/807M
[INFO] ------------------------------------------------------------------------
[ERROR] Failed to execute goal org.apache.maven.plugins:maven-surefire-plugin:2.19.1:test (default-test) on project poi-scratchpad: There are test failures.
[ERROR]
[ERROR] Please refer to <https://builds.apache.org/job/POI-DSL-Maven/ws/sonar/scratchpad/target/surefire-reports> for the individual test results.
[ERROR] -> [Help 1]
[ERROR]
[ERROR] To see the full stack trace of the errors, re-run Maven with the -e switch.
[ERROR] Re-run Maven using the -X switch to enable full debug logging.
[ERROR]
[ERROR] For more information about the errors and possible solutions, please read the following articles:
[ERROR] [Help 1] http://cwiki.apache.org/confluence/display/MAVEN/MojoFailureException
[ERROR]
[ERROR] After correcting the problems, you can resume the build with the command
[ERROR]   mvn <goals> -rf :poi-scratchpad
Build step 'Invoke top-level Maven targets' marked build as failure
Recording test results

---------------------------------------------------------------------
To unsubscribe, e-mail: [hidden email]
For additional commands, e-mail: [hidden email]

Reply | Threaded
Open this post in threaded view
|

Jenkins build is back to normal : POI-DSL-Maven #411

Apache Jenkins Server
See <https://builds.apache.org/job/POI-DSL-Maven/411/display/redirect?page=changes>


---------------------------------------------------------------------
To unsubscribe, e-mail: [hidden email]
For additional commands, e-mail: [hidden email]