Build failed in Jenkins: POI-DSL-Maven #399

classic Classic list List threaded Threaded
8 messages Options
Reply | Threaded
Open this post in threaded view
|

Build failed in Jenkins: POI-DSL-Maven #399

Apache Jenkins Server
See <https://builds.apache.org/job/POI-DSL-Maven/399/display/redirect?page=changes>

Changes:

[onealj] bug 61745: remove String#toString() usage found by forbidden apis check

------------------------------------------
[...truncated 1.16 MB...]
Running org.apache.poi.xssf.usermodel.extensions.TestXSSFCellFill
Tests run: 5, Failures: 0, Errors: 0, Skipped: 0, Time elapsed: 0.142 sec - in org.apache.poi.xssf.usermodel.extensions.TestXSSFCellFill
Running org.apache.poi.xssf.usermodel.extensions.TestXSSFSheetComments
Tests run: 1, Failures: 0, Errors: 0, Skipped: 0, Time elapsed: 0 sec - in org.apache.poi.xssf.usermodel.extensions.TestXSSFSheetComments
Running org.apache.poi.xssf.usermodel.TestXSSFSimpleShape
Tests run: 1, Failures: 0, Errors: 0, Skipped: 0, Time elapsed: 0.014 sec - in org.apache.poi.xssf.usermodel.TestXSSFSimpleShape
Running org.apache.poi.xssf.usermodel.TestXSSFDialogSheet
Tests run: 14, Failures: 0, Errors: 0, Skipped: 0, Time elapsed: 0.024 sec - in org.apache.poi.xssf.usermodel.TestXSSFDialogSheet
Running org.apache.poi.xssf.usermodel.TestXSSFChart
Tests run: 3, Failures: 0, Errors: 0, Skipped: 0, Time elapsed: 0.049 sec - in org.apache.poi.xssf.usermodel.TestXSSFChart
Running org.apache.poi.xssf.usermodel.TestSheetHiding
Tests run: 5, Failures: 0, Errors: 0, Skipped: 0, Time elapsed: 0.061 sec - in org.apache.poi.xssf.usermodel.TestSheetHiding
Running org.apache.poi.xssf.usermodel.TestXSSFEvaluationSheet
Tests run: 1, Failures: 0, Errors: 0, Skipped: 0, Time elapsed: 0.001 sec - in org.apache.poi.xssf.usermodel.TestXSSFEvaluationSheet
Running org.apache.poi.xssf.usermodel.TestXSSFTextRun
Tests run: 1, Failures: 0, Errors: 0, Skipped: 0, Time elapsed: 0.011 sec - in org.apache.poi.xssf.usermodel.TestXSSFTextRun
Running org.apache.poi.xssf.usermodel.TestXSSFBugs
Tests run: 139, Failures: 0, Errors: 0, Skipped: 8, Time elapsed: 11.016 sec - in org.apache.poi.xssf.usermodel.TestXSSFBugs
Running org.apache.poi.xssf.usermodel.TestTableStyles
Tests run: 2, Failures: 0, Errors: 0, Skipped: 0, Time elapsed: 0.267 sec - in org.apache.poi.xssf.usermodel.TestTableStyles
Running org.apache.poi.xssf.usermodel.TestSXSSFBugs
Tests run: 39, Failures: 0, Errors: 0, Skipped: 8, Time elapsed: 4.846 sec - in org.apache.poi.xssf.usermodel.TestSXSSFBugs
Running org.apache.poi.xssf.usermodel.TestXSSFPivotTableName
Tests run: 18, Failures: 0, Errors: 0, Skipped: 0, Time elapsed: 0.28 sec - in org.apache.poi.xssf.usermodel.TestXSSFPivotTableName
Running org.apache.poi.xssf.usermodel.TestXSSFRichTextString
Tests run: 18, Failures: 0, Errors: 0, Skipped: 0, Time elapsed: 0.028 sec - in org.apache.poi.xssf.usermodel.TestXSSFRichTextString
Running org.apache.poi.xssf.usermodel.TestXSSFOddHeader
Tests run: 1, Failures: 0, Errors: 0, Skipped: 0, Time elapsed: 0.004 sec - in org.apache.poi.xssf.usermodel.TestXSSFOddHeader
Running org.apache.poi.xssf.usermodel.TestXSSFExternalFunctions
Tests run: 2, Failures: 0, Errors: 0, Skipped: 0, Time elapsed: 0.009 sec - in org.apache.poi.xssf.usermodel.TestXSSFExternalFunctions
Running org.apache.poi.xssf.usermodel.TestXSSFDataValidation
Tests run: 7, Failures: 0, Errors: 0, Skipped: 0, Time elapsed: 0.413 sec - in org.apache.poi.xssf.usermodel.TestXSSFDataValidation
Running org.apache.poi.xssf.usermodel.TestXSSFFont
Tests run: 22, Failures: 0, Errors: 0, Skipped: 0, Time elapsed: 0.039 sec - in org.apache.poi.xssf.usermodel.TestXSSFFont
Running org.apache.poi.xssf.usermodel.TestMultiSheetFormulaEvaluatorOnXSSF
Tests run: 2, Failures: 0, Errors: 0, Skipped: 0, Time elapsed: 0.002 sec - in org.apache.poi.xssf.usermodel.TestMultiSheetFormulaEvaluatorOnXSSF
Running org.apache.poi.xssf.usermodel.helpers.TestHeaderFooterHelper
Tests run: 2, Failures: 0, Errors: 0, Skipped: 0, Time elapsed: 0 sec - in org.apache.poi.xssf.usermodel.helpers.TestHeaderFooterHelper
Running org.apache.poi.xssf.usermodel.helpers.TestColumnHelper
Tests run: 15, Failures: 0, Errors: 0, Skipped: 0, Time elapsed: 0.034 sec - in org.apache.poi.xssf.usermodel.helpers.TestColumnHelper
Running org.apache.poi.xssf.usermodel.TestXSSFForkedEvaluator
Tests run: 2, Failures: 0, Errors: 0, Skipped: 0, Time elapsed: 0.013 sec - in org.apache.poi.xssf.usermodel.TestXSSFForkedEvaluator
Running org.apache.poi.xssf.usermodel.TestXSSFSheetAutosizeColumn
Tests run: 7, Failures: 0, Errors: 0, Skipped: 0, Time elapsed: 0.064 sec - in org.apache.poi.xssf.usermodel.TestXSSFSheetAutosizeColumn
Running org.apache.poi.xssf.usermodel.TestFormulaEvaluatorOnXSSF
Tests run: 369, Failures: 0, Errors: 0, Skipped: 90, Time elapsed: 0.255 sec - in org.apache.poi.xssf.usermodel.TestFormulaEvaluatorOnXSSF
Running org.apache.poi.xssf.usermodel.TestXSSFSheet
Tests run: 95, Failures: 0, Errors: 0, Skipped: 0, Time elapsed: 3.148 sec - in org.apache.poi.xssf.usermodel.TestXSSFSheet
Running org.apache.poi.xssf.model.TestCalculationChain
Tests run: 1, Failures: 0, Errors: 0, Skipped: 0, Time elapsed: 0.34 sec - in org.apache.poi.xssf.model.TestCalculationChain
Running org.apache.poi.xssf.model.TestSharedStringsTable
Tests run: 3, Failures: 0, Errors: 0, Skipped: 0, Time elapsed: 0.1 sec - in org.apache.poi.xssf.model.TestSharedStringsTable
Running org.apache.poi.xssf.model.TestThemesTable
Tests run: 3, Failures: 0, Errors: 0, Skipped: 0, Time elapsed: 0.079 sec - in org.apache.poi.xssf.model.TestThemesTable
Running org.apache.poi.xssf.model.TestCommentsTable
Tests run: 7, Failures: 0, Errors: 0, Skipped: 0, Time elapsed: 0.078 sec - in org.apache.poi.xssf.model.TestCommentsTable
Running org.apache.poi.xssf.model.TestExternalLinksTable
Tests run: 4, Failures: 0, Errors: 0, Skipped: 0, Time elapsed: 0.034 sec - in org.apache.poi.xssf.model.TestExternalLinksTable
Running org.apache.poi.xssf.model.TestStylesTable
Tests run: 13, Failures: 0, Errors: 0, Skipped: 0, Time elapsed: 0.146 sec - in org.apache.poi.xssf.model.TestStylesTable
Running org.apache.poi.xssf.model.TestMapInfo
Tests run: 1, Failures: 0, Errors: 0, Skipped: 0, Time elapsed: 0.02 sec - in org.apache.poi.xssf.model.TestMapInfo
Running org.apache.poi.xssf.TestWorkbookProtection
Tests run: 8, Failures: 0, Errors: 0, Skipped: 0, Time elapsed: 0.436 sec - in org.apache.poi.xssf.TestWorkbookProtection
Running org.apache.poi.xssf.extractor.TestXSSFEventBasedExcelExtractor
Tests run: 12, Failures: 0, Errors: 0, Skipped: 0, Time elapsed: 0.286 sec - in org.apache.poi.xssf.extractor.TestXSSFEventBasedExcelExtractor
Running org.apache.poi.xssf.extractor.TestXSSFExportToXML
Tests run: 17, Failures: 0, Errors: 0, Skipped: 1, Time elapsed: 0.322 sec - in org.apache.poi.xssf.extractor.TestXSSFExportToXML
Running org.apache.poi.xssf.extractor.TestXSSFEventBasedExcelExtractorUsingFactory
Tests run: 12, Failures: 0, Errors: 0, Skipped: 0, Time elapsed: 0.23 sec - in org.apache.poi.xssf.extractor.TestXSSFEventBasedExcelExtractorUsingFactory
Running org.apache.poi.xssf.extractor.TestXSSFExcelExtractor
Tests run: 8, Failures: 0, Errors: 0, Skipped: 0, Time elapsed: 0.348 sec - in org.apache.poi.xssf.extractor.TestXSSFExcelExtractor
Running org.apache.poi.xssf.extractor.TestXSSFBEventBasedExcelExtractor
Tests run: 3, Failures: 0, Errors: 0, Skipped: 0, Time elapsed: 0.014 sec - in org.apache.poi.xssf.extractor.TestXSSFBEventBasedExcelExtractor
Running org.apache.poi.xssf.extractor.TestXSSFExcelExtractorUsingFactory
Tests run: 8, Failures: 0, Errors: 0, Skipped: 0, Time elapsed: 0.27 sec - in org.apache.poi.xssf.extractor.TestXSSFExcelExtractorUsingFactory
Running org.apache.poi.xssf.extractor.TestXSSFImportFromXML
Tests run: 5, Failures: 0, Errors: 0, Skipped: 0, Time elapsed: 5.012 sec - in org.apache.poi.xssf.extractor.TestXSSFImportFromXML
Running org.apache.poi.ss.util.TestXSSFPropertyTemplate
Tests run: 2, Failures: 0, Errors: 0, Skipped: 0, Time elapsed: 0.106 sec - in org.apache.poi.ss.util.TestXSSFPropertyTemplate
Running org.apache.poi.ss.util.TestXSSFCellUtil
Tests run: 13, Failures: 0, Errors: 0, Skipped: 0, Time elapsed: 0.052 sec - in org.apache.poi.ss.util.TestXSSFCellUtil
Running org.apache.poi.ss.util.TestSXSSFCellUtil
Tests run: 13, Failures: 0, Errors: 0, Skipped: 0, Time elapsed: 0.042 sec - in org.apache.poi.ss.util.TestSXSSFCellUtil
Running org.apache.poi.ss.format.TestCellFormatPart
Tests run: 6, Failures: 0, Errors: 0, Skipped: 0, Time elapsed: 0.269 sec - in org.apache.poi.ss.format.TestCellFormatPart
Running org.apache.poi.ss.formula.TestFormulaParser
Tests run: 9, Failures: 0, Errors: 0, Skipped: 0, Time elapsed: 0.035 sec - in org.apache.poi.ss.formula.TestFormulaParser
Running org.apache.poi.ss.formula.functions.TestProper
Tests run: 4, Failures: 0, Errors: 0, Skipped: 0, Time elapsed: 1.637 sec - in org.apache.poi.ss.formula.functions.TestProper
Running org.apache.poi.ss.formula.functions.TestSumifsXSSF
Tests run: 1, Failures: 0, Errors: 0, Skipped: 0, Time elapsed: 0.007 sec - in org.apache.poi.ss.formula.functions.TestSumifsXSSF
Running org.apache.poi.ss.formula.TestStructuredReferences
Tests run: 2, Failures: 0, Errors: 0, Skipped: 0, Time elapsed: 0.011 sec - in org.apache.poi.ss.formula.TestStructuredReferences
Running org.apache.poi.ss.formula.eval.TestXSSFCircularReferences
Tests run: 4, Failures: 0, Errors: 0, Skipped: 0, Time elapsed: 0.052 sec - in org.apache.poi.ss.formula.eval.TestXSSFCircularReferences
Running org.apache.poi.ss.usermodel.TestEmbedOLEPackage
Tests run: 2, Failures: 0, Errors: 0, Skipped: 0, Time elapsed: 0.077 sec - in org.apache.poi.ss.usermodel.TestEmbedOLEPackage
Running org.apache.poi.ss.usermodel.ConditionalFormattingEvalTest
Tests run: 2, Failures: 0, Errors: 0, Skipped: 0, Time elapsed: 0.296 sec - in org.apache.poi.ss.usermodel.ConditionalFormattingEvalTest
Running org.apache.poi.ss.usermodel.TestXSSFBorderStyle
Tests run: 1, Failures: 0, Errors: 0, Skipped: 0, Time elapsed: 0.005 sec - in org.apache.poi.ss.usermodel.TestXSSFBorderStyle
Running org.apache.poi.ss.extractor.TestEmbeddedExtractor
Tests run: 3, Failures: 0, Errors: 0, Skipped: 0, Time elapsed: 0.236 sec - in org.apache.poi.ss.extractor.TestEmbeddedExtractor
Running org.apache.poi.ss.TestWorkbookFactory
Tests run: 8, Failures: 0, Errors: 0, Skipped: 0, Time elapsed: 0.333 sec - in org.apache.poi.ss.TestWorkbookFactory
Running org.apache.poi.TestPOIXMLDocument
Tests run: 10, Failures: 0, Errors: 0, Skipped: 0, Time elapsed: 1.649 sec - in org.apache.poi.TestPOIXMLDocument
Running org.apache.poi.dev.TestOOXMLLister
Tests run: 2, Failures: 0, Errors: 0, Skipped: 0, Time elapsed: 0.009 sec - in org.apache.poi.dev.TestOOXMLLister
Running org.apache.poi.dev.TestOOXMLPrettyPrint
Tests run: 1, Failures: 0, Errors: 0, Skipped: 0, Time elapsed: 0.032 sec - in org.apache.poi.dev.TestOOXMLPrettyPrint
Running org.apache.poi.dev.TestRecordGenerator
Tests run: 3, Failures: 0, Errors: 0, Skipped: 3, Time elapsed: 0 sec - in org.apache.poi.dev.TestRecordGenerator
Running org.apache.poi.TestDetectAsOOXML
Tests run: 3, Failures: 0, Errors: 0, Skipped: 0, Time elapsed: 0.005 sec - in org.apache.poi.TestDetectAsOOXML
Running org.apache.poi.extractor.TestExtractorFactory
Tests run: 11, Failures: 0, Errors: 0, Skipped: 0, Time elapsed: 0.784 sec - in org.apache.poi.extractor.TestExtractorFactory
Running org.apache.poi.openxml4j.opc.TestListParts
Tests run: 1, Failures: 0, Errors: 0, Skipped: 0, Time elapsed: 0.004 sec - in org.apache.poi.openxml4j.opc.TestListParts
Running org.apache.poi.openxml4j.opc.TestPackage
Tests run: 23, Failures: 0, Errors: 0, Skipped: 1, Time elapsed: 0.596 sec - in org.apache.poi.openxml4j.opc.TestPackage
Running org.apache.poi.openxml4j.opc.TestRelationships
Tests run: 9, Failures: 0, Errors: 0, Skipped: 0, Time elapsed: 0.052 sec - in org.apache.poi.openxml4j.opc.TestRelationships
Running org.apache.poi.openxml4j.opc.TestPackagingURIHelper
Tests run: 5, Failures: 0, Errors: 0, Skipped: 0, Time elapsed: 0 sec - in org.apache.poi.openxml4j.opc.TestPackagingURIHelper
Running org.apache.poi.openxml4j.opc.internal.TestContentTypeManager
Tests run: 4, Failures: 0, Errors: 0, Skipped: 2, Time elapsed: 0.004 sec - in org.apache.poi.openxml4j.opc.internal.TestContentTypeManager
Running org.apache.poi.openxml4j.opc.internal.marshallers.TestZipPackagePropertiesMarshaller
Tests run: 4, Failures: 0, Errors: 0, Skipped: 0, Time elapsed: 0.001 sec - in org.apache.poi.openxml4j.opc.internal.marshallers.TestZipPackagePropertiesMarshaller
Running org.apache.poi.openxml4j.opc.TestPackageCoreProperties
Tests run: 7, Failures: 0, Errors: 0, Skipped: 0, Time elapsed: 0.06 sec - in org.apache.poi.openxml4j.opc.TestPackageCoreProperties
Running org.apache.poi.openxml4j.opc.TestZipPackage
Tests run: 8, Failures: 0, Errors: 0, Skipped: 0, Time elapsed: 0.592 sec - in org.apache.poi.openxml4j.opc.TestZipPackage
Running org.apache.poi.openxml4j.opc.TestPackageThumbnail
Tests run: 1, Failures: 0, Errors: 0, Skipped: 0, Time elapsed: 0.012 sec - in org.apache.poi.openxml4j.opc.TestPackageThumbnail
Running org.apache.poi.openxml4j.opc.compliance.TestOPCCompliancePartName
Tests run: 10, Failures: 0, Errors: 0, Skipped: 0, Time elapsed: 0.001 sec - in org.apache.poi.openxml4j.opc.compliance.TestOPCCompliancePartName
Running org.apache.poi.openxml4j.opc.compliance.TestOPCComplianceCoreProperties
Tests run: 11, Failures: 0, Errors: 0, Skipped: 0, Time elapsed: 0.064 sec - in org.apache.poi.openxml4j.opc.compliance.TestOPCComplianceCoreProperties
Running org.apache.poi.openxml4j.opc.compliance.TestOPCCompliancePackageModel
Tests run: 5, Failures: 0, Errors: 0, Skipped: 0, Time elapsed: 0.003 sec - in org.apache.poi.openxml4j.opc.compliance.TestOPCCompliancePackageModel
Running org.apache.poi.openxml4j.opc.TestFileHelper
Tests run: 1, Failures: 0, Errors: 0, Skipped: 0, Time elapsed: 0 sec - in org.apache.poi.openxml4j.opc.TestFileHelper
Running org.apache.poi.openxml4j.opc.TestPackagePartName
Tests run: 1, Failures: 0, Errors: 0, Skipped: 0, Time elapsed: 0 sec - in org.apache.poi.openxml4j.opc.TestPackagePartName
Running org.apache.poi.openxml4j.opc.TestContentType
Tests run: 7, Failures: 0, Errors: 0, Skipped: 0, Time elapsed: 0.008 sec - in org.apache.poi.openxml4j.opc.TestContentType
Running org.apache.poi.xslf.TestXSLFSlideShow
Tests run: 5, Failures: 0, Errors: 0, Skipped: 0, Time elapsed: 0.114 sec - in org.apache.poi.xslf.TestXSLFSlideShow
Running org.apache.poi.xslf.usermodel.TestXSLFTextShape
Tests run: 4, Failures: 0, Errors: 0, Skipped: 0, Time elapsed: 0.121 sec - in org.apache.poi.xslf.usermodel.TestXSLFTextShape
Running org.apache.poi.xslf.usermodel.TestXSLFTextRun
Tests run: 1, Failures: 0, Errors: 0, Skipped: 0, Time elapsed: 0.026 sec - in org.apache.poi.xslf.usermodel.TestXSLFTextRun
Running org.apache.poi.xslf.usermodel.TestXSLFFreeformShape
Tests run: 1, Failures: 0, Errors: 0, Skipped: 0, Time elapsed: 0.07 sec - in org.apache.poi.xslf.usermodel.TestXSLFFreeformShape
Running org.apache.poi.xslf.usermodel.TestXMLSlideShow
Tests run: 9, Failures: 0, Errors: 0, Skipped: 0, Time elapsed: 0.242 sec - in org.apache.poi.xslf.usermodel.TestXMLSlideShow
Running org.apache.poi.xslf.usermodel.TestXSLFSlideShowFactory
Tests run: 6, Failures: 0, Errors: 0, Skipped: 0, Time elapsed: 0.464 sec - in org.apache.poi.xslf.usermodel.TestXSLFSlideShowFactory
Running org.apache.poi.xslf.usermodel.TestXSLFAutoShape
Tests run: 4, Failures: 0, Errors: 0, Skipped: 0, Time elapsed: 0.073 sec - in org.apache.poi.xslf.usermodel.TestXSLFAutoShape
Running org.apache.poi.xslf.usermodel.TestXSLFShapeContainer
Tests run: 1, Failures: 0, Errors: 0, Skipped: 0, Time elapsed: 0.019 sec - in org.apache.poi.xslf.usermodel.TestXSLFShapeContainer
Running org.apache.poi.xslf.usermodel.TestXSLFSheet
Tests run: 1, Failures: 0, Errors: 0, Skipped: 0, Time elapsed: 0.052 sec - in org.apache.poi.xslf.usermodel.TestXSLFSheet
Running org.apache.poi.xslf.usermodel.TestXSLFSimpleShape
Tests run: 8, Failures: 0, Errors: 0, Skipped: 0, Time elapsed: 5.334 sec - in org.apache.poi.xslf.usermodel.TestXSLFSimpleShape
Running org.apache.poi.xslf.usermodel.TestXSLFTableStyles
Tests run: 1, Failures: 0, Errors: 0, Skipped: 0, Time elapsed: 0.012 sec - in org.apache.poi.xslf.usermodel.TestXSLFTableStyles
Running org.apache.poi.xslf.usermodel.TestXSLFTextParagraph
Tests run: 5, Failures: 0, Errors: 0, Skipped: 1, Time elapsed: 0.063 sec - in org.apache.poi.xslf.usermodel.TestXSLFTextParagraph
Running org.apache.poi.xslf.usermodel.TestXSLFTheme
Tests run: 1, Failures: 0, Errors: 0, Skipped: 0, Time elapsed: 0.124 sec - in org.apache.poi.xslf.usermodel.TestXSLFTheme
Running org.apache.poi.xslf.usermodel.TestXSLFPictureShape
Tests run: 6, Failures: 0, Errors: 0, Skipped: 0, Time elapsed: 0.32 sec - in org.apache.poi.xslf.usermodel.TestXSLFPictureShape
Running org.apache.poi.xslf.usermodel.TestXSLFHyperlink
Tests run: 3, Failures: 0, Errors: 0, Skipped: 0, Time elapsed: 0.123 sec - in org.apache.poi.xslf.usermodel.TestXSLFHyperlink
Running org.apache.poi.xslf.usermodel.TestXSLFConnectorShape
Tests run: 2, Failures: 0, Errors: 0, Skipped: 0, Time elapsed: 0.041 sec - in org.apache.poi.xslf.usermodel.TestXSLFConnectorShape
Running org.apache.poi.xslf.usermodel.TestXSLFSlide
Tests run: 4, Failures: 0, Errors: 0, Skipped: 0, Time elapsed: 0.675 sec - in org.apache.poi.xslf.usermodel.TestXSLFSlide
Running org.apache.poi.xslf.usermodel.TestXSLFColor
Tests run: 6, Failures: 0, Errors: 0, Skipped: 0, Time elapsed: 0.047 sec - in org.apache.poi.xslf.usermodel.TestXSLFColor
Running org.apache.poi.xslf.usermodel.TestXSLFSlideShow
Tests run: 6, Failures: 0, Errors: 0, Skipped: 0, Time elapsed: 0.172 sec - in org.apache.poi.xslf.usermodel.TestXSLFSlideShow
Running org.apache.poi.xslf.usermodel.TestXSLFNotes
Tests run: 3, Failures: 0, Errors: 0, Skipped: 0, Time elapsed: 0.072 sec - in org.apache.poi.xslf.usermodel.TestXSLFNotes
Running org.apache.poi.xslf.usermodel.TestXSLFChart
Tests run: 1, Failures: 0, Errors: 0, Skipped: 0, Time elapsed: 0.028 sec - in org.apache.poi.xslf.usermodel.TestXSLFChart
Running org.apache.poi.xslf.usermodel.TestPPTX2PNG
Tests run: 10, Failures: 0, Errors: 0, Skipped: 0, Time elapsed: 8.277 sec - in org.apache.poi.xslf.usermodel.TestPPTX2PNG
Running org.apache.poi.xslf.usermodel.TestXSLFShape
Tests run: 2, Failures: 0, Errors: 0, Skipped: 0, Time elapsed: 0.068 sec - in org.apache.poi.xslf.usermodel.TestXSLFShape
Running org.apache.poi.xslf.usermodel.TestXSLFTableRow
Tests run: 7, Failures: 0, Errors: 0, Skipped: 0, Time elapsed: 0.149 sec - in org.apache.poi.xslf.usermodel.TestXSLFTableRow
Running org.apache.poi.xslf.usermodel.TestXSLFTextBox
Tests run: 2, Failures: 0, Errors: 0, Skipped: 0, Time elapsed: 0.033 sec - in org.apache.poi.xslf.usermodel.TestXSLFTextBox
Running org.apache.poi.xslf.usermodel.TestXSLFTable
Tests run: 5, Failures: 0, Errors: 0, Skipped: 0, Time elapsed: 2.628 sec - in org.apache.poi.xslf.usermodel.TestXSLFTable
Running org.apache.poi.xslf.usermodel.TestXSLFGroupShape
Tests run: 2, Failures: 0, Errors: 0, Skipped: 0, Time elapsed: 0.039 sec - in org.apache.poi.xslf.usermodel.TestXSLFGroupShape
Running org.apache.poi.xslf.TestXSLFBugs
Tests run: 22, Failures: 0, Errors: 0, Skipped: 1, Time elapsed: 1.356 sec - in org.apache.poi.xslf.TestXSLFBugs
Running org.apache.poi.xslf.extractor.TestXSLFPowerPointExtractor
Tests run: 5, Failures: 0, Errors: 0, Skipped: 0, Time elapsed: 0.254 sec - in org.apache.poi.xslf.extractor.TestXSLFPowerPointExtractor
Running org.apache.poi.xslf.geom.TestFormulaParser
Tests run: 1, Failures: 0, Errors: 0, Skipped: 0, Time elapsed: 0.001 sec - in org.apache.poi.xslf.geom.TestFormulaParser

Results :

Failed tests:
  TestXWPFChart.testChartRelation:83 expected:</word/document.xml> but was:</word/document.xml>

Tests run: 2349, Failures: 1, Errors: 0, Skipped: 158

[INFO] ------------------------------------------------------------------------
[INFO] Reactor Summary:
[INFO]
[INFO] Apache POI - the Java API for Microsoft Documents . SUCCESS [  0.003 s]
[INFO] Apache POI Main package ........................... SUCCESS [01:41 min]
[INFO] Apache POI Scratchpad package ..................... SUCCESS [ 16.588 s]
[INFO] Apache POI - Openxmlformats Schema package ........ SUCCESS [01:31 min]
[INFO] Apache POI - Openxmlformats Encryption Schema package  SUCCESS [  0.761 s]
[INFO] Apache POI - Openxmlformats Security-Schema package  SUCCESS [ 10.170 s]
[INFO] Apache POI OOXML package .......................... FAILURE [02:13 min]
[INFO] Apache POI ExcelAnt package ....................... SKIPPED
[INFO] Apache POI Examples package ....................... SKIPPED
[INFO] ------------------------------------------------------------------------
[INFO] BUILD FAILURE
[INFO] ------------------------------------------------------------------------
[INFO] Total time: 05:54 min
[INFO] Finished at: 2017-11-13T04:09:33+00:00
[INFO] Final Memory: 53M/763M
[INFO] ------------------------------------------------------------------------
[ERROR] Failed to execute goal org.apache.maven.plugins:maven-surefire-plugin:2.19.1:test (default-test) on project poi-ooxml: There are test failures.
[ERROR]
[ERROR] Please refer to <https://builds.apache.org/job/POI-DSL-Maven/ws/sonar/ooxml/target/surefire-reports> for the individual test results.
[ERROR] -> [Help 1]
[ERROR]
[ERROR] To see the full stack trace of the errors, re-run Maven with the -e switch.
[ERROR] Re-run Maven using the -X switch to enable full debug logging.
[ERROR]
[ERROR] For more information about the errors and possible solutions, please read the following articles:
[ERROR] [Help 1] http://cwiki.apache.org/confluence/display/MAVEN/MojoFailureException
[ERROR]
[ERROR] After correcting the problems, you can resume the build with the command
[ERROR]   mvn <goals> -rf :poi-ooxml
Build step 'Invoke top-level Maven targets' marked build as failure

---------------------------------------------------------------------
To unsubscribe, e-mail: [hidden email]
For additional commands, e-mail: [hidden email]

Reply | Threaded
Open this post in threaded view
|

Build failed in Jenkins: POI-DSL-Maven #400

Apache Jenkins Server
See <https://builds.apache.org/job/POI-DSL-Maven/400/display/redirect?page=changes>

Changes:

[centic] Fix setting a font-color if no previous color is defined for the font
Add unit-test to verify this

[centic] Fix tests

------------------------------------------
[...truncated 98.94 KB...]
Tests run: 9, Failures: 0, Errors: 0, Skipped: 0, Time elapsed: 0 sec - in org.apache.poi.ss.formula.functions.TestMatch
Running org.apache.poi.ss.formula.functions.TestMid
Tests run: 4, Failures: 0, Errors: 0, Skipped: 0, Time elapsed: 0 sec - in org.apache.poi.ss.formula.functions.TestMid
Running org.apache.poi.ss.formula.functions.TestMirr
Tests run: 4, Failures: 0, Errors: 0, Skipped: 0, Time elapsed: 0.001 sec - in org.apache.poi.ss.formula.functions.TestMirr
Running org.apache.poi.ss.formula.functions.TestCountFuncs
Tests run: 16, Failures: 0, Errors: 0, Skipped: 0, Time elapsed: 0 sec - in org.apache.poi.ss.formula.functions.TestCountFuncs
Running org.apache.poi.ss.formula.functions.TestIntercept
Tests run: 4, Failures: 0, Errors: 0, Skipped: 0, Time elapsed: 0 sec - in org.apache.poi.ss.formula.functions.TestIntercept
Running org.apache.poi.ss.formula.functions.TestSumifs
Tests run: 7, Failures: 0, Errors: 0, Skipped: 0, Time elapsed: 0 sec - in org.apache.poi.ss.formula.functions.TestSumifs
Running org.apache.poi.ss.formula.functions.TestWeekNumFunctionsFromSpreadsheet2013
Tests run: 7, Failures: 0, Errors: 0, Skipped: 0, Time elapsed: 0 sec - in org.apache.poi.ss.formula.functions.TestWeekNumFunctionsFromSpreadsheet2013
Running org.apache.poi.ss.formula.functions.TestSubtotal
Tests run: 11, Failures: 0, Errors: 0, Skipped: 0, Time elapsed: 0 sec - in org.apache.poi.ss.formula.functions.TestSubtotal
Running org.apache.poi.ss.formula.functions.TestComplex
Tests run: 2, Failures: 0, Errors: 0, Skipped: 0, Time elapsed: 0.001 sec - in org.apache.poi.ss.formula.functions.TestComplex
Running org.apache.poi.ss.formula.functions.TestAddress
Tests run: 1, Failures: 0, Errors: 0, Skipped: 0, Time elapsed: 0 sec - in org.apache.poi.ss.formula.functions.TestAddress
Running org.apache.poi.ss.formula.functions.TestBin2Dec
Tests run: 5, Failures: 0, Errors: 0, Skipped: 0, Time elapsed: 0.001 sec - in org.apache.poi.ss.formula.functions.TestBin2Dec
Running org.apache.poi.ss.formula.functions.TestSumif
Tests run: 3, Failures: 0, Errors: 0, Skipped: 0, Time elapsed: 0 sec - in org.apache.poi.ss.formula.functions.TestSumif
Running org.apache.poi.ss.formula.functions.TestText
Tests run: 4, Failures: 0, Errors: 0, Skipped: 0, Time elapsed: 0.001 sec - in org.apache.poi.ss.formula.functions.TestText
Running org.apache.poi.ss.formula.functions.TestValue
Tests run: 2, Failures: 0, Errors: 0, Skipped: 0, Time elapsed: 0 sec - in org.apache.poi.ss.formula.functions.TestValue
Running org.apache.poi.ss.formula.functions.TestStatsLib
Tests run: 9, Failures: 0, Errors: 0, Skipped: 0, Time elapsed: 0 sec - in org.apache.poi.ss.formula.functions.TestStatsLib
Running org.apache.poi.ss.formula.functions.TestIndexFunctionFromSpreadsheet
Tests run: 98, Failures: 0, Errors: 0, Skipped: 0, Time elapsed: 0.001 sec - in org.apache.poi.ss.formula.functions.TestIndexFunctionFromSpreadsheet
Running org.apache.poi.ss.formula.functions.TestLen
Tests run: 3, Failures: 0, Errors: 0, Skipped: 0, Time elapsed: 0.001 sec - in org.apache.poi.ss.formula.functions.TestLen
Running org.apache.poi.ss.formula.functions.TestDec2Hex
Tests run: 12, Failures: 0, Errors: 0, Skipped: 0, Time elapsed: 0.007 sec - in org.apache.poi.ss.formula.functions.TestDec2Hex
Running org.apache.poi.ss.formula.functions.TestNpv
Tests run: 2, Failures: 0, Errors: 0, Skipped: 0, Time elapsed: 0 sec - in org.apache.poi.ss.formula.functions.TestNpv
Running org.apache.poi.ss.formula.functions.TestOct2Dec
Tests run: 2, Failures: 0, Errors: 0, Skipped: 0, Time elapsed: 0 sec - in org.apache.poi.ss.formula.functions.TestOct2Dec
Running org.apache.poi.ss.formula.functions.TestAverage
Tests run: 3, Failures: 0, Errors: 0, Skipped: 0, Time elapsed: 0 sec - in org.apache.poi.ss.formula.functions.TestAverage
Running org.apache.poi.ss.formula.functions.TestDStarFunctionsFromSpreadsheet
Tests run: 4, Failures: 0, Errors: 0, Skipped: 0, Time elapsed: 0 sec - in org.apache.poi.ss.formula.functions.TestDStarFunctionsFromSpreadsheet
Running org.apache.poi.ss.formula.functions.TestPPMT
Tests run: 1, Failures: 0, Errors: 0, Skipped: 0, Time elapsed: 0 sec - in org.apache.poi.ss.formula.functions.TestPPMT
Running org.apache.poi.ss.formula.functions.TestDelta
Tests run: 2, Failures: 0, Errors: 0, Skipped: 0, Time elapsed: 0 sec - in org.apache.poi.ss.formula.functions.TestDelta
Running org.apache.poi.ss.formula.functions.TestIndex
Tests run: 3, Failures: 0, Errors: 0, Skipped: 0, Time elapsed: 0.001 sec - in org.apache.poi.ss.formula.functions.TestIndex
Running org.apache.poi.ss.formula.functions.TestMultiOperandNumericFunction
Tests run: 1, Failures: 0, Errors: 0, Skipped: 0, Time elapsed: 0 sec - in org.apache.poi.ss.formula.functions.TestMultiOperandNumericFunction
Running org.apache.poi.ss.formula.functions.TestImaginaryFunctionsFromSpreadsheet
Tests run: 7, Failures: 0, Errors: 0, Skipped: 0, Time elapsed: 0.001 sec - in org.apache.poi.ss.formula.functions.TestImaginaryFunctionsFromSpreadsheet
Running org.apache.poi.ss.formula.functions.TestWeekNumFunctionsFromSpreadsheet
Tests run: 7, Failures: 0, Errors: 0, Skipped: 0, Time elapsed: 0.001 sec - in org.apache.poi.ss.formula.functions.TestWeekNumFunctionsFromSpreadsheet
Running org.apache.poi.ss.formula.functions.TestCodeFunctionsFromSpreadsheet
Tests run: 4, Failures: 0, Errors: 0, Skipped: 0, Time elapsed: 0 sec - in org.apache.poi.ss.formula.functions.TestCodeFunctionsFromSpreadsheet
Running org.apache.poi.ss.formula.functions.TestFixed
Tests run: 2, Failures: 0, Errors: 0, Skipped: 0, Time elapsed: 0 sec - in org.apache.poi.ss.formula.functions.TestFixed
Running org.apache.poi.ss.formula.functions.TestCalendarFieldFunction
Tests run: 4, Failures: 0, Errors: 0, Skipped: 0, Time elapsed: 0 sec - in org.apache.poi.ss.formula.functions.TestCalendarFieldFunction
Running org.apache.poi.ss.formula.functions.TestIrr
Tests run: 3, Failures: 0, Errors: 0, Skipped: 0, Time elapsed: 0.001 sec - in org.apache.poi.ss.formula.functions.TestIrr
Running org.apache.poi.ss.formula.functions.TestTrim
Tests run: 3, Failures: 0, Errors: 0, Skipped: 0, Time elapsed: 0 sec - in org.apache.poi.ss.formula.functions.TestTrim
Running org.apache.poi.ss.formula.functions.TestTFunc
Tests run: 5, Failures: 0, Errors: 0, Skipped: 0, Time elapsed: 0 sec - in org.apache.poi.ss.formula.functions.TestTFunc
Running org.apache.poi.ss.formula.functions.TestImRealFunctionsFromSpreadsheet
Tests run: 7, Failures: 0, Errors: 0, Skipped: 0, Time elapsed: 0 sec - in org.apache.poi.ss.formula.functions.TestImRealFunctionsFromSpreadsheet
Running org.apache.poi.ss.formula.functions.TestDate
Tests run: 3, Failures: 0, Errors: 0, Skipped: 0, Time elapsed: 0 sec - in org.apache.poi.ss.formula.functions.TestDate
Running org.apache.poi.ss.formula.functions.TestWeekdayFunc
Tests run: 2, Failures: 0, Errors: 0, Skipped: 0, Time elapsed: 0.001 sec - in org.apache.poi.ss.formula.functions.TestWeekdayFunc
Running org.apache.poi.ss.util.TestCellRangeAddress
Tests run: 14, Failures: 0, Errors: 0, Skipped: 0, Time elapsed: 0 sec - in org.apache.poi.ss.util.TestCellRangeAddress
Running org.apache.poi.ss.util.TestDateFormatConverter
Tests run: 2, Failures: 0, Errors: 1, Skipped: 0, Time elapsed: 0.173 sec <<< FAILURE! - in org.apache.poi.ss.util.TestDateFormatConverter
testJavaDateFormatsInExcel(org.apache.poi.ss.util.TestDateFormatConverter)  Time elapsed: 0.173 sec  <<< ERROR!
java.io.IOException: Permission denied
        at org.apache.poi.ss.util.TestDateFormatConverter.outputLocaleDataFormats(TestDateFormatConverter.java:108)
        at org.apache.poi.ss.util.TestDateFormatConverter.testJavaDateFormatsInExcel(TestDateFormatConverter.java:120)

Running org.apache.poi.ss.util.TestPropertyTemplate
Tests run: 8, Failures: 0, Errors: 0, Skipped: 0, Time elapsed: 0.01 sec - in org.apache.poi.ss.util.TestPropertyTemplate
Running org.apache.poi.ss.util.TestNumberComparer
Tests run: 4, Failures: 0, Errors: 0, Skipped: 0, Time elapsed: 0.021 sec - in org.apache.poi.ss.util.TestNumberComparer
Running org.apache.poi.ss.util.TestSheetUtil
Tests run: 7, Failures: 0, Errors: 0, Skipped: 0, Time elapsed: 0.002 sec - in org.apache.poi.ss.util.TestSheetUtil
Running org.apache.poi.ss.util.TestCellRangeUtil
Tests run: 1, Failures: 0, Errors: 0, Skipped: 0, Time elapsed: 0.015 sec - in org.apache.poi.ss.util.TestCellRangeUtil
Running org.apache.poi.ss.util.TestCellReference
Tests run: 25, Failures: 0, Errors: 0, Skipped: 0, Time elapsed: 0 sec - in org.apache.poi.ss.util.TestCellReference
Running org.apache.poi.ss.util.TestAreaReference
Tests run: 2, Failures: 0, Errors: 0, Skipped: 0, Time elapsed: 0 sec - in org.apache.poi.ss.util.TestAreaReference
Running org.apache.poi.ss.util.TestExpandedDouble
Tests run: 3, Failures: 0, Errors: 0, Skipped: 0, Time elapsed: 0 sec - in org.apache.poi.ss.util.TestExpandedDouble
Running org.apache.poi.ss.util.TestHSSFCellUtil
Tests run: 13, Failures: 0, Errors: 0, Skipped: 0, Time elapsed: 0.002 sec - in org.apache.poi.ss.util.TestHSSFCellUtil
Running org.apache.poi.ss.util.TestSheetBuilder
Tests run: 3, Failures: 0, Errors: 0, Skipped: 0, Time elapsed: 0.001 sec - in org.apache.poi.ss.util.TestSheetBuilder
Running org.apache.poi.ss.util.TestNumberToTextConverter
Tests run: 2, Failures: 0, Errors: 0, Skipped: 0, Time elapsed: 0.003 sec - in org.apache.poi.ss.util.TestNumberToTextConverter
Running org.apache.poi.ss.util.TestRegionUtil
Tests run: 10, Failures: 0, Errors: 0, Skipped: 0, Time elapsed: 0.004 sec - in org.apache.poi.ss.util.TestRegionUtil
Running org.apache.poi.ss.util.TestCellAddress
Tests run: 6, Failures: 0, Errors: 0, Skipped: 0, Time elapsed: 0 sec - in org.apache.poi.ss.util.TestCellAddress
Running org.apache.poi.ss.util.TestWorkbookUtil
Tests run: 1, Failures: 0, Errors: 0, Skipped: 0, Time elapsed: 0 sec - in org.apache.poi.ss.util.TestWorkbookUtil
Running org.apache.poi.ss.util.cellwalk.TestCellWalk
Tests run: 1, Failures: 0, Errors: 0, Skipped: 0, Time elapsed: 0 sec - in org.apache.poi.ss.util.cellwalk.TestCellWalk
Running org.apache.poi.ss.format.TestCellFormat
Nov 13, 2017 8:05:39 PM org.apache.poi.ss.format.CellFormatPart getColor
WARNING: Unknown color: "Red"
Tests run: 40, Failures: 0, Errors: 0, Skipped: 0, Time elapsed: 0.09 sec - in org.apache.poi.ss.format.TestCellFormat
Running org.apache.poi.ss.format.TestCellFormatCondition
Tests run: 1, Failures: 0, Errors: 0, Skipped: 0, Time elapsed: 0 sec - in org.apache.poi.ss.format.TestCellFormatCondition
Running org.apache.poi.ss.format.TestCellFormatResult
Tests run: 1, Failures: 0, Errors: 0, Skipped: 0, Time elapsed: 0 sec - in org.apache.poi.ss.format.TestCellFormatResult
Running org.apache.poi.ss.TestSpreadsheetVersion
Tests run: 2, Failures: 0, Errors: 0, Skipped: 0, Time elapsed: 0 sec - in org.apache.poi.ss.TestSpreadsheetVersion
Running org.apache.poi.ss.usermodel.TestDateUtil
Tests run: 5, Failures: 0, Errors: 0, Skipped: 0, Time elapsed: 0 sec - in org.apache.poi.ss.usermodel.TestDateUtil
Running org.apache.poi.ss.usermodel.TestIndexedColors
Tests run: 3, Failures: 0, Errors: 0, Skipped: 0, Time elapsed: 0.001 sec - in org.apache.poi.ss.usermodel.TestIndexedColors
Running org.apache.poi.ss.usermodel.TestFractionFormat
Tests run: 2, Failures: 0, Errors: 0, Skipped: 0, Time elapsed: 0.056 sec - in org.apache.poi.ss.usermodel.TestFractionFormat
Running org.apache.poi.ss.usermodel.TestExcelStyleDateFormatter
Tests run: 4, Failures: 0, Errors: 0, Skipped: 0, Time elapsed: 0.006 sec - in org.apache.poi.ss.usermodel.TestExcelStyleDateFormatter
Running org.apache.poi.ss.usermodel.TestHSSFBorderStyle
Tests run: 1, Failures: 0, Errors: 0, Skipped: 0, Time elapsed: 0.001 sec - in org.apache.poi.ss.usermodel.TestHSSFBorderStyle
Running org.apache.poi.ss.usermodel.charts.TestDataSources
Tests run: 6, Failures: 0, Errors: 0, Skipped: 0, Time elapsed: 0.005 sec - in org.apache.poi.ss.usermodel.charts.TestDataSources
Running org.apache.poi.ss.usermodel.TestDataFormatter
Tests run: 33, Failures: 0, Errors: 0, Skipped: 1, Time elapsed: 0.023 sec - in org.apache.poi.ss.usermodel.TestDataFormatter
Running org.apache.poi.TestPOIDocumentMain
Tests run: 6, Failures: 0, Errors: 0, Skipped: 0, Time elapsed: 0.004 sec - in org.apache.poi.TestPOIDocumentMain

Results :

Failed tests:
  TestTempFile.testSetTempFileCreationStrategy
Expected: an instance of java.lang.IllegalArgumentException
     but: <org.junit.internal.runners.model.MultipleFailureException: There were 2 errors:
  java.lang.IllegalArgumentException(strategy == null)
  java.io.IOException(Permission denied)> is a org.junit.internal.runners.model.MultipleFailureException
Stacktrace was: org.junit.internal.runners.model.MultipleFailureException: There were 2 errors:
  java.lang.IllegalArgumentException(strategy == null)
  java.io.IOException(Permission denied)
        at org.junit.runners.model.MultipleFailureException.assertEmpty(MultipleFailureException.java:67)
        at org.junit.internal.runners.statements.RunAfters.evaluate(RunAfters.java:39)
        at org.junit.rules.ExpectedException$ExpectedExceptionStatement.evaluate(ExpectedException.java:239)
        at org.junit.rules.RunRules.evaluate(RunRules.java:20)
        at org.junit.runners.ParentRunner.runLeaf(ParentRunner.java:325)
        at org.junit.runners.BlockJUnit4ClassRunner.runChild(BlockJUnit4ClassRunner.java:78)
        at org.junit.runners.BlockJUnit4ClassRunner.runChild(BlockJUnit4ClassRunner.java:57)
        at org.junit.runners.ParentRunner$3.run(ParentRunner.java:290)
        at org.junit.runners.ParentRunner$1.schedule(ParentRunner.java:71)
        at org.junit.runners.ParentRunner.runChildren(ParentRunner.java:288)
        at org.junit.runners.ParentRunner.access$000(ParentRunner.java:58)
        at org.junit.runners.ParentRunner$2.evaluate(ParentRunner.java:268)
        at org.junit.runners.ParentRunner.run(ParentRunner.java:363)
        at org.junit.runners.Suite.runChild(Suite.java:128)
        at org.junit.runners.Suite.runChild(Suite.java:27)
        at org.junit.runners.ParentRunner$3.run(ParentRunner.java:290)
        at org.junit.runners.ParentRunner$1.schedule(ParentRunner.java:71)
        at org.junit.runners.ParentRunner.runChildren(ParentRunner.java:288)
        at org.junit.runners.ParentRunner.access$000(ParentRunner.java:58)
        at org.junit.runners.ParentRunner$2.evaluate(ParentRunner.java:268)
        at org.junit.runners.ParentRunner.run(ParentRunner.java:363)
        at org.apache.maven.surefire.junitcore.JUnitCore.run(JUnitCore.java:55)
        at org.apache.maven.surefire.junitcore.JUnitCoreWrapper.createRequestAndRun(JUnitCoreWrapper.java:137)
        at org.apache.maven.surefire.junitcore.JUnitCoreWrapper.executeEager(JUnitCoreWrapper.java:107)
        at org.apache.maven.surefire.junitcore.JUnitCoreWrapper.execute(JUnitCoreWrapper.java:83)
        at org.apache.maven.surefire.junitcore.JUnitCoreWrapper.execute(JUnitCoreWrapper.java:75)
        at org.apache.maven.surefire.junitcore.JUnitCoreProvider.invoke(JUnitCoreProvider.java:161)
        at org.apache.maven.surefire.booter.ForkedBooter.invokeProviderInSameClassLoader(ForkedBooter.java:290)
        at org.apache.maven.surefire.booter.ForkedBooter.runSuitesInProcess(ForkedBooter.java:242)
        at org.apache.maven.surefire.booter.ForkedBooter.main(ForkedBooter.java:121)

Tests in error:
  TestWrite.dictionary:475 » IO Permission denied
  TestWrite.dictionaryWithInvalidCodepage »  Unexpected exception, expected<org....
  TestWrite.inPlaceNPOIFSWrite:526 » IO Permission denied
  TestWrite.withoutAFormatID »  Unexpected exception, expected<org.apache.poi.hp...
  TestWriteWellKnown.testWriteWellKnown:170 » IO Permission denied
  TestCellStyle.testDataStyle:104 » IO Permission denied
  TestCellStyle.testWriteSheetFont:64 » IO Permission denied
  TestCellStyle.testWriteSheetStyle:176 » IO Permission denied
  TestFormulas.test27272_1:927 » IO Permission denied
  TestFormulas.test27272_2:939 » IO Permission denied
  TestFormulas.testComplexSheetRefs:914 » IO Permission denied
  TestFormulas.testRVAoperands:637 » IO Permission denied
  TestHSSFWorkbook.inPlaceWrite:1270 » IO Permission denied
  TestHSSFWorkbook.testRewriteFileBug58480:1137 » IO Permission denied
  TestHSSFWorkbook.testWriteToNewFile:1310 » IO Permission denied
  TestPOIFSDump.testFailToWrite »  Unexpected exception, expected<java.lang.Inde...
  TestNPOIFSFileSystem.createWriteRead:1005->writeOutFileAndReadBack:103 » IO Pe...
  TestDataSource.testFileWritable:58 » IO Permission denied
  TestDataSource.testRewritableFile:86 » IO Permission denied
  TestDateFormatConverter.testJavaDateFormatsInExcel:120->outputLocaleDataFormats:108 » IO
  TestHexDump.testMain:268 » IO Permission denied
org.apache.poi.util.TestTempFile.createTempFileWithDefaultSuffix(org.apache.poi.util.TestTempFile)
  Run 1: TestTempFile.createTempFileWithDefaultSuffix:109 » IO Permission denied
  Run 2: TestTempFile.tearDown:81 » IO Permission denied

org.apache.poi.util.TestTempFile.testCreateTempDirectory(org.apache.poi.util.TestTempFile)
  Run 1: TestTempFile.testCreateTempDirectory:117 » IO Could not create temporary direc...
  Run 2: TestTempFile.tearDown:81 » IO Permission denied

org.apache.poi.util.TestTempFile.testCreateTempFile(org.apache.poi.util.TestTempFile)
  Run 1: TestTempFile.testCreateTempFile:89 » IO Permission denied
  Run 2: TestTempFile.tearDown:81 » IO Permission denied


Tests run: 6527, Failures: 1, Errors: 24, Skipped: 776

[INFO] ------------------------------------------------------------------------
[INFO] Reactor Summary:
[INFO]
[INFO] Apache POI - the Java API for Microsoft Documents . SUCCESS [  0.002 s]
[INFO] Apache POI Main package ........................... FAILURE [01:23 min]
[INFO] Apache POI Scratchpad package ..................... SKIPPED
[INFO] Apache POI - Openxmlformats Schema package ........ SKIPPED
[INFO] Apache POI - Openxmlformats Encryption Schema package  SKIPPED
[INFO] Apache POI - Openxmlformats Security-Schema package  SKIPPED
[INFO] Apache POI OOXML package .......................... SKIPPED
[INFO] Apache POI ExcelAnt package ....................... SKIPPED
[INFO] Apache POI Examples package ....................... SKIPPED
[INFO] ------------------------------------------------------------------------
[INFO] BUILD FAILURE
[INFO] ------------------------------------------------------------------------
[INFO] Total time: 01:23 min
[INFO] Finished at: 2017-11-13T20:05:39+00:00
[INFO] Final Memory: 31M/812M
[INFO] ------------------------------------------------------------------------
[ERROR] Failed to execute goal org.apache.maven.plugins:maven-surefire-plugin:2.19.1:test (default-test) on project poi-main: There are test failures.
[ERROR]
[ERROR] Please refer to <https://builds.apache.org/job/POI-DSL-Maven/ws/sonar/main/target/surefire-reports> for the individual test results.
[ERROR] -> [Help 1]
[ERROR]
[ERROR] To see the full stack trace of the errors, re-run Maven with the -e switch.
[ERROR] Re-run Maven using the -X switch to enable full debug logging.
[ERROR]
[ERROR] For more information about the errors and possible solutions, please read the following articles:
[ERROR] [Help 1] http://cwiki.apache.org/confluence/display/MAVEN/MojoFailureException
[ERROR]
[ERROR] After correcting the problems, you can resume the build with the command
[ERROR]   mvn <goals> -rf :poi-main
Build step 'Invoke top-level Maven targets' marked build as failure

---------------------------------------------------------------------
To unsubscribe, e-mail: [hidden email]
For additional commands, e-mail: [hidden email]

Reply | Threaded
Open this post in threaded view
|

Build failed in Jenkins: POI-DSL-Maven #401

Apache Jenkins Server
See <https://builds.apache.org/job/POI-DSL-Maven/401/display/redirect?page=changes>

Changes:

[gwoolsey] Fixes Bug 61764 Conditional formatting rules don't evaluate properly for some multi-range rule definitions

Fixes Bug 61761 Conditional formatting rule evaluation doesn't like comparing cells of different types

fixed, with unit tests.

------------------------------------------
[...truncated 1.16 MB...]
Running org.apache.poi.xssf.usermodel.extensions.TestXSSFCellFill
Tests run: 5, Failures: 0, Errors: 0, Skipped: 0, Time elapsed: 0.008 sec - in org.apache.poi.xssf.usermodel.extensions.TestXSSFCellFill
Running org.apache.poi.xssf.usermodel.extensions.TestXSSFSheetComments
Tests run: 1, Failures: 0, Errors: 0, Skipped: 0, Time elapsed: 0 sec - in org.apache.poi.xssf.usermodel.extensions.TestXSSFSheetComments
Running org.apache.poi.xssf.usermodel.TestXSSFSimpleShape
Tests run: 1, Failures: 0, Errors: 0, Skipped: 0, Time elapsed: 0.018 sec - in org.apache.poi.xssf.usermodel.TestXSSFSimpleShape
Running org.apache.poi.xssf.usermodel.TestXSSFDialogSheet
Tests run: 14, Failures: 0, Errors: 0, Skipped: 0, Time elapsed: 0.047 sec - in org.apache.poi.xssf.usermodel.TestXSSFDialogSheet
Running org.apache.poi.xssf.usermodel.TestXSSFChart
Tests run: 3, Failures: 0, Errors: 0, Skipped: 0, Time elapsed: 0.081 sec - in org.apache.poi.xssf.usermodel.TestXSSFChart
Running org.apache.poi.xssf.usermodel.TestSheetHiding
Tests run: 5, Failures: 0, Errors: 0, Skipped: 0, Time elapsed: 0.217 sec - in org.apache.poi.xssf.usermodel.TestSheetHiding
Running org.apache.poi.xssf.usermodel.TestXSSFEvaluationSheet
Tests run: 1, Failures: 0, Errors: 0, Skipped: 0, Time elapsed: 0.001 sec - in org.apache.poi.xssf.usermodel.TestXSSFEvaluationSheet
Running org.apache.poi.xssf.usermodel.TestXSSFTextRun
Tests run: 1, Failures: 0, Errors: 0, Skipped: 0, Time elapsed: 0.011 sec - in org.apache.poi.xssf.usermodel.TestXSSFTextRun
Running org.apache.poi.xssf.usermodel.TestXSSFBugs
Tests run: 139, Failures: 0, Errors: 0, Skipped: 8, Time elapsed: 11.896 sec - in org.apache.poi.xssf.usermodel.TestXSSFBugs
Running org.apache.poi.xssf.usermodel.TestTableStyles
Tests run: 2, Failures: 0, Errors: 0, Skipped: 0, Time elapsed: 0.284 sec - in org.apache.poi.xssf.usermodel.TestTableStyles
Running org.apache.poi.xssf.usermodel.TestSXSSFBugs
Tests run: 39, Failures: 0, Errors: 0, Skipped: 8, Time elapsed: 5.916 sec - in org.apache.poi.xssf.usermodel.TestSXSSFBugs
Running org.apache.poi.xssf.usermodel.TestXSSFPivotTableName
Tests run: 18, Failures: 0, Errors: 0, Skipped: 0, Time elapsed: 0.305 sec - in org.apache.poi.xssf.usermodel.TestXSSFPivotTableName
Running org.apache.poi.xssf.usermodel.TestXSSFRichTextString
Tests run: 18, Failures: 0, Errors: 0, Skipped: 0, Time elapsed: 0.02 sec - in org.apache.poi.xssf.usermodel.TestXSSFRichTextString
Running org.apache.poi.xssf.usermodel.TestXSSFOddHeader
Tests run: 1, Failures: 0, Errors: 0, Skipped: 0, Time elapsed: 0.002 sec - in org.apache.poi.xssf.usermodel.TestXSSFOddHeader
Running org.apache.poi.xssf.usermodel.TestXSSFExternalFunctions
Tests run: 2, Failures: 0, Errors: 0, Skipped: 0, Time elapsed: 0.007 sec - in org.apache.poi.xssf.usermodel.TestXSSFExternalFunctions
Running org.apache.poi.xssf.usermodel.TestXSSFDataValidation
Tests run: 7, Failures: 0, Errors: 0, Skipped: 0, Time elapsed: 0.441 sec - in org.apache.poi.xssf.usermodel.TestXSSFDataValidation
Running org.apache.poi.xssf.usermodel.TestXSSFFont
Tests run: 22, Failures: 0, Errors: 0, Skipped: 0, Time elapsed: 0.052 sec - in org.apache.poi.xssf.usermodel.TestXSSFFont
Running org.apache.poi.xssf.usermodel.TestMultiSheetFormulaEvaluatorOnXSSF
Tests run: 2, Failures: 0, Errors: 0, Skipped: 0, Time elapsed: 0.002 sec - in org.apache.poi.xssf.usermodel.TestMultiSheetFormulaEvaluatorOnXSSF
Running org.apache.poi.xssf.usermodel.helpers.TestHeaderFooterHelper
Tests run: 2, Failures: 0, Errors: 0, Skipped: 0, Time elapsed: 0 sec - in org.apache.poi.xssf.usermodel.helpers.TestHeaderFooterHelper
Running org.apache.poi.xssf.usermodel.helpers.TestColumnHelper
Tests run: 15, Failures: 0, Errors: 0, Skipped: 0, Time elapsed: 0.04 sec - in org.apache.poi.xssf.usermodel.helpers.TestColumnHelper
Running org.apache.poi.xssf.usermodel.TestXSSFForkedEvaluator
Tests run: 2, Failures: 0, Errors: 0, Skipped: 0, Time elapsed: 0.012 sec - in org.apache.poi.xssf.usermodel.TestXSSFForkedEvaluator
Running org.apache.poi.xssf.usermodel.TestXSSFSheetAutosizeColumn
Tests run: 7, Failures: 0, Errors: 0, Skipped: 0, Time elapsed: 0.059 sec - in org.apache.poi.xssf.usermodel.TestXSSFSheetAutosizeColumn
Running org.apache.poi.xssf.usermodel.TestFormulaEvaluatorOnXSSF
Tests run: 369, Failures: 0, Errors: 0, Skipped: 90, Time elapsed: 0.274 sec - in org.apache.poi.xssf.usermodel.TestFormulaEvaluatorOnXSSF
Running org.apache.poi.xssf.usermodel.TestXSSFSheet
Tests run: 95, Failures: 0, Errors: 0, Skipped: 0, Time elapsed: 3.899 sec - in org.apache.poi.xssf.usermodel.TestXSSFSheet
Running org.apache.poi.xssf.model.TestCalculationChain
Tests run: 1, Failures: 0, Errors: 0, Skipped: 0, Time elapsed: 0.313 sec - in org.apache.poi.xssf.model.TestCalculationChain
Running org.apache.poi.xssf.model.TestSharedStringsTable
Tests run: 3, Failures: 0, Errors: 0, Skipped: 0, Time elapsed: 0.057 sec - in org.apache.poi.xssf.model.TestSharedStringsTable
Running org.apache.poi.xssf.model.TestThemesTable
Tests run: 3, Failures: 0, Errors: 0, Skipped: 0, Time elapsed: 0.071 sec - in org.apache.poi.xssf.model.TestThemesTable
Running org.apache.poi.xssf.model.TestCommentsTable
Tests run: 7, Failures: 0, Errors: 0, Skipped: 0, Time elapsed: 0.063 sec - in org.apache.poi.xssf.model.TestCommentsTable
Running org.apache.poi.xssf.model.TestExternalLinksTable
Tests run: 4, Failures: 0, Errors: 0, Skipped: 0, Time elapsed: 0.042 sec - in org.apache.poi.xssf.model.TestExternalLinksTable
Running org.apache.poi.xssf.model.TestStylesTable
Tests run: 13, Failures: 0, Errors: 0, Skipped: 0, Time elapsed: 0.133 sec - in org.apache.poi.xssf.model.TestStylesTable
Running org.apache.poi.xssf.model.TestMapInfo
Tests run: 1, Failures: 0, Errors: 0, Skipped: 0, Time elapsed: 0.017 sec - in org.apache.poi.xssf.model.TestMapInfo
Running org.apache.poi.xssf.TestWorkbookProtection
Tests run: 8, Failures: 0, Errors: 0, Skipped: 0, Time elapsed: 0.501 sec - in org.apache.poi.xssf.TestWorkbookProtection
Running org.apache.poi.xssf.extractor.TestXSSFEventBasedExcelExtractor
Tests run: 12, Failures: 0, Errors: 0, Skipped: 0, Time elapsed: 0.315 sec - in org.apache.poi.xssf.extractor.TestXSSFEventBasedExcelExtractor
Running org.apache.poi.xssf.extractor.TestXSSFExportToXML
Tests run: 17, Failures: 0, Errors: 0, Skipped: 1, Time elapsed: 0.342 sec - in org.apache.poi.xssf.extractor.TestXSSFExportToXML
Running org.apache.poi.xssf.extractor.TestXSSFEventBasedExcelExtractorUsingFactory
Tests run: 12, Failures: 0, Errors: 0, Skipped: 0, Time elapsed: 0.309 sec - in org.apache.poi.xssf.extractor.TestXSSFEventBasedExcelExtractorUsingFactory
Running org.apache.poi.xssf.extractor.TestXSSFExcelExtractor
Tests run: 8, Failures: 0, Errors: 0, Skipped: 0, Time elapsed: 0.362 sec - in org.apache.poi.xssf.extractor.TestXSSFExcelExtractor
Running org.apache.poi.xssf.extractor.TestXSSFBEventBasedExcelExtractor
Tests run: 3, Failures: 0, Errors: 0, Skipped: 0, Time elapsed: 0.016 sec - in org.apache.poi.xssf.extractor.TestXSSFBEventBasedExcelExtractor
Running org.apache.poi.xssf.extractor.TestXSSFExcelExtractorUsingFactory
Tests run: 8, Failures: 0, Errors: 0, Skipped: 0, Time elapsed: 0.35 sec - in org.apache.poi.xssf.extractor.TestXSSFExcelExtractorUsingFactory
Running org.apache.poi.xssf.extractor.TestXSSFImportFromXML
Tests run: 5, Failures: 0, Errors: 0, Skipped: 0, Time elapsed: 5.389 sec - in org.apache.poi.xssf.extractor.TestXSSFImportFromXML
Running org.apache.poi.ss.util.TestXSSFPropertyTemplate
Tests run: 2, Failures: 0, Errors: 0, Skipped: 0, Time elapsed: 0.099 sec - in org.apache.poi.ss.util.TestXSSFPropertyTemplate
Running org.apache.poi.ss.util.TestXSSFCellUtil
Tests run: 13, Failures: 0, Errors: 0, Skipped: 0, Time elapsed: 0.075 sec - in org.apache.poi.ss.util.TestXSSFCellUtil
Running org.apache.poi.ss.util.TestSXSSFCellUtil
Tests run: 13, Failures: 0, Errors: 0, Skipped: 0, Time elapsed: 0.06 sec - in org.apache.poi.ss.util.TestSXSSFCellUtil
Running org.apache.poi.ss.format.TestCellFormatPart
Tests run: 6, Failures: 0, Errors: 0, Skipped: 0, Time elapsed: 0.35 sec - in org.apache.poi.ss.format.TestCellFormatPart
Running org.apache.poi.ss.formula.TestFormulaParser
Tests run: 9, Failures: 0, Errors: 0, Skipped: 0, Time elapsed: 0.029 sec - in org.apache.poi.ss.formula.TestFormulaParser
Running org.apache.poi.ss.formula.functions.TestProper
Tests run: 4, Failures: 0, Errors: 0, Skipped: 0, Time elapsed: 1.766 sec - in org.apache.poi.ss.formula.functions.TestProper
Running org.apache.poi.ss.formula.functions.TestSumifsXSSF
Tests run: 1, Failures: 0, Errors: 0, Skipped: 0, Time elapsed: 0.006 sec - in org.apache.poi.ss.formula.functions.TestSumifsXSSF
Running org.apache.poi.ss.formula.TestStructuredReferences
Tests run: 2, Failures: 0, Errors: 0, Skipped: 0, Time elapsed: 0.008 sec - in org.apache.poi.ss.formula.TestStructuredReferences
Running org.apache.poi.ss.formula.eval.TestXSSFCircularReferences
Tests run: 4, Failures: 0, Errors: 0, Skipped: 0, Time elapsed: 0.05 sec - in org.apache.poi.ss.formula.eval.TestXSSFCircularReferences
Running org.apache.poi.ss.usermodel.TestEmbedOLEPackage
Tests run: 2, Failures: 0, Errors: 0, Skipped: 0, Time elapsed: 0.058 sec - in org.apache.poi.ss.usermodel.TestEmbedOLEPackage
Running org.apache.poi.ss.usermodel.ConditionalFormattingEvalTest
Tests run: 5, Failures: 0, Errors: 0, Skipped: 0, Time elapsed: 0.644 sec - in org.apache.poi.ss.usermodel.ConditionalFormattingEvalTest
Running org.apache.poi.ss.usermodel.TestXSSFBorderStyle
Tests run: 1, Failures: 0, Errors: 0, Skipped: 0, Time elapsed: 0.004 sec - in org.apache.poi.ss.usermodel.TestXSSFBorderStyle
Running org.apache.poi.ss.extractor.TestEmbeddedExtractor
Tests run: 3, Failures: 0, Errors: 0, Skipped: 0, Time elapsed: 0.267 sec - in org.apache.poi.ss.extractor.TestEmbeddedExtractor
Running org.apache.poi.ss.TestWorkbookFactory
Tests run: 8, Failures: 0, Errors: 0, Skipped: 0, Time elapsed: 0.298 sec - in org.apache.poi.ss.TestWorkbookFactory
Running org.apache.poi.TestPOIXMLDocument
Tests run: 10, Failures: 0, Errors: 0, Skipped: 0, Time elapsed: 2.262 sec - in org.apache.poi.TestPOIXMLDocument
Running org.apache.poi.dev.TestOOXMLLister
Tests run: 2, Failures: 0, Errors: 0, Skipped: 0, Time elapsed: 0.01 sec - in org.apache.poi.dev.TestOOXMLLister
Running org.apache.poi.dev.TestOOXMLPrettyPrint
Tests run: 1, Failures: 0, Errors: 0, Skipped: 0, Time elapsed: 0.026 sec - in org.apache.poi.dev.TestOOXMLPrettyPrint
Running org.apache.poi.dev.TestRecordGenerator
Tests run: 3, Failures: 0, Errors: 0, Skipped: 3, Time elapsed: 0 sec - in org.apache.poi.dev.TestRecordGenerator
Running org.apache.poi.TestDetectAsOOXML
Tests run: 3, Failures: 0, Errors: 0, Skipped: 0, Time elapsed: 0.005 sec - in org.apache.poi.TestDetectAsOOXML
Running org.apache.poi.extractor.TestExtractorFactory
Tests run: 11, Failures: 0, Errors: 0, Skipped: 0, Time elapsed: 0.728 sec - in org.apache.poi.extractor.TestExtractorFactory
Running org.apache.poi.openxml4j.opc.TestListParts
Tests run: 1, Failures: 0, Errors: 0, Skipped: 0, Time elapsed: 0.002 sec - in org.apache.poi.openxml4j.opc.TestListParts
Running org.apache.poi.openxml4j.opc.TestPackage
Tests run: 23, Failures: 0, Errors: 0, Skipped: 1, Time elapsed: 0.668 sec - in org.apache.poi.openxml4j.opc.TestPackage
Running org.apache.poi.openxml4j.opc.TestRelationships
Tests run: 9, Failures: 0, Errors: 0, Skipped: 0, Time elapsed: 0.057 sec - in org.apache.poi.openxml4j.opc.TestRelationships
Running org.apache.poi.openxml4j.opc.TestPackagingURIHelper
Tests run: 5, Failures: 0, Errors: 0, Skipped: 0, Time elapsed: 0.001 sec - in org.apache.poi.openxml4j.opc.TestPackagingURIHelper
Running org.apache.poi.openxml4j.opc.internal.TestContentTypeManager
Tests run: 4, Failures: 0, Errors: 0, Skipped: 2, Time elapsed: 0.003 sec - in org.apache.poi.openxml4j.opc.internal.TestContentTypeManager
Running org.apache.poi.openxml4j.opc.internal.marshallers.TestZipPackagePropertiesMarshaller
Tests run: 4, Failures: 0, Errors: 0, Skipped: 0, Time elapsed: 0.001 sec - in org.apache.poi.openxml4j.opc.internal.marshallers.TestZipPackagePropertiesMarshaller
Running org.apache.poi.openxml4j.opc.TestPackageCoreProperties
Tests run: 7, Failures: 0, Errors: 0, Skipped: 0, Time elapsed: 0.054 sec - in org.apache.poi.openxml4j.opc.TestPackageCoreProperties
Running org.apache.poi.openxml4j.opc.TestZipPackage
Tests run: 8, Failures: 0, Errors: 0, Skipped: 0, Time elapsed: 0.587 sec - in org.apache.poi.openxml4j.opc.TestZipPackage
Running org.apache.poi.openxml4j.opc.TestPackageThumbnail
Tests run: 1, Failures: 0, Errors: 0, Skipped: 0, Time elapsed: 0.013 sec - in org.apache.poi.openxml4j.opc.TestPackageThumbnail
Running org.apache.poi.openxml4j.opc.compliance.TestOPCCompliancePartName
Tests run: 10, Failures: 0, Errors: 0, Skipped: 0, Time elapsed: 0.001 sec - in org.apache.poi.openxml4j.opc.compliance.TestOPCCompliancePartName
Running org.apache.poi.openxml4j.opc.compliance.TestOPCComplianceCoreProperties
Tests run: 11, Failures: 0, Errors: 0, Skipped: 0, Time elapsed: 0.075 sec - in org.apache.poi.openxml4j.opc.compliance.TestOPCComplianceCoreProperties
Running org.apache.poi.openxml4j.opc.compliance.TestOPCCompliancePackageModel
Tests run: 5, Failures: 0, Errors: 0, Skipped: 0, Time elapsed: 0.002 sec - in org.apache.poi.openxml4j.opc.compliance.TestOPCCompliancePackageModel
Running org.apache.poi.openxml4j.opc.TestFileHelper
Tests run: 1, Failures: 0, Errors: 0, Skipped: 0, Time elapsed: 0 sec - in org.apache.poi.openxml4j.opc.TestFileHelper
Running org.apache.poi.openxml4j.opc.TestPackagePartName
Tests run: 1, Failures: 0, Errors: 0, Skipped: 0, Time elapsed: 0 sec - in org.apache.poi.openxml4j.opc.TestPackagePartName
Running org.apache.poi.openxml4j.opc.TestContentType
Tests run: 7, Failures: 0, Errors: 0, Skipped: 0, Time elapsed: 0.006 sec - in org.apache.poi.openxml4j.opc.TestContentType
Running org.apache.poi.xslf.TestXSLFSlideShow
Tests run: 5, Failures: 0, Errors: 0, Skipped: 0, Time elapsed: 0.105 sec - in org.apache.poi.xslf.TestXSLFSlideShow
Running org.apache.poi.xslf.usermodel.TestXSLFTextShape
Tests run: 4, Failures: 0, Errors: 0, Skipped: 0, Time elapsed: 0.107 sec - in org.apache.poi.xslf.usermodel.TestXSLFTextShape
Running org.apache.poi.xslf.usermodel.TestXSLFTextRun
Tests run: 1, Failures: 0, Errors: 0, Skipped: 0, Time elapsed: 0.015 sec - in org.apache.poi.xslf.usermodel.TestXSLFTextRun
Running org.apache.poi.xslf.usermodel.TestXSLFFreeformShape
Tests run: 1, Failures: 0, Errors: 0, Skipped: 0, Time elapsed: 0.04 sec - in org.apache.poi.xslf.usermodel.TestXSLFFreeformShape
Running org.apache.poi.xslf.usermodel.TestXMLSlideShow
Tests run: 9, Failures: 0, Errors: 0, Skipped: 0, Time elapsed: 0.22 sec - in org.apache.poi.xslf.usermodel.TestXMLSlideShow
Running org.apache.poi.xslf.usermodel.TestXSLFSlideShowFactory
Tests run: 6, Failures: 0, Errors: 0, Skipped: 0, Time elapsed: 0.533 sec - in org.apache.poi.xslf.usermodel.TestXSLFSlideShowFactory
Running org.apache.poi.xslf.usermodel.TestXSLFAutoShape
Tests run: 4, Failures: 0, Errors: 0, Skipped: 0, Time elapsed: 0.115 sec - in org.apache.poi.xslf.usermodel.TestXSLFAutoShape
Running org.apache.poi.xslf.usermodel.TestXSLFShapeContainer
Tests run: 1, Failures: 0, Errors: 0, Skipped: 0, Time elapsed: 0.029 sec - in org.apache.poi.xslf.usermodel.TestXSLFShapeContainer
Running org.apache.poi.xslf.usermodel.TestXSLFSheet
Tests run: 1, Failures: 0, Errors: 0, Skipped: 0, Time elapsed: 0.051 sec - in org.apache.poi.xslf.usermodel.TestXSLFSheet
Running org.apache.poi.xslf.usermodel.TestXSLFSimpleShape
Tests run: 8, Failures: 0, Errors: 0, Skipped: 0, Time elapsed: 5.75 sec - in org.apache.poi.xslf.usermodel.TestXSLFSimpleShape
Running org.apache.poi.xslf.usermodel.TestXSLFTableStyles
Tests run: 1, Failures: 0, Errors: 0, Skipped: 0, Time elapsed: 0.011 sec - in org.apache.poi.xslf.usermodel.TestXSLFTableStyles
Running org.apache.poi.xslf.usermodel.TestXSLFTextParagraph
Tests run: 5, Failures: 0, Errors: 0, Skipped: 1, Time elapsed: 0.072 sec - in org.apache.poi.xslf.usermodel.TestXSLFTextParagraph
Running org.apache.poi.xslf.usermodel.TestXSLFTheme
Tests run: 1, Failures: 0, Errors: 0, Skipped: 0, Time elapsed: 0.146 sec - in org.apache.poi.xslf.usermodel.TestXSLFTheme
Running org.apache.poi.xslf.usermodel.TestXSLFPictureShape
Tests run: 6, Failures: 0, Errors: 0, Skipped: 0, Time elapsed: 0.302 sec - in org.apache.poi.xslf.usermodel.TestXSLFPictureShape
Running org.apache.poi.xslf.usermodel.TestXSLFHyperlink
Tests run: 3, Failures: 0, Errors: 0, Skipped: 0, Time elapsed: 0.087 sec - in org.apache.poi.xslf.usermodel.TestXSLFHyperlink
Running org.apache.poi.xslf.usermodel.TestXSLFConnectorShape
Tests run: 2, Failures: 0, Errors: 0, Skipped: 0, Time elapsed: 0.047 sec - in org.apache.poi.xslf.usermodel.TestXSLFConnectorShape
Running org.apache.poi.xslf.usermodel.TestXSLFSlide
Tests run: 4, Failures: 0, Errors: 0, Skipped: 0, Time elapsed: 0.706 sec - in org.apache.poi.xslf.usermodel.TestXSLFSlide
Running org.apache.poi.xslf.usermodel.TestXSLFColor
Tests run: 6, Failures: 0, Errors: 0, Skipped: 0, Time elapsed: 0.058 sec - in org.apache.poi.xslf.usermodel.TestXSLFColor
Running org.apache.poi.xslf.usermodel.TestXSLFSlideShow
Tests run: 6, Failures: 0, Errors: 0, Skipped: 0, Time elapsed: 0.191 sec - in org.apache.poi.xslf.usermodel.TestXSLFSlideShow
Running org.apache.poi.xslf.usermodel.TestXSLFNotes
Tests run: 3, Failures: 0, Errors: 0, Skipped: 0, Time elapsed: 0.072 sec - in org.apache.poi.xslf.usermodel.TestXSLFNotes
Running org.apache.poi.xslf.usermodel.TestXSLFChart
Tests run: 1, Failures: 0, Errors: 0, Skipped: 0, Time elapsed: 0.043 sec - in org.apache.poi.xslf.usermodel.TestXSLFChart
Running org.apache.poi.xslf.usermodel.TestPPTX2PNG
Tests run: 10, Failures: 0, Errors: 0, Skipped: 0, Time elapsed: 8.603 sec - in org.apache.poi.xslf.usermodel.TestPPTX2PNG
Running org.apache.poi.xslf.usermodel.TestXSLFShape
Tests run: 2, Failures: 0, Errors: 0, Skipped: 0, Time elapsed: 0.038 sec - in org.apache.poi.xslf.usermodel.TestXSLFShape
Running org.apache.poi.xslf.usermodel.TestXSLFTableRow
Tests run: 7, Failures: 0, Errors: 0, Skipped: 0, Time elapsed: 0.132 sec - in org.apache.poi.xslf.usermodel.TestXSLFTableRow
Running org.apache.poi.xslf.usermodel.TestXSLFTextBox
Tests run: 2, Failures: 0, Errors: 0, Skipped: 0, Time elapsed: 0.03 sec - in org.apache.poi.xslf.usermodel.TestXSLFTextBox
Running org.apache.poi.xslf.usermodel.TestXSLFTable
Tests run: 5, Failures: 0, Errors: 0, Skipped: 0, Time elapsed: 2.781 sec - in org.apache.poi.xslf.usermodel.TestXSLFTable
Running org.apache.poi.xslf.usermodel.TestXSLFGroupShape
Tests run: 2, Failures: 0, Errors: 0, Skipped: 0, Time elapsed: 0.027 sec - in org.apache.poi.xslf.usermodel.TestXSLFGroupShape
Running org.apache.poi.xslf.TestXSLFBugs
Tests run: 22, Failures: 0, Errors: 0, Skipped: 1, Time elapsed: 1.288 sec - in org.apache.poi.xslf.TestXSLFBugs
Running org.apache.poi.xslf.extractor.TestXSLFPowerPointExtractor
Tests run: 5, Failures: 0, Errors: 0, Skipped: 0, Time elapsed: 0.231 sec - in org.apache.poi.xslf.extractor.TestXSLFPowerPointExtractor
Running org.apache.poi.xslf.geom.TestFormulaParser
Tests run: 1, Failures: 0, Errors: 0, Skipped: 0, Time elapsed: 0 sec - in org.apache.poi.xslf.geom.TestFormulaParser

Results :

Failed tests:
  TestXSSFFormulaEvaluation.testBug61495:442 expected:<D 0,068> but was:<org.apache.poi.ss.usermodel.CellValue ["D 00,68"]>

Tests run: 2354, Failures: 1, Errors: 0, Skipped: 158

[INFO] ------------------------------------------------------------------------
[INFO] Reactor Summary:
[INFO]
[INFO] Apache POI - the Java API for Microsoft Documents . SUCCESS [  0.003 s]
[INFO] Apache POI Main package ........................... SUCCESS [01:50 min]
[INFO] Apache POI Scratchpad package ..................... SUCCESS [ 19.034 s]
[INFO] Apache POI - Openxmlformats Schema package ........ SUCCESS [01:35 min]
[INFO] Apache POI - Openxmlformats Encryption Schema package  SUCCESS [  0.862 s]
[INFO] Apache POI - Openxmlformats Security-Schema package  SUCCESS [ 10.792 s]
[INFO] Apache POI OOXML package .......................... FAILURE [02:33 min]
[INFO] Apache POI ExcelAnt package ....................... SKIPPED
[INFO] Apache POI Examples package ....................... SKIPPED
[INFO] ------------------------------------------------------------------------
[INFO] BUILD FAILURE
[INFO] ------------------------------------------------------------------------
[INFO] Total time: 06:30 min
[INFO] Finished at: 2017-11-15T12:10:14+00:00
[INFO] Final Memory: 53M/742M
[INFO] ------------------------------------------------------------------------
[ERROR] Failed to execute goal org.apache.maven.plugins:maven-surefire-plugin:2.19.1:test (default-test) on project poi-ooxml: There are test failures.
[ERROR]
[ERROR] Please refer to <https://builds.apache.org/job/POI-DSL-Maven/ws/sonar/ooxml/target/surefire-reports> for the individual test results.
[ERROR] -> [Help 1]
[ERROR]
[ERROR] To see the full stack trace of the errors, re-run Maven with the -e switch.
[ERROR] Re-run Maven using the -X switch to enable full debug logging.
[ERROR]
[ERROR] For more information about the errors and possible solutions, please read the following articles:
[ERROR] [Help 1] http://cwiki.apache.org/confluence/display/MAVEN/MojoFailureException
[ERROR]
[ERROR] After correcting the problems, you can resume the build with the command
[ERROR]   mvn <goals> -rf :poi-ooxml
Build step 'Invoke top-level Maven targets' marked build as failure

---------------------------------------------------------------------
To unsubscribe, e-mail: [hidden email]
For additional commands, e-mail: [hidden email]

Reply | Threaded
Open this post in threaded view
|

Build failed in Jenkins: POI-DSL-Maven #402

Apache Jenkins Server
See <https://builds.apache.org/job/POI-DSL-Maven/402/display/redirect?page=changes>

Changes:

[gwoolsey] ignore a unit test that snuck in.  It was created to investigate an open bug report.  It fails, as expected, which broke the build.

------------------------------------------
[...truncated 99.25 KB...]
Tests run: 9, Failures: 0, Errors: 0, Skipped: 0, Time elapsed: 0.001 sec - in org.apache.poi.ss.formula.functions.TestMatch
Running org.apache.poi.ss.formula.functions.TestMid
Tests run: 4, Failures: 0, Errors: 0, Skipped: 0, Time elapsed: 0 sec - in org.apache.poi.ss.formula.functions.TestMid
Running org.apache.poi.ss.formula.functions.TestMirr
Tests run: 4, Failures: 0, Errors: 0, Skipped: 0, Time elapsed: 0.001 sec - in org.apache.poi.ss.formula.functions.TestMirr
Running org.apache.poi.ss.formula.functions.TestCountFuncs
Tests run: 16, Failures: 0, Errors: 0, Skipped: 0, Time elapsed: 0.008 sec - in org.apache.poi.ss.formula.functions.TestCountFuncs
Running org.apache.poi.ss.formula.functions.TestIntercept
Tests run: 4, Failures: 0, Errors: 0, Skipped: 0, Time elapsed: 0 sec - in org.apache.poi.ss.formula.functions.TestIntercept
Running org.apache.poi.ss.formula.functions.TestSumifs
Tests run: 7, Failures: 0, Errors: 0, Skipped: 0, Time elapsed: 0 sec - in org.apache.poi.ss.formula.functions.TestSumifs
Running org.apache.poi.ss.formula.functions.TestWeekNumFunctionsFromSpreadsheet2013
Tests run: 7, Failures: 0, Errors: 0, Skipped: 0, Time elapsed: 0 sec - in org.apache.poi.ss.formula.functions.TestWeekNumFunctionsFromSpreadsheet2013
Running org.apache.poi.ss.formula.functions.TestSubtotal
Tests run: 11, Failures: 0, Errors: 0, Skipped: 0, Time elapsed: 0.003 sec - in org.apache.poi.ss.formula.functions.TestSubtotal
Running org.apache.poi.ss.formula.functions.TestComplex
Tests run: 2, Failures: 0, Errors: 0, Skipped: 0, Time elapsed: 0 sec - in org.apache.poi.ss.formula.functions.TestComplex
Running org.apache.poi.ss.formula.functions.TestAddress
Tests run: 1, Failures: 0, Errors: 0, Skipped: 0, Time elapsed: 0 sec - in org.apache.poi.ss.formula.functions.TestAddress
Running org.apache.poi.ss.formula.functions.TestBin2Dec
Tests run: 5, Failures: 0, Errors: 0, Skipped: 0, Time elapsed: 0 sec - in org.apache.poi.ss.formula.functions.TestBin2Dec
Running org.apache.poi.ss.formula.functions.TestSumif
Tests run: 3, Failures: 0, Errors: 0, Skipped: 0, Time elapsed: 0 sec - in org.apache.poi.ss.formula.functions.TestSumif
Running org.apache.poi.ss.formula.functions.TestText
Tests run: 4, Failures: 0, Errors: 0, Skipped: 0, Time elapsed: 0.002 sec - in org.apache.poi.ss.formula.functions.TestText
Running org.apache.poi.ss.formula.functions.TestValue
Tests run: 2, Failures: 0, Errors: 0, Skipped: 0, Time elapsed: 0 sec - in org.apache.poi.ss.formula.functions.TestValue
Running org.apache.poi.ss.formula.functions.TestStatsLib
Tests run: 9, Failures: 0, Errors: 0, Skipped: 0, Time elapsed: 0 sec - in org.apache.poi.ss.formula.functions.TestStatsLib
Running org.apache.poi.ss.formula.functions.TestIndexFunctionFromSpreadsheet
Tests run: 98, Failures: 0, Errors: 0, Skipped: 0, Time elapsed: 0.009 sec - in org.apache.poi.ss.formula.functions.TestIndexFunctionFromSpreadsheet
Running org.apache.poi.ss.formula.functions.TestLen
Tests run: 3, Failures: 0, Errors: 0, Skipped: 0, Time elapsed: 0 sec - in org.apache.poi.ss.formula.functions.TestLen
Running org.apache.poi.ss.formula.functions.TestDec2Hex
Tests run: 12, Failures: 0, Errors: 0, Skipped: 0, Time elapsed: 0.015 sec - in org.apache.poi.ss.formula.functions.TestDec2Hex
Running org.apache.poi.ss.formula.functions.TestNpv
Tests run: 2, Failures: 0, Errors: 0, Skipped: 0, Time elapsed: 0.001 sec - in org.apache.poi.ss.formula.functions.TestNpv
Running org.apache.poi.ss.formula.functions.TestOct2Dec
Tests run: 2, Failures: 0, Errors: 0, Skipped: 0, Time elapsed: 0 sec - in org.apache.poi.ss.formula.functions.TestOct2Dec
Running org.apache.poi.ss.formula.functions.TestAverage
Tests run: 3, Failures: 0, Errors: 0, Skipped: 0, Time elapsed: 0 sec - in org.apache.poi.ss.formula.functions.TestAverage
Running org.apache.poi.ss.formula.functions.TestDStarFunctionsFromSpreadsheet
Tests run: 4, Failures: 0, Errors: 0, Skipped: 0, Time elapsed: 0 sec - in org.apache.poi.ss.formula.functions.TestDStarFunctionsFromSpreadsheet
Running org.apache.poi.ss.formula.functions.TestPPMT
Tests run: 1, Failures: 0, Errors: 0, Skipped: 0, Time elapsed: 0.001 sec - in org.apache.poi.ss.formula.functions.TestPPMT
Running org.apache.poi.ss.formula.functions.TestDelta
Tests run: 2, Failures: 0, Errors: 0, Skipped: 0, Time elapsed: 0 sec - in org.apache.poi.ss.formula.functions.TestDelta
Running org.apache.poi.ss.formula.functions.TestIndex
Tests run: 3, Failures: 0, Errors: 0, Skipped: 0, Time elapsed: 0 sec - in org.apache.poi.ss.formula.functions.TestIndex
Running org.apache.poi.ss.formula.functions.TestMultiOperandNumericFunction
Tests run: 1, Failures: 0, Errors: 0, Skipped: 0, Time elapsed: 0 sec - in org.apache.poi.ss.formula.functions.TestMultiOperandNumericFunction
Running org.apache.poi.ss.formula.functions.TestImaginaryFunctionsFromSpreadsheet
Tests run: 7, Failures: 0, Errors: 0, Skipped: 0, Time elapsed: 0 sec - in org.apache.poi.ss.formula.functions.TestImaginaryFunctionsFromSpreadsheet
Running org.apache.poi.ss.formula.functions.TestWeekNumFunctionsFromSpreadsheet
Tests run: 7, Failures: 0, Errors: 0, Skipped: 0, Time elapsed: 0 sec - in org.apache.poi.ss.formula.functions.TestWeekNumFunctionsFromSpreadsheet
Running org.apache.poi.ss.formula.functions.TestCodeFunctionsFromSpreadsheet
Tests run: 4, Failures: 0, Errors: 0, Skipped: 0, Time elapsed: 0 sec - in org.apache.poi.ss.formula.functions.TestCodeFunctionsFromSpreadsheet
Running org.apache.poi.ss.formula.functions.TestFixed
Tests run: 2, Failures: 0, Errors: 0, Skipped: 0, Time elapsed: 0.001 sec - in org.apache.poi.ss.formula.functions.TestFixed
Running org.apache.poi.ss.formula.functions.TestCalendarFieldFunction
Tests run: 4, Failures: 0, Errors: 0, Skipped: 0, Time elapsed: 0.001 sec - in org.apache.poi.ss.formula.functions.TestCalendarFieldFunction
Running org.apache.poi.ss.formula.functions.TestIrr
Tests run: 3, Failures: 0, Errors: 0, Skipped: 0, Time elapsed: 0.001 sec - in org.apache.poi.ss.formula.functions.TestIrr
Running org.apache.poi.ss.formula.functions.TestTrim
Tests run: 3, Failures: 0, Errors: 0, Skipped: 0, Time elapsed: 0 sec - in org.apache.poi.ss.formula.functions.TestTrim
Running org.apache.poi.ss.formula.functions.TestTFunc
Tests run: 5, Failures: 0, Errors: 0, Skipped: 0, Time elapsed: 0 sec - in org.apache.poi.ss.formula.functions.TestTFunc
Running org.apache.poi.ss.formula.functions.TestImRealFunctionsFromSpreadsheet
Tests run: 7, Failures: 0, Errors: 0, Skipped: 0, Time elapsed: 0.001 sec - in org.apache.poi.ss.formula.functions.TestImRealFunctionsFromSpreadsheet
Running org.apache.poi.ss.formula.functions.TestDate
Tests run: 3, Failures: 0, Errors: 0, Skipped: 0, Time elapsed: 0.001 sec - in org.apache.poi.ss.formula.functions.TestDate
Running org.apache.poi.ss.formula.functions.TestWeekdayFunc
Tests run: 2, Failures: 0, Errors: 0, Skipped: 0, Time elapsed: 0.001 sec - in org.apache.poi.ss.formula.functions.TestWeekdayFunc
Running org.apache.poi.ss.util.TestCellRangeAddress
Tests run: 14, Failures: 0, Errors: 0, Skipped: 0, Time elapsed: 0.004 sec - in org.apache.poi.ss.util.TestCellRangeAddress
Running org.apache.poi.ss.util.TestDateFormatConverter
Tests run: 2, Failures: 0, Errors: 1, Skipped: 0, Time elapsed: 0.327 sec <<< FAILURE! - in org.apache.poi.ss.util.TestDateFormatConverter
testJavaDateFormatsInExcel(org.apache.poi.ss.util.TestDateFormatConverter)  Time elapsed: 0.327 sec  <<< ERROR!
java.io.IOException: Permission denied
        at org.apache.poi.ss.util.TestDateFormatConverter.outputLocaleDataFormats(TestDateFormatConverter.java:108)
        at org.apache.poi.ss.util.TestDateFormatConverter.testJavaDateFormatsInExcel(TestDateFormatConverter.java:120)

Running org.apache.poi.ss.util.TestPropertyTemplate
Tests run: 8, Failures: 0, Errors: 0, Skipped: 0, Time elapsed: 0.012 sec - in org.apache.poi.ss.util.TestPropertyTemplate
Running org.apache.poi.ss.util.TestNumberComparer
Tests run: 4, Failures: 0, Errors: 0, Skipped: 0, Time elapsed: 0.022 sec - in org.apache.poi.ss.util.TestNumberComparer
Running org.apache.poi.ss.util.TestSheetUtil
Tests run: 7, Failures: 0, Errors: 0, Skipped: 0, Time elapsed: 0.002 sec - in org.apache.poi.ss.util.TestSheetUtil
Running org.apache.poi.ss.util.TestCellRangeUtil
Tests run: 1, Failures: 0, Errors: 0, Skipped: 0, Time elapsed: 0.014 sec - in org.apache.poi.ss.util.TestCellRangeUtil
Running org.apache.poi.ss.util.TestCellReference
Tests run: 25, Failures: 0, Errors: 0, Skipped: 0, Time elapsed: 0.002 sec - in org.apache.poi.ss.util.TestCellReference
Running org.apache.poi.ss.util.TestAreaReference
Tests run: 2, Failures: 0, Errors: 0, Skipped: 0, Time elapsed: 0 sec - in org.apache.poi.ss.util.TestAreaReference
Running org.apache.poi.ss.util.TestExpandedDouble
Tests run: 3, Failures: 0, Errors: 0, Skipped: 0, Time elapsed: 0 sec - in org.apache.poi.ss.util.TestExpandedDouble
Running org.apache.poi.ss.util.TestHSSFCellUtil
Tests run: 13, Failures: 0, Errors: 0, Skipped: 0, Time elapsed: 0.002 sec - in org.apache.poi.ss.util.TestHSSFCellUtil
Running org.apache.poi.ss.util.TestSheetBuilder
Tests run: 3, Failures: 0, Errors: 0, Skipped: 0, Time elapsed: 0.001 sec - in org.apache.poi.ss.util.TestSheetBuilder
Running org.apache.poi.ss.util.TestNumberToTextConverter
Tests run: 2, Failures: 0, Errors: 0, Skipped: 0, Time elapsed: 0.003 sec - in org.apache.poi.ss.util.TestNumberToTextConverter
Running org.apache.poi.ss.util.TestRegionUtil
Tests run: 10, Failures: 0, Errors: 0, Skipped: 0, Time elapsed: 0.005 sec - in org.apache.poi.ss.util.TestRegionUtil
Running org.apache.poi.ss.util.TestCellAddress
Tests run: 6, Failures: 0, Errors: 0, Skipped: 0, Time elapsed: 0.002 sec - in org.apache.poi.ss.util.TestCellAddress
Running org.apache.poi.ss.util.TestWorkbookUtil
Tests run: 1, Failures: 0, Errors: 0, Skipped: 0, Time elapsed: 0 sec - in org.apache.poi.ss.util.TestWorkbookUtil
Running org.apache.poi.ss.util.cellwalk.TestCellWalk
Tests run: 1, Failures: 0, Errors: 0, Skipped: 0, Time elapsed: 0.004 sec - in org.apache.poi.ss.util.cellwalk.TestCellWalk
Running org.apache.poi.ss.format.TestCellFormat
Nov 15, 2017 8:06:31 PM org.apache.poi.ss.format.CellFormatPart getColor
WARNING: Unknown color: "Red"
Tests run: 40, Failures: 0, Errors: 0, Skipped: 0, Time elapsed: 0.129 sec - in org.apache.poi.ss.format.TestCellFormat
Running org.apache.poi.ss.format.TestCellFormatCondition
Tests run: 1, Failures: 0, Errors: 0, Skipped: 0, Time elapsed: 0 sec - in org.apache.poi.ss.format.TestCellFormatCondition
Running org.apache.poi.ss.format.TestCellFormatResult
Tests run: 1, Failures: 0, Errors: 0, Skipped: 0, Time elapsed: 0 sec - in org.apache.poi.ss.format.TestCellFormatResult
Running org.apache.poi.ss.TestSpreadsheetVersion
Tests run: 2, Failures: 0, Errors: 0, Skipped: 0, Time elapsed: 0 sec - in org.apache.poi.ss.TestSpreadsheetVersion
Running org.apache.poi.ss.usermodel.TestDateUtil
Tests run: 5, Failures: 0, Errors: 0, Skipped: 0, Time elapsed: 0 sec - in org.apache.poi.ss.usermodel.TestDateUtil
Running org.apache.poi.ss.usermodel.TestIndexedColors
Tests run: 3, Failures: 0, Errors: 0, Skipped: 0, Time elapsed: 0 sec - in org.apache.poi.ss.usermodel.TestIndexedColors
Running org.apache.poi.ss.usermodel.TestFractionFormat
Tests run: 2, Failures: 0, Errors: 0, Skipped: 0, Time elapsed: 0.105 sec - in org.apache.poi.ss.usermodel.TestFractionFormat
Running org.apache.poi.ss.usermodel.TestExcelStyleDateFormatter
Tests run: 4, Failures: 0, Errors: 0, Skipped: 0, Time elapsed: 0.01 sec - in org.apache.poi.ss.usermodel.TestExcelStyleDateFormatter
Running org.apache.poi.ss.usermodel.TestHSSFBorderStyle
Tests run: 1, Failures: 0, Errors: 0, Skipped: 0, Time elapsed: 0 sec - in org.apache.poi.ss.usermodel.TestHSSFBorderStyle
Running org.apache.poi.ss.usermodel.charts.TestDataSources
Tests run: 6, Failures: 0, Errors: 0, Skipped: 0, Time elapsed: 0.004 sec - in org.apache.poi.ss.usermodel.charts.TestDataSources
Running org.apache.poi.ss.usermodel.TestDataFormatter
Tests run: 33, Failures: 0, Errors: 0, Skipped: 1, Time elapsed: 0.05 sec - in org.apache.poi.ss.usermodel.TestDataFormatter
Running org.apache.poi.TestPOIDocumentMain
Tests run: 6, Failures: 0, Errors: 0, Skipped: 0, Time elapsed: 0.006 sec - in org.apache.poi.TestPOIDocumentMain

Results :

Failed tests:
  TestTempFile.testSetTempFileCreationStrategy
Expected: an instance of java.lang.IllegalArgumentException
     but: <org.junit.internal.runners.model.MultipleFailureException: There were 2 errors:
  java.lang.IllegalArgumentException(strategy == null)
  java.io.IOException(Permission denied)> is a org.junit.internal.runners.model.MultipleFailureException
Stacktrace was: org.junit.internal.runners.model.MultipleFailureException: There were 2 errors:
  java.lang.IllegalArgumentException(strategy == null)
  java.io.IOException(Permission denied)
        at org.junit.runners.model.MultipleFailureException.assertEmpty(MultipleFailureException.java:67)
        at org.junit.internal.runners.statements.RunAfters.evaluate(RunAfters.java:39)
        at org.junit.rules.ExpectedException$ExpectedExceptionStatement.evaluate(ExpectedException.java:239)
        at org.junit.rules.RunRules.evaluate(RunRules.java:20)
        at org.junit.runners.ParentRunner.runLeaf(ParentRunner.java:325)
        at org.junit.runners.BlockJUnit4ClassRunner.runChild(BlockJUnit4ClassRunner.java:78)
        at org.junit.runners.BlockJUnit4ClassRunner.runChild(BlockJUnit4ClassRunner.java:57)
        at org.junit.runners.ParentRunner$3.run(ParentRunner.java:290)
        at org.junit.runners.ParentRunner$1.schedule(ParentRunner.java:71)
        at org.junit.runners.ParentRunner.runChildren(ParentRunner.java:288)
        at org.junit.runners.ParentRunner.access$000(ParentRunner.java:58)
        at org.junit.runners.ParentRunner$2.evaluate(ParentRunner.java:268)
        at org.junit.runners.ParentRunner.run(ParentRunner.java:363)
        at org.junit.runners.Suite.runChild(Suite.java:128)
        at org.junit.runners.Suite.runChild(Suite.java:27)
        at org.junit.runners.ParentRunner$3.run(ParentRunner.java:290)
        at org.junit.runners.ParentRunner$1.schedule(ParentRunner.java:71)
        at org.junit.runners.ParentRunner.runChildren(ParentRunner.java:288)
        at org.junit.runners.ParentRunner.access$000(ParentRunner.java:58)
        at org.junit.runners.ParentRunner$2.evaluate(ParentRunner.java:268)
        at org.junit.runners.ParentRunner.run(ParentRunner.java:363)
        at org.apache.maven.surefire.junitcore.JUnitCore.run(JUnitCore.java:55)
        at org.apache.maven.surefire.junitcore.JUnitCoreWrapper.createRequestAndRun(JUnitCoreWrapper.java:137)
        at org.apache.maven.surefire.junitcore.JUnitCoreWrapper.executeEager(JUnitCoreWrapper.java:107)
        at org.apache.maven.surefire.junitcore.JUnitCoreWrapper.execute(JUnitCoreWrapper.java:83)
        at org.apache.maven.surefire.junitcore.JUnitCoreWrapper.execute(JUnitCoreWrapper.java:75)
        at org.apache.maven.surefire.junitcore.JUnitCoreProvider.invoke(JUnitCoreProvider.java:161)
        at org.apache.maven.surefire.booter.ForkedBooter.invokeProviderInSameClassLoader(ForkedBooter.java:290)
        at org.apache.maven.surefire.booter.ForkedBooter.runSuitesInProcess(ForkedBooter.java:242)
        at org.apache.maven.surefire.booter.ForkedBooter.main(ForkedBooter.java:121)

Tests in error:
  TestWrite.dictionary:475 » IO Permission denied
  TestWrite.dictionaryWithInvalidCodepage »  Unexpected exception, expected<org....
  TestWrite.inPlaceNPOIFSWrite:526 » IO Permission denied
  TestWrite.withoutAFormatID »  Unexpected exception, expected<org.apache.poi.hp...
  TestWriteWellKnown.testWriteWellKnown:170 » IO Permission denied
  TestCellStyle.testDataStyle:104 » IO Permission denied
  TestCellStyle.testWriteSheetFont:64 » IO Permission denied
  TestCellStyle.testWriteSheetStyle:176 » IO Permission denied
  TestFormulas.test27272_1:927 » IO Permission denied
  TestFormulas.test27272_2:939 » IO Permission denied
  TestFormulas.testComplexSheetRefs:914 » IO Permission denied
  TestFormulas.testRVAoperands:637 » IO Permission denied
  TestHSSFWorkbook.inPlaceWrite:1270 » IO Permission denied
  TestHSSFWorkbook.testRewriteFileBug58480:1137 » IO Permission denied
  TestHSSFWorkbook.testWriteToNewFile:1310 » IO Permission denied
  TestPOIFSDump.testFailToWrite »  Unexpected exception, expected<java.lang.Inde...
  TestNPOIFSFileSystem.createWriteRead:1005->writeOutFileAndReadBack:103 » IO Pe...
  TestDataSource.testFileWritable:58 » IO Permission denied
  TestDataSource.testRewritableFile:86 » IO Permission denied
  TestDateFormatConverter.testJavaDateFormatsInExcel:120->outputLocaleDataFormats:108 » IO
  TestHexDump.testMain:268 » IO Permission denied
org.apache.poi.util.TestTempFile.createTempFileWithDefaultSuffix(org.apache.poi.util.TestTempFile)
  Run 1: TestTempFile.createTempFileWithDefaultSuffix:109 » IO Permission denied
  Run 2: TestTempFile.tearDown:81 » IO Permission denied

org.apache.poi.util.TestTempFile.testCreateTempDirectory(org.apache.poi.util.TestTempFile)
  Run 1: TestTempFile.testCreateTempDirectory:117 » IO Could not create temporary direc...
  Run 2: TestTempFile.tearDown:81 » IO Permission denied

org.apache.poi.util.TestTempFile.testCreateTempFile(org.apache.poi.util.TestTempFile)
  Run 1: TestTempFile.testCreateTempFile:89 » IO Permission denied
  Run 2: TestTempFile.tearDown:81 » IO Permission denied


Tests run: 6527, Failures: 1, Errors: 24, Skipped: 776

[INFO] ------------------------------------------------------------------------
[INFO] Reactor Summary:
[INFO]
[INFO] Apache POI - the Java API for Microsoft Documents . SUCCESS [  0.002 s]
[INFO] Apache POI Main package ........................... FAILURE [01:25 min]
[INFO] Apache POI Scratchpad package ..................... SKIPPED
[INFO] Apache POI - Openxmlformats Schema package ........ SKIPPED
[INFO] Apache POI - Openxmlformats Encryption Schema package  SKIPPED
[INFO] Apache POI - Openxmlformats Security-Schema package  SKIPPED
[INFO] Apache POI OOXML package .......................... SKIPPED
[INFO] Apache POI ExcelAnt package ....................... SKIPPED
[INFO] Apache POI Examples package ....................... SKIPPED
[INFO] ------------------------------------------------------------------------
[INFO] BUILD FAILURE
[INFO] ------------------------------------------------------------------------
[INFO] Total time: 01:26 min
[INFO] Finished at: 2017-11-15T20:06:32+00:00
[INFO] Final Memory: 29M/827M
[INFO] ------------------------------------------------------------------------
[ERROR] Failed to execute goal org.apache.maven.plugins:maven-surefire-plugin:2.19.1:test (default-test) on project poi-main: There are test failures.
[ERROR]
[ERROR] Please refer to <https://builds.apache.org/job/POI-DSL-Maven/ws/sonar/main/target/surefire-reports> for the individual test results.
[ERROR] -> [Help 1]
[ERROR]
[ERROR] To see the full stack trace of the errors, re-run Maven with the -e switch.
[ERROR] Re-run Maven using the -X switch to enable full debug logging.
[ERROR]
[ERROR] For more information about the errors and possible solutions, please read the following articles:
[ERROR] [Help 1] http://cwiki.apache.org/confluence/display/MAVEN/MojoFailureException
[ERROR]
[ERROR] After correcting the problems, you can resume the build with the command
[ERROR]   mvn <goals> -rf :poi-main
Build step 'Invoke top-level Maven targets' marked build as failure

---------------------------------------------------------------------
To unsubscribe, e-mail: [hidden email]
For additional commands, e-mail: [hidden email]

Reply | Threaded
Open this post in threaded view
|

Re: Build failed in Jenkins: POI-DSL-Maven #402

Greg Woolsey
Anyone know what's up with the "permission denied" errors?

On Wed, Nov 15, 2017 at 12:06 PM Apache Jenkins Server <
[hidden email]> wrote:

> See <
> https://builds.apache.org/job/POI-DSL-Maven/402/display/redirect?page=changes
> >
>
> Changes:
>
> [gwoolsey] ignore a unit test that snuck in.  It was created to
> investigate an open bug report.  It fails, as expected, which broke the
> build.
>
> ------------------------------------------
> [...truncated 99.25 KB...]
> Tests run: 9, Failures: 0, Errors: 0, Skipped: 0, Time elapsed: 0.001 sec
> - in org.apache.poi.ss.formula.functions.TestMatch
> Running org.apache.poi.ss.formula.functions.TestMid
> Tests run: 4, Failures: 0, Errors: 0, Skipped: 0, Time elapsed: 0 sec - in
> org.apache.poi.ss.formula.functions.TestMid
> Running org.apache.poi.ss.formula.functions.TestMirr
> Tests run: 4, Failures: 0, Errors: 0, Skipped: 0, Time elapsed: 0.001 sec
> - in org.apache.poi.ss.formula.functions.TestMirr
> Running org.apache.poi.ss.formula.functions.TestCountFuncs
> Tests run: 16, Failures: 0, Errors: 0, Skipped: 0, Time elapsed: 0.008 sec
> - in org.apache.poi.ss.formula.functions.TestCountFuncs
> Running org.apache.poi.ss.formula.functions.TestIntercept
> Tests run: 4, Failures: 0, Errors: 0, Skipped: 0, Time elapsed: 0 sec - in
> org.apache.poi.ss.formula.functions.TestIntercept
> Running org.apache.poi.ss.formula.functions.TestSumifs
> Tests run: 7, Failures: 0, Errors: 0, Skipped: 0, Time elapsed: 0 sec - in
> org.apache.poi.ss.formula.functions.TestSumifs
> Running
> org.apache.poi.ss.formula.functions.TestWeekNumFunctionsFromSpreadsheet2013
> Tests run: 7, Failures: 0, Errors: 0, Skipped: 0, Time elapsed: 0 sec - in
> org.apache.poi.ss.formula.functions.TestWeekNumFunctionsFromSpreadsheet2013
> Running org.apache.poi.ss.formula.functions.TestSubtotal
> Tests run: 11, Failures: 0, Errors: 0, Skipped: 0, Time elapsed: 0.003 sec
> - in org.apache.poi.ss.formula.functions.TestSubtotal
> Running org.apache.poi.ss.formula.functions.TestComplex
> Tests run: 2, Failures: 0, Errors: 0, Skipped: 0, Time elapsed: 0 sec - in
> org.apache.poi.ss.formula.functions.TestComplex
> Running org.apache.poi.ss.formula.functions.TestAddress
> Tests run: 1, Failures: 0, Errors: 0, Skipped: 0, Time elapsed: 0 sec - in
> org.apache.poi.ss.formula.functions.TestAddress
> Running org.apache.poi.ss.formula.functions.TestBin2Dec
> Tests run: 5, Failures: 0, Errors: 0, Skipped: 0, Time elapsed: 0 sec - in
> org.apache.poi.ss.formula.functions.TestBin2Dec
> Running org.apache.poi.ss.formula.functions.TestSumif
> Tests run: 3, Failures: 0, Errors: 0, Skipped: 0, Time elapsed: 0 sec - in
> org.apache.poi.ss.formula.functions.TestSumif
> Running org.apache.poi.ss.formula.functions.TestText
> Tests run: 4, Failures: 0, Errors: 0, Skipped: 0, Time elapsed: 0.002 sec
> - in org.apache.poi.ss.formula.functions.TestText
> Running org.apache.poi.ss.formula.functions.TestValue
> Tests run: 2, Failures: 0, Errors: 0, Skipped: 0, Time elapsed: 0 sec - in
> org.apache.poi.ss.formula.functions.TestValue
> Running org.apache.poi.ss.formula.functions.TestStatsLib
> Tests run: 9, Failures: 0, Errors: 0, Skipped: 0, Time elapsed: 0 sec - in
> org.apache.poi.ss.formula.functions.TestStatsLib
> Running
> org.apache.poi.ss.formula.functions.TestIndexFunctionFromSpreadsheet
> Tests run: 98, Failures: 0, Errors: 0, Skipped: 0, Time elapsed: 0.009 sec
> - in org.apache.poi.ss.formula.functions.TestIndexFunctionFromSpreadsheet
> Running org.apache.poi.ss.formula.functions.TestLen
> Tests run: 3, Failures: 0, Errors: 0, Skipped: 0, Time elapsed: 0 sec - in
> org.apache.poi.ss.formula.functions.TestLen
> Running org.apache.poi.ss.formula.functions.TestDec2Hex
> Tests run: 12, Failures: 0, Errors: 0, Skipped: 0, Time elapsed: 0.015 sec
> - in org.apache.poi.ss.formula.functions.TestDec2Hex
> Running org.apache.poi.ss.formula.functions.TestNpv
> Tests run: 2, Failures: 0, Errors: 0, Skipped: 0, Time elapsed: 0.001 sec
> - in org.apache.poi.ss.formula.functions.TestNpv
> Running org.apache.poi.ss.formula.functions.TestOct2Dec
> Tests run: 2, Failures: 0, Errors: 0, Skipped: 0, Time elapsed: 0 sec - in
> org.apache.poi.ss.formula.functions.TestOct2Dec
> Running org.apache.poi.ss.formula.functions.TestAverage
> Tests run: 3, Failures: 0, Errors: 0, Skipped: 0, Time elapsed: 0 sec - in
> org.apache.poi.ss.formula.functions.TestAverage
> Running
> org.apache.poi.ss.formula.functions.TestDStarFunctionsFromSpreadsheet
> Tests run: 4, Failures: 0, Errors: 0, Skipped: 0, Time elapsed: 0 sec - in
> org.apache.poi.ss.formula.functions.TestDStarFunctionsFromSpreadsheet
> Running org.apache.poi.ss.formula.functions.TestPPMT
> Tests run: 1, Failures: 0, Errors: 0, Skipped: 0, Time elapsed: 0.001 sec
> - in org.apache.poi.ss.formula.functions.TestPPMT
> Running org.apache.poi.ss.formula.functions.TestDelta
> Tests run: 2, Failures: 0, Errors: 0, Skipped: 0, Time elapsed: 0 sec - in
> org.apache.poi.ss.formula.functions.TestDelta
> Running org.apache.poi.ss.formula.functions.TestIndex
> Tests run: 3, Failures: 0, Errors: 0, Skipped: 0, Time elapsed: 0 sec - in
> org.apache.poi.ss.formula.functions.TestIndex
> Running org.apache.poi.ss.formula.functions.TestMultiOperandNumericFunction
> Tests run: 1, Failures: 0, Errors: 0, Skipped: 0, Time elapsed: 0 sec - in
> org.apache.poi.ss.formula.functions.TestMultiOperandNumericFunction
> Running
> org.apache.poi.ss.formula.functions.TestImaginaryFunctionsFromSpreadsheet
> Tests run: 7, Failures: 0, Errors: 0, Skipped: 0, Time elapsed: 0 sec - in
> org.apache.poi.ss.formula.functions.TestImaginaryFunctionsFromSpreadsheet
> Running
> org.apache.poi.ss.formula.functions.TestWeekNumFunctionsFromSpreadsheet
> Tests run: 7, Failures: 0, Errors: 0, Skipped: 0, Time elapsed: 0 sec - in
> org.apache.poi.ss.formula.functions.TestWeekNumFunctionsFromSpreadsheet
> Running
> org.apache.poi.ss.formula.functions.TestCodeFunctionsFromSpreadsheet
> Tests run: 4, Failures: 0, Errors: 0, Skipped: 0, Time elapsed: 0 sec - in
> org.apache.poi.ss.formula.functions.TestCodeFunctionsFromSpreadsheet
> Running org.apache.poi.ss.formula.functions.TestFixed
> Tests run: 2, Failures: 0, Errors: 0, Skipped: 0, Time elapsed: 0.001 sec
> - in org.apache.poi.ss.formula.functions.TestFixed
> Running org.apache.poi.ss.formula.functions.TestCalendarFieldFunction
> Tests run: 4, Failures: 0, Errors: 0, Skipped: 0, Time elapsed: 0.001 sec
> - in org.apache.poi.ss.formula.functions.TestCalendarFieldFunction
> Running org.apache.poi.ss.formula.functions.TestIrr
> Tests run: 3, Failures: 0, Errors: 0, Skipped: 0, Time elapsed: 0.001 sec
> - in org.apache.poi.ss.formula.functions.TestIrr
> Running org.apache.poi.ss.formula.functions.TestTrim
> Tests run: 3, Failures: 0, Errors: 0, Skipped: 0, Time elapsed: 0 sec - in
> org.apache.poi.ss.formula.functions.TestTrim
> Running org.apache.poi.ss.formula.functions.TestTFunc
> Tests run: 5, Failures: 0, Errors: 0, Skipped: 0, Time elapsed: 0 sec - in
> org.apache.poi.ss.formula.functions.TestTFunc
> Running
> org.apache.poi.ss.formula.functions.TestImRealFunctionsFromSpreadsheet
> Tests run: 7, Failures: 0, Errors: 0, Skipped: 0, Time elapsed: 0.001 sec
> - in org.apache.poi.ss.formula.functions.TestImRealFunctionsFromSpreadsheet
> Running org.apache.poi.ss.formula.functions.TestDate
> Tests run: 3, Failures: 0, Errors: 0, Skipped: 0, Time elapsed: 0.001 sec
> - in org.apache.poi.ss.formula.functions.TestDate
> Running org.apache.poi.ss.formula.functions.TestWeekdayFunc
> Tests run: 2, Failures: 0, Errors: 0, Skipped: 0, Time elapsed: 0.001 sec
> - in org.apache.poi.ss.formula.functions.TestWeekdayFunc
> Running org.apache.poi.ss.util.TestCellRangeAddress
> Tests run: 14, Failures: 0, Errors: 0, Skipped: 0, Time elapsed: 0.004 sec
> - in org.apache.poi.ss.util.TestCellRangeAddress
> Running org.apache.poi.ss.util.TestDateFormatConverter
> Tests run: 2, Failures: 0, Errors: 1, Skipped: 0, Time elapsed: 0.327 sec
> <<< FAILURE! - in org.apache.poi.ss.util.TestDateFormatConverter
> testJavaDateFormatsInExcel(org.apache.poi.ss.util.TestDateFormatConverter)
> Time elapsed: 0.327 sec  <<< ERROR!
> java.io.IOException: Permission denied
>         at
> org.apache.poi.ss.util.TestDateFormatConverter.outputLocaleDataFormats(TestDateFormatConverter.java:108)
>         at
> org.apache.poi.ss.util.TestDateFormatConverter.testJavaDateFormatsInExcel(TestDateFormatConverter.java:120)
>
> Running org.apache.poi.ss.util.TestPropertyTemplate
> Tests run: 8, Failures: 0, Errors: 0, Skipped: 0, Time elapsed: 0.012 sec
> - in org.apache.poi.ss.util.TestPropertyTemplate
> Running org.apache.poi.ss.util.TestNumberComparer
> Tests run: 4, Failures: 0, Errors: 0, Skipped: 0, Time elapsed: 0.022 sec
> - in org.apache.poi.ss.util.TestNumberComparer
> Running org.apache.poi.ss.util.TestSheetUtil
> Tests run: 7, Failures: 0, Errors: 0, Skipped: 0, Time elapsed: 0.002 sec
> - in org.apache.poi.ss.util.TestSheetUtil
> Running org.apache.poi.ss.util.TestCellRangeUtil
> Tests run: 1, Failures: 0, Errors: 0, Skipped: 0, Time elapsed: 0.014 sec
> - in org.apache.poi.ss.util.TestCellRangeUtil
> Running org.apache.poi.ss.util.TestCellReference
> Tests run: 25, Failures: 0, Errors: 0, Skipped: 0, Time elapsed: 0.002 sec
> - in org.apache.poi.ss.util.TestCellReference
> Running org.apache.poi.ss.util.TestAreaReference
> Tests run: 2, Failures: 0, Errors: 0, Skipped: 0, Time elapsed: 0 sec - in
> org.apache.poi.ss.util.TestAreaReference
> Running org.apache.poi.ss.util.TestExpandedDouble
> Tests run: 3, Failures: 0, Errors: 0, Skipped: 0, Time elapsed: 0 sec - in
> org.apache.poi.ss.util.TestExpandedDouble
> Running org.apache.poi.ss.util.TestHSSFCellUtil
> Tests run: 13, Failures: 0, Errors: 0, Skipped: 0, Time elapsed: 0.002 sec
> - in org.apache.poi.ss.util.TestHSSFCellUtil
> Running org.apache.poi.ss.util.TestSheetBuilder
> Tests run: 3, Failures: 0, Errors: 0, Skipped: 0, Time elapsed: 0.001 sec
> - in org.apache.poi.ss.util.TestSheetBuilder
> Running org.apache.poi.ss.util.TestNumberToTextConverter
> Tests run: 2, Failures: 0, Errors: 0, Skipped: 0, Time elapsed: 0.003 sec
> - in org.apache.poi.ss.util.TestNumberToTextConverter
> Running org.apache.poi.ss.util.TestRegionUtil
> Tests run: 10, Failures: 0, Errors: 0, Skipped: 0, Time elapsed: 0.005 sec
> - in org.apache.poi.ss.util.TestRegionUtil
> Running org.apache.poi.ss.util.TestCellAddress
> Tests run: 6, Failures: 0, Errors: 0, Skipped: 0, Time elapsed: 0.002 sec
> - in org.apache.poi.ss.util.TestCellAddress
> Running org.apache.poi.ss.util.TestWorkbookUtil
> Tests run: 1, Failures: 0, Errors: 0, Skipped: 0, Time elapsed: 0 sec - in
> org.apache.poi.ss.util.TestWorkbookUtil
> Running org.apache.poi.ss.util.cellwalk.TestCellWalk
> Tests run: 1, Failures: 0, Errors: 0, Skipped: 0, Time elapsed: 0.004 sec
> - in org.apache.poi.ss.util.cellwalk.TestCellWalk
> Running org.apache.poi.ss.format.TestCellFormat
> Nov 15, 2017 8:06:31 PM org.apache.poi.ss.format.CellFormatPart getColor
> WARNING: Unknown color: "Red"
> Tests run: 40, Failures: 0, Errors: 0, Skipped: 0, Time elapsed: 0.129 sec
> - in org.apache.poi.ss.format.TestCellFormat
> Running org.apache.poi.ss.format.TestCellFormatCondition
> Tests run: 1, Failures: 0, Errors: 0, Skipped: 0, Time elapsed: 0 sec - in
> org.apache.poi.ss.format.TestCellFormatCondition
> Running org.apache.poi.ss.format.TestCellFormatResult
> Tests run: 1, Failures: 0, Errors: 0, Skipped: 0, Time elapsed: 0 sec - in
> org.apache.poi.ss.format.TestCellFormatResult
> Running org.apache.poi.ss.TestSpreadsheetVersion
> Tests run: 2, Failures: 0, Errors: 0, Skipped: 0, Time elapsed: 0 sec - in
> org.apache.poi.ss.TestSpreadsheetVersion
> Running org.apache.poi.ss.usermodel.TestDateUtil
> Tests run: 5, Failures: 0, Errors: 0, Skipped: 0, Time elapsed: 0 sec - in
> org.apache.poi.ss.usermodel.TestDateUtil
> Running org.apache.poi.ss.usermodel.TestIndexedColors
> Tests run: 3, Failures: 0, Errors: 0, Skipped: 0, Time elapsed: 0 sec - in
> org.apache.poi.ss.usermodel.TestIndexedColors
> Running org.apache.poi.ss.usermodel.TestFractionFormat
> Tests run: 2, Failures: 0, Errors: 0, Skipped: 0, Time elapsed: 0.105 sec
> - in org.apache.poi.ss.usermodel.TestFractionFormat
> Running org.apache.poi.ss.usermodel.TestExcelStyleDateFormatter
> Tests run: 4, Failures: 0, Errors: 0, Skipped: 0, Time elapsed: 0.01 sec -
> in org.apache.poi.ss.usermodel.TestExcelStyleDateFormatter
> Running org.apache.poi.ss.usermodel.TestHSSFBorderStyle
> Tests run: 1, Failures: 0, Errors: 0, Skipped: 0, Time elapsed: 0 sec - in
> org.apache.poi.ss.usermodel.TestHSSFBorderStyle
> Running org.apache.poi.ss.usermodel.charts.TestDataSources
> Tests run: 6, Failures: 0, Errors: 0, Skipped: 0, Time elapsed: 0.004 sec
> - in org.apache.poi.ss.usermodel.charts.TestDataSources
> Running org.apache.poi.ss.usermodel.TestDataFormatter
> Tests run: 33, Failures: 0, Errors: 0, Skipped: 1, Time elapsed: 0.05 sec
> - in org.apache.poi.ss.usermodel.TestDataFormatter
> Running org.apache.poi.TestPOIDocumentMain
> Tests run: 6, Failures: 0, Errors: 0, Skipped: 0, Time elapsed: 0.006 sec
> - in org.apache.poi.TestPOIDocumentMain
>
> Results :
>
> Failed tests:
>   TestTempFile.testSetTempFileCreationStrategy
> Expected: an instance of java.lang.IllegalArgumentException
>      but: <org.junit.internal.runners.model.MultipleFailureException:
> There were 2 errors:
>   java.lang.IllegalArgumentException(strategy == null)
>   java.io.IOException(Permission denied)> is a
> org.junit.internal.runners.model.MultipleFailureException
> Stacktrace was: org.junit.internal.runners.model.MultipleFailureException:
> There were 2 errors:
>   java.lang.IllegalArgumentException(strategy == null)
>   java.io.IOException(Permission denied)
>         at
> org.junit.runners.model.MultipleFailureException.assertEmpty(MultipleFailureException.java:67)
>         at
> org.junit.internal.runners.statements.RunAfters.evaluate(RunAfters.java:39)
>         at
> org.junit.rules.ExpectedException$ExpectedExceptionStatement.evaluate(ExpectedException.java:239)
>         at org.junit.rules.RunRules.evaluate(RunRules.java:20)
>         at org.junit.runners.ParentRunner.runLeaf(ParentRunner.java:325)
>         at
> org.junit.runners.BlockJUnit4ClassRunner.runChild(BlockJUnit4ClassRunner.java:78)
>         at
> org.junit.runners.BlockJUnit4ClassRunner.runChild(BlockJUnit4ClassRunner.java:57)
>         at org.junit.runners.ParentRunner$3.run(ParentRunner.java:290)
>         at org.junit.runners.ParentRunner$1.schedule(ParentRunner.java:71)
>         at
> org.junit.runners.ParentRunner.runChildren(ParentRunner.java:288)
>         at org.junit.runners.ParentRunner.access$000(ParentRunner.java:58)
>         at org.junit.runners.ParentRunner$2.evaluate(ParentRunner.java:268)
>         at org.junit.runners.ParentRunner.run(ParentRunner.java:363)
>         at org.junit.runners.Suite.runChild(Suite.java:128)
>         at org.junit.runners.Suite.runChild(Suite.java:27)
>         at org.junit.runners.ParentRunner$3.run(ParentRunner.java:290)
>         at org.junit.runners.ParentRunner$1.schedule(ParentRunner.java:71)
>         at
> org.junit.runners.ParentRunner.runChildren(ParentRunner.java:288)
>         at org.junit.runners.ParentRunner.access$000(ParentRunner.java:58)
>         at org.junit.runners.ParentRunner$2.evaluate(ParentRunner.java:268)
>         at org.junit.runners.ParentRunner.run(ParentRunner.java:363)
>         at
> org.apache.maven.surefire.junitcore.JUnitCore.run(JUnitCore.java:55)
>         at
> org.apache.maven.surefire.junitcore.JUnitCoreWrapper.createRequestAndRun(JUnitCoreWrapper.java:137)
>         at
> org.apache.maven.surefire.junitcore.JUnitCoreWrapper.executeEager(JUnitCoreWrapper.java:107)
>         at
> org.apache.maven.surefire.junitcore.JUnitCoreWrapper.execute(JUnitCoreWrapper.java:83)
>         at
> org.apache.maven.surefire.junitcore.JUnitCoreWrapper.execute(JUnitCoreWrapper.java:75)
>         at
> org.apache.maven.surefire.junitcore.JUnitCoreProvider.invoke(JUnitCoreProvider.java:161)
>         at
> org.apache.maven.surefire.booter.ForkedBooter.invokeProviderInSameClassLoader(ForkedBooter.java:290)
>         at
> org.apache.maven.surefire.booter.ForkedBooter.runSuitesInProcess(ForkedBooter.java:242)
>         at
> org.apache.maven.surefire.booter.ForkedBooter.main(ForkedBooter.java:121)
>
> Tests in error:
>   TestWrite.dictionary:475 » IO Permission denied
>   TestWrite.dictionaryWithInvalidCodepage »  Unexpected exception,
> expected<org....
>   TestWrite.inPlaceNPOIFSWrite:526 » IO Permission denied
>   TestWrite.withoutAFormatID »  Unexpected exception,
> expected<org.apache.poi.hp...
>   TestWriteWellKnown.testWriteWellKnown:170 » IO Permission denied
>   TestCellStyle.testDataStyle:104 » IO Permission denied
>   TestCellStyle.testWriteSheetFont:64 » IO Permission denied
>   TestCellStyle.testWriteSheetStyle:176 » IO Permission denied
>   TestFormulas.test27272_1:927 » IO Permission denied
>   TestFormulas.test27272_2:939 » IO Permission denied
>   TestFormulas.testComplexSheetRefs:914 » IO Permission denied
>   TestFormulas.testRVAoperands:637 » IO Permission denied
>   TestHSSFWorkbook.inPlaceWrite:1270 » IO Permission denied
>   TestHSSFWorkbook.testRewriteFileBug58480:1137 » IO Permission denied
>   TestHSSFWorkbook.testWriteToNewFile:1310 » IO Permission denied
>   TestPOIFSDump.testFailToWrite »  Unexpected exception,
> expected<java.lang.Inde...
>   TestNPOIFSFileSystem.createWriteRead:1005->writeOutFileAndReadBack:103 »
> IO Pe...
>   TestDataSource.testFileWritable:58 » IO Permission denied
>   TestDataSource.testRewritableFile:86 » IO Permission denied
>
> TestDateFormatConverter.testJavaDateFormatsInExcel:120->outputLocaleDataFormats:108
> » IO
>   TestHexDump.testMain:268 » IO Permission denied
>
> org.apache.poi.util.TestTempFile.createTempFileWithDefaultSuffix(org.apache.poi.util.TestTempFile)
>   Run 1: TestTempFile.createTempFileWithDefaultSuffix:109 » IO Permission
> denied
>   Run 2: TestTempFile.tearDown:81 » IO Permission denied
>
>
> org.apache.poi.util.TestTempFile.testCreateTempDirectory(org.apache.poi.util.TestTempFile)
>   Run 1: TestTempFile.testCreateTempDirectory:117 » IO Could not create
> temporary direc...
>   Run 2: TestTempFile.tearDown:81 » IO Permission denied
>
>
> org.apache.poi.util.TestTempFile.testCreateTempFile(org.apache.poi.util.TestTempFile)
>   Run 1: TestTempFile.testCreateTempFile:89 » IO Permission denied
>   Run 2: TestTempFile.tearDown:81 » IO Permission denied
>
>
> Tests run: 6527, Failures: 1, Errors: 24, Skipped: 776
>
> [INFO]
> ------------------------------------------------------------------------
> [INFO] Reactor Summary:
> [INFO]
> [INFO] Apache POI - the Java API for Microsoft Documents . SUCCESS [
> 0.002 s]
> [INFO] Apache POI Main package ........................... FAILURE [01:25
> min]
> [INFO] Apache POI Scratchpad package ..................... SKIPPED
> [INFO] Apache POI - Openxmlformats Schema package ........ SKIPPED
> [INFO] Apache POI - Openxmlformats Encryption Schema package  SKIPPED
> [INFO] Apache POI - Openxmlformats Security-Schema package  SKIPPED
> [INFO] Apache POI OOXML package .......................... SKIPPED
> [INFO] Apache POI ExcelAnt package ....................... SKIPPED
> [INFO] Apache POI Examples package ....................... SKIPPED
> [INFO]
> ------------------------------------------------------------------------
> [INFO] BUILD FAILURE
> [INFO]
> ------------------------------------------------------------------------
> [INFO] Total time: 01:26 min
> [INFO] Finished at: 2017-11-15T20:06:32+00:00
> [INFO] Final Memory: 29M/827M
> [INFO]
> ------------------------------------------------------------------------
> [ERROR] Failed to execute goal
> org.apache.maven.plugins:maven-surefire-plugin:2.19.1:test (default-test)
> on project poi-main: There are test failures.
> [ERROR]
> [ERROR] Please refer to <
> https://builds.apache.org/job/POI-DSL-Maven/ws/sonar/main/target/surefire-reports>
> for the individual test results.
> [ERROR] -> [Help 1]
> [ERROR]
> [ERROR] To see the full stack trace of the errors, re-run Maven with the
> -e switch.
> [ERROR] Re-run Maven using the -X switch to enable full debug logging.
> [ERROR]
> [ERROR] For more information about the errors and possible solutions,
> please read the following articles:
> [ERROR] [Help 1]
> http://cwiki.apache.org/confluence/display/MAVEN/MojoFailureException
> [ERROR]
> [ERROR] After correcting the problems, you can resume the build with the
> command
> [ERROR]   mvn <goals> -rf :poi-main
> Build step 'Invoke top-level Maven targets' marked build as failure
>
> ---------------------------------------------------------------------
> To unsubscribe, e-mail: [hidden email]
> For additional commands, e-mail: [hidden email]
>
>
Reply | Threaded
Open this post in threaded view
|

Build failed in Jenkins: POI-DSL-Maven #403

Apache Jenkins Server
In reply to this post by Apache Jenkins Server
See <https://builds.apache.org/job/POI-DSL-Maven/403/display/redirect>

------------------------------------------
[...truncated 603.89 KB...]
Tests run: 9, Failures: 0, Errors: 0, Skipped: 0, Time elapsed: 0.002 sec - in org.apache.poi.ss.formula.functions.TestMatch
Running org.apache.poi.ss.formula.functions.TestMid
Tests run: 4, Failures: 0, Errors: 0, Skipped: 0, Time elapsed: 0.001 sec - in org.apache.poi.ss.formula.functions.TestMid
Running org.apache.poi.ss.formula.functions.TestMirr
Tests run: 4, Failures: 0, Errors: 0, Skipped: 0, Time elapsed: 0 sec - in org.apache.poi.ss.formula.functions.TestMirr
Running org.apache.poi.ss.formula.functions.TestCountFuncs
Tests run: 16, Failures: 0, Errors: 0, Skipped: 0, Time elapsed: 0.017 sec - in org.apache.poi.ss.formula.functions.TestCountFuncs
Running org.apache.poi.ss.formula.functions.TestIntercept
Tests run: 4, Failures: 0, Errors: 0, Skipped: 0, Time elapsed: 0.002 sec - in org.apache.poi.ss.formula.functions.TestIntercept
Running org.apache.poi.ss.formula.functions.TestSumifs
Tests run: 7, Failures: 0, Errors: 0, Skipped: 0, Time elapsed: 0.002 sec - in org.apache.poi.ss.formula.functions.TestSumifs
Running org.apache.poi.ss.formula.functions.TestWeekNumFunctionsFromSpreadsheet2013
Tests run: 7, Failures: 0, Errors: 0, Skipped: 0, Time elapsed: 0 sec - in org.apache.poi.ss.formula.functions.TestWeekNumFunctionsFromSpreadsheet2013
Running org.apache.poi.ss.formula.functions.TestSubtotal
Tests run: 11, Failures: 0, Errors: 0, Skipped: 0, Time elapsed: 0.004 sec - in org.apache.poi.ss.formula.functions.TestSubtotal
Running org.apache.poi.ss.formula.functions.TestComplex
Tests run: 2, Failures: 0, Errors: 0, Skipped: 0, Time elapsed: 0 sec - in org.apache.poi.ss.formula.functions.TestComplex
Running org.apache.poi.ss.formula.functions.TestAddress
Tests run: 1, Failures: 0, Errors: 0, Skipped: 0, Time elapsed: 0 sec - in org.apache.poi.ss.formula.functions.TestAddress
Running org.apache.poi.ss.formula.functions.TestBin2Dec
Tests run: 5, Failures: 0, Errors: 0, Skipped: 0, Time elapsed: 0.001 sec - in org.apache.poi.ss.formula.functions.TestBin2Dec
Running org.apache.poi.ss.formula.functions.TestSumif
Tests run: 3, Failures: 0, Errors: 0, Skipped: 0, Time elapsed: 0 sec - in org.apache.poi.ss.formula.functions.TestSumif
Running org.apache.poi.ss.formula.functions.TestText
Tests run: 4, Failures: 0, Errors: 0, Skipped: 0, Time elapsed: 0.001 sec - in org.apache.poi.ss.formula.functions.TestText
Running org.apache.poi.ss.formula.functions.TestValue
Tests run: 2, Failures: 0, Errors: 0, Skipped: 0, Time elapsed: 0 sec - in org.apache.poi.ss.formula.functions.TestValue
Running org.apache.poi.ss.formula.functions.TestStatsLib
Tests run: 9, Failures: 0, Errors: 0, Skipped: 0, Time elapsed: 0.001 sec - in org.apache.poi.ss.formula.functions.TestStatsLib
Running org.apache.poi.ss.formula.functions.TestIndexFunctionFromSpreadsheet
Tests run: 98, Failures: 0, Errors: 0, Skipped: 0, Time elapsed: 0.008 sec - in org.apache.poi.ss.formula.functions.TestIndexFunctionFromSpreadsheet
Running org.apache.poi.ss.formula.functions.TestLen
Tests run: 3, Failures: 0, Errors: 0, Skipped: 0, Time elapsed: 0 sec - in org.apache.poi.ss.formula.functions.TestLen
Running org.apache.poi.ss.formula.functions.TestDec2Hex
Tests run: 12, Failures: 0, Errors: 0, Skipped: 0, Time elapsed: 0.017 sec - in org.apache.poi.ss.formula.functions.TestDec2Hex
Running org.apache.poi.ss.formula.functions.TestNpv
Tests run: 2, Failures: 0, Errors: 0, Skipped: 0, Time elapsed: 0.001 sec - in org.apache.poi.ss.formula.functions.TestNpv
Running org.apache.poi.ss.formula.functions.TestOct2Dec
Tests run: 2, Failures: 0, Errors: 0, Skipped: 0, Time elapsed: 0 sec - in org.apache.poi.ss.formula.functions.TestOct2Dec
Running org.apache.poi.ss.formula.functions.TestAverage
Tests run: 3, Failures: 0, Errors: 0, Skipped: 0, Time elapsed: 0 sec - in org.apache.poi.ss.formula.functions.TestAverage
Running org.apache.poi.ss.formula.functions.TestDStarFunctionsFromSpreadsheet
Tests run: 4, Failures: 0, Errors: 0, Skipped: 0, Time elapsed: 0.001 sec - in org.apache.poi.ss.formula.functions.TestDStarFunctionsFromSpreadsheet
Running org.apache.poi.ss.formula.functions.TestPPMT
Tests run: 1, Failures: 0, Errors: 0, Skipped: 0, Time elapsed: 0 sec - in org.apache.poi.ss.formula.functions.TestPPMT
Running org.apache.poi.ss.formula.functions.TestDelta
Tests run: 2, Failures: 0, Errors: 0, Skipped: 0, Time elapsed: 0 sec - in org.apache.poi.ss.formula.functions.TestDelta
Running org.apache.poi.ss.formula.functions.TestIndex
Tests run: 3, Failures: 0, Errors: 0, Skipped: 0, Time elapsed: 0 sec - in org.apache.poi.ss.formula.functions.TestIndex
Running org.apache.poi.ss.formula.functions.TestMultiOperandNumericFunction
Tests run: 1, Failures: 0, Errors: 0, Skipped: 0, Time elapsed: 0 sec - in org.apache.poi.ss.formula.functions.TestMultiOperandNumericFunction
Running org.apache.poi.ss.formula.functions.TestImaginaryFunctionsFromSpreadsheet
Tests run: 7, Failures: 0, Errors: 0, Skipped: 0, Time elapsed: 0.005 sec - in org.apache.poi.ss.formula.functions.TestImaginaryFunctionsFromSpreadsheet
Running org.apache.poi.ss.formula.functions.TestWeekNumFunctionsFromSpreadsheet
Tests run: 7, Failures: 0, Errors: 0, Skipped: 0, Time elapsed: 0.001 sec - in org.apache.poi.ss.formula.functions.TestWeekNumFunctionsFromSpreadsheet
Running org.apache.poi.ss.formula.functions.TestCodeFunctionsFromSpreadsheet
Tests run: 4, Failures: 0, Errors: 0, Skipped: 0, Time elapsed: 0.001 sec - in org.apache.poi.ss.formula.functions.TestCodeFunctionsFromSpreadsheet
Running org.apache.poi.ss.formula.functions.TestFixed
Tests run: 2, Failures: 0, Errors: 0, Skipped: 0, Time elapsed: 0.006 sec - in org.apache.poi.ss.formula.functions.TestFixed
Running org.apache.poi.ss.formula.functions.TestCalendarFieldFunction
Tests run: 4, Failures: 0, Errors: 0, Skipped: 0, Time elapsed: 0.004 sec - in org.apache.poi.ss.formula.functions.TestCalendarFieldFunction
Running org.apache.poi.ss.formula.functions.TestIrr
Tests run: 3, Failures: 0, Errors: 0, Skipped: 0, Time elapsed: 0.002 sec - in org.apache.poi.ss.formula.functions.TestIrr
Running org.apache.poi.ss.formula.functions.TestTrim
Tests run: 3, Failures: 0, Errors: 0, Skipped: 0, Time elapsed: 0 sec - in org.apache.poi.ss.formula.functions.TestTrim
Running org.apache.poi.ss.formula.functions.TestTFunc
Tests run: 5, Failures: 0, Errors: 0, Skipped: 0, Time elapsed: 0.001 sec - in org.apache.poi.ss.formula.functions.TestTFunc
Running org.apache.poi.ss.formula.functions.TestImRealFunctionsFromSpreadsheet
Tests run: 7, Failures: 0, Errors: 0, Skipped: 0, Time elapsed: 0.002 sec - in org.apache.poi.ss.formula.functions.TestImRealFunctionsFromSpreadsheet
Running org.apache.poi.ss.formula.functions.TestDate
Tests run: 3, Failures: 0, Errors: 0, Skipped: 0, Time elapsed: 0.002 sec - in org.apache.poi.ss.formula.functions.TestDate
Running org.apache.poi.ss.formula.functions.TestWeekdayFunc
Tests run: 2, Failures: 0, Errors: 0, Skipped: 0, Time elapsed: 0.001 sec - in org.apache.poi.ss.formula.functions.TestWeekdayFunc
Running org.apache.poi.ss.util.TestCellRangeAddress
Tests run: 14, Failures: 0, Errors: 0, Skipped: 0, Time elapsed: 0.003 sec - in org.apache.poi.ss.util.TestCellRangeAddress
Running org.apache.poi.ss.util.TestDateFormatConverter
Tests run: 2, Failures: 0, Errors: 1, Skipped: 0, Time elapsed: 0.193 sec <<< FAILURE! - in org.apache.poi.ss.util.TestDateFormatConverter
testJavaDateFormatsInExcel(org.apache.poi.ss.util.TestDateFormatConverter)  Time elapsed: 0.193 sec  <<< ERROR!
java.io.IOException: Permission denied
        at org.apache.poi.ss.util.TestDateFormatConverter.outputLocaleDataFormats(TestDateFormatConverter.java:108)
        at org.apache.poi.ss.util.TestDateFormatConverter.testJavaDateFormatsInExcel(TestDateFormatConverter.java:120)

Running org.apache.poi.ss.util.TestPropertyTemplate
Tests run: 8, Failures: 0, Errors: 0, Skipped: 0, Time elapsed: 0.012 sec - in org.apache.poi.ss.util.TestPropertyTemplate
Running org.apache.poi.ss.util.TestNumberComparer
Tests run: 4, Failures: 0, Errors: 0, Skipped: 0, Time elapsed: 0.029 sec - in org.apache.poi.ss.util.TestNumberComparer
Running org.apache.poi.ss.util.TestSheetUtil
Tests run: 7, Failures: 0, Errors: 0, Skipped: 0, Time elapsed: 0.002 sec - in org.apache.poi.ss.util.TestSheetUtil
Running org.apache.poi.ss.util.TestCellRangeUtil
Tests run: 1, Failures: 0, Errors: 0, Skipped: 0, Time elapsed: 0.004 sec - in org.apache.poi.ss.util.TestCellRangeUtil
Running org.apache.poi.ss.util.TestCellReference
Tests run: 25, Failures: 0, Errors: 0, Skipped: 0, Time elapsed: 0.001 sec - in org.apache.poi.ss.util.TestCellReference
Running org.apache.poi.ss.util.TestAreaReference
Tests run: 2, Failures: 0, Errors: 0, Skipped: 0, Time elapsed: 0 sec - in org.apache.poi.ss.util.TestAreaReference
Running org.apache.poi.ss.util.TestExpandedDouble
Tests run: 3, Failures: 0, Errors: 0, Skipped: 0, Time elapsed: 0 sec - in org.apache.poi.ss.util.TestExpandedDouble
Running org.apache.poi.ss.util.TestHSSFCellUtil
Tests run: 13, Failures: 0, Errors: 0, Skipped: 0, Time elapsed: 0.003 sec - in org.apache.poi.ss.util.TestHSSFCellUtil
Running org.apache.poi.ss.util.TestSheetBuilder
Tests run: 3, Failures: 0, Errors: 0, Skipped: 0, Time elapsed: 0.002 sec - in org.apache.poi.ss.util.TestSheetBuilder
Running org.apache.poi.ss.util.TestNumberToTextConverter
Tests run: 2, Failures: 0, Errors: 0, Skipped: 0, Time elapsed: 0.003 sec - in org.apache.poi.ss.util.TestNumberToTextConverter
Running org.apache.poi.ss.util.TestRegionUtil
Tests run: 10, Failures: 0, Errors: 0, Skipped: 0, Time elapsed: 0.005 sec - in org.apache.poi.ss.util.TestRegionUtil
Running org.apache.poi.ss.util.TestCellAddress
Tests run: 6, Failures: 0, Errors: 0, Skipped: 0, Time elapsed: 0 sec - in org.apache.poi.ss.util.TestCellAddress
Running org.apache.poi.ss.util.TestWorkbookUtil
Tests run: 1, Failures: 0, Errors: 0, Skipped: 0, Time elapsed: 0 sec - in org.apache.poi.ss.util.TestWorkbookUtil
Running org.apache.poi.ss.util.cellwalk.TestCellWalk
Tests run: 1, Failures: 0, Errors: 0, Skipped: 0, Time elapsed: 0 sec - in org.apache.poi.ss.util.cellwalk.TestCellWalk
Running org.apache.poi.ss.format.TestCellFormat
Nov 15, 2017 8:38:59 PM org.apache.poi.ss.format.CellFormatPart getColor
WARNING: Unknown color: "Red"
Tests run: 40, Failures: 0, Errors: 0, Skipped: 0, Time elapsed: 0.049 sec - in org.apache.poi.ss.format.TestCellFormat
Running org.apache.poi.ss.format.TestCellFormatCondition
Tests run: 1, Failures: 0, Errors: 0, Skipped: 0, Time elapsed: 0 sec - in org.apache.poi.ss.format.TestCellFormatCondition
Running org.apache.poi.ss.format.TestCellFormatResult
Tests run: 1, Failures: 0, Errors: 0, Skipped: 0, Time elapsed: 0 sec - in org.apache.poi.ss.format.TestCellFormatResult
Running org.apache.poi.ss.TestSpreadsheetVersion
Tests run: 2, Failures: 0, Errors: 0, Skipped: 0, Time elapsed: 0 sec - in org.apache.poi.ss.TestSpreadsheetVersion
Running org.apache.poi.ss.usermodel.TestDateUtil
Tests run: 5, Failures: 0, Errors: 0, Skipped: 0, Time elapsed: 0 sec - in org.apache.poi.ss.usermodel.TestDateUtil
Running org.apache.poi.ss.usermodel.TestIndexedColors
Tests run: 3, Failures: 0, Errors: 0, Skipped: 0, Time elapsed: 0 sec - in org.apache.poi.ss.usermodel.TestIndexedColors
Running org.apache.poi.ss.usermodel.TestFractionFormat
Tests run: 2, Failures: 0, Errors: 0, Skipped: 0, Time elapsed: 0.049 sec - in org.apache.poi.ss.usermodel.TestFractionFormat
Running org.apache.poi.ss.usermodel.TestExcelStyleDateFormatter
Tests run: 4, Failures: 0, Errors: 0, Skipped: 0, Time elapsed: 0.009 sec - in org.apache.poi.ss.usermodel.TestExcelStyleDateFormatter
Running org.apache.poi.ss.usermodel.TestHSSFBorderStyle
Tests run: 1, Failures: 0, Errors: 0, Skipped: 0, Time elapsed: 0.001 sec - in org.apache.poi.ss.usermodel.TestHSSFBorderStyle
Running org.apache.poi.ss.usermodel.charts.TestDataSources
Tests run: 6, Failures: 0, Errors: 0, Skipped: 0, Time elapsed: 0.005 sec - in org.apache.poi.ss.usermodel.charts.TestDataSources
Running org.apache.poi.ss.usermodel.TestDataFormatter
Tests run: 33, Failures: 0, Errors: 0, Skipped: 1, Time elapsed: 0.034 sec - in org.apache.poi.ss.usermodel.TestDataFormatter
Running org.apache.poi.TestPOIDocumentMain
Tests run: 6, Failures: 0, Errors: 0, Skipped: 0, Time elapsed: 0.006 sec - in org.apache.poi.TestPOIDocumentMain

Results :

Failed tests:
  TestTempFile.testSetTempFileCreationStrategy
Expected: an instance of java.lang.IllegalArgumentException
     but: <org.junit.internal.runners.model.MultipleFailureException: There were 2 errors:
  java.lang.IllegalArgumentException(strategy == null)
  java.io.IOException(Permission denied)> is a org.junit.internal.runners.model.MultipleFailureException
Stacktrace was: org.junit.internal.runners.model.MultipleFailureException: There were 2 errors:
  java.lang.IllegalArgumentException(strategy == null)
  java.io.IOException(Permission denied)
        at org.junit.runners.model.MultipleFailureException.assertEmpty(MultipleFailureException.java:67)
        at org.junit.internal.runners.statements.RunAfters.evaluate(RunAfters.java:39)
        at org.junit.rules.ExpectedException$ExpectedExceptionStatement.evaluate(ExpectedException.java:239)
        at org.junit.rules.RunRules.evaluate(RunRules.java:20)
        at org.junit.runners.ParentRunner.runLeaf(ParentRunner.java:325)
        at org.junit.runners.BlockJUnit4ClassRunner.runChild(BlockJUnit4ClassRunner.java:78)
        at org.junit.runners.BlockJUnit4ClassRunner.runChild(BlockJUnit4ClassRunner.java:57)
        at org.junit.runners.ParentRunner$3.run(ParentRunner.java:290)
        at org.junit.runners.ParentRunner$1.schedule(ParentRunner.java:71)
        at org.junit.runners.ParentRunner.runChildren(ParentRunner.java:288)
        at org.junit.runners.ParentRunner.access$000(ParentRunner.java:58)
        at org.junit.runners.ParentRunner$2.evaluate(ParentRunner.java:268)
        at org.junit.runners.ParentRunner.run(ParentRunner.java:363)
        at org.junit.runners.Suite.runChild(Suite.java:128)
        at org.junit.runners.Suite.runChild(Suite.java:27)
        at org.junit.runners.ParentRunner$3.run(ParentRunner.java:290)
        at org.junit.runners.ParentRunner$1.schedule(ParentRunner.java:71)
        at org.junit.runners.ParentRunner.runChildren(ParentRunner.java:288)
        at org.junit.runners.ParentRunner.access$000(ParentRunner.java:58)
        at org.junit.runners.ParentRunner$2.evaluate(ParentRunner.java:268)
        at org.junit.runners.ParentRunner.run(ParentRunner.java:363)
        at org.apache.maven.surefire.junitcore.JUnitCore.run(JUnitCore.java:55)
        at org.apache.maven.surefire.junitcore.JUnitCoreWrapper.createRequestAndRun(JUnitCoreWrapper.java:137)
        at org.apache.maven.surefire.junitcore.JUnitCoreWrapper.executeEager(JUnitCoreWrapper.java:107)
        at org.apache.maven.surefire.junitcore.JUnitCoreWrapper.execute(JUnitCoreWrapper.java:83)
        at org.apache.maven.surefire.junitcore.JUnitCoreWrapper.execute(JUnitCoreWrapper.java:75)
        at org.apache.maven.surefire.junitcore.JUnitCoreProvider.invoke(JUnitCoreProvider.java:161)
        at org.apache.maven.surefire.booter.ForkedBooter.invokeProviderInSameClassLoader(ForkedBooter.java:290)
        at org.apache.maven.surefire.booter.ForkedBooter.runSuitesInProcess(ForkedBooter.java:242)
        at org.apache.maven.surefire.booter.ForkedBooter.main(ForkedBooter.java:121)

Tests in error:
  TestWrite.dictionary:475 » IO Permission denied
  TestWrite.dictionaryWithInvalidCodepage »  Unexpected exception, expected<org....
  TestWrite.inPlaceNPOIFSWrite:526 » IO Permission denied
  TestWrite.withoutAFormatID »  Unexpected exception, expected<org.apache.poi.hp...
  TestWriteWellKnown.testWriteWellKnown:170 » IO Permission denied
  TestCellStyle.testDataStyle:104 » IO Permission denied
  TestCellStyle.testWriteSheetFont:64 » IO Permission denied
  TestCellStyle.testWriteSheetStyle:176 » IO Permission denied
  TestFormulas.test27272_1:927 » IO Permission denied
  TestFormulas.test27272_2:939 » IO Permission denied
  TestFormulas.testComplexSheetRefs:914 » IO Permission denied
  TestFormulas.testRVAoperands:637 » IO Permission denied
  TestHSSFWorkbook.inPlaceWrite:1270 » IO Permission denied
  TestHSSFWorkbook.testRewriteFileBug58480:1137 » IO Permission denied
  TestHSSFWorkbook.testWriteToNewFile:1310 » IO Permission denied
  TestPOIFSDump.testFailToWrite »  Unexpected exception, expected<java.lang.Inde...
  TestNPOIFSFileSystem.createWriteRead:1005->writeOutFileAndReadBack:103 » IO Pe...
  TestDataSource.testFileWritable:58 » IO Permission denied
  TestDataSource.testRewritableFile:86 » IO Permission denied
  TestDateFormatConverter.testJavaDateFormatsInExcel:120->outputLocaleDataFormats:108 » IO
  TestHexDump.testMain:268 » IO Permission denied
org.apache.poi.util.TestTempFile.createTempFileWithDefaultSuffix(org.apache.poi.util.TestTempFile)
  Run 1: TestTempFile.createTempFileWithDefaultSuffix:109 » IO Permission denied
  Run 2: TestTempFile.tearDown:81 » IO Permission denied

org.apache.poi.util.TestTempFile.testCreateTempDirectory(org.apache.poi.util.TestTempFile)
  Run 1: TestTempFile.testCreateTempDirectory:117 » IO Could not create temporary direc...
  Run 2: TestTempFile.tearDown:81 » IO Permission denied

org.apache.poi.util.TestTempFile.testCreateTempFile(org.apache.poi.util.TestTempFile)
  Run 1: TestTempFile.testCreateTempFile:89 » IO Permission denied
  Run 2: TestTempFile.tearDown:81 » IO Permission denied


Tests run: 6527, Failures: 1, Errors: 24, Skipped: 776

[INFO] ------------------------------------------------------------------------
[INFO] Reactor Summary:
[INFO]
[INFO] Apache POI - the Java API for Microsoft Documents . SUCCESS [  0.002 s]
[INFO] Apache POI Main package ........................... FAILURE [01:14 min]
[INFO] Apache POI Scratchpad package ..................... SKIPPED
[INFO] Apache POI - Openxmlformats Schema package ........ SKIPPED
[INFO] Apache POI - Openxmlformats Encryption Schema package  SKIPPED
[INFO] Apache POI - Openxmlformats Security-Schema package  SKIPPED
[INFO] Apache POI OOXML package .......................... SKIPPED
[INFO] Apache POI ExcelAnt package ....................... SKIPPED
[INFO] Apache POI Examples package ....................... SKIPPED
[INFO] ------------------------------------------------------------------------
[INFO] BUILD FAILURE
[INFO] ------------------------------------------------------------------------
[INFO] Total time: 01:15 min
[INFO] Finished at: 2017-11-15T20:38:59+00:00
[INFO] Final Memory: 31M/785M
[INFO] ------------------------------------------------------------------------
[ERROR] Failed to execute goal org.apache.maven.plugins:maven-surefire-plugin:2.19.1:test (default-test) on project poi-main: There are test failures.
[ERROR]
[ERROR] Please refer to <https://builds.apache.org/job/POI-DSL-Maven/ws/sonar/main/target/surefire-reports> for the individual test results.
[ERROR] -> [Help 1]
[ERROR]
[ERROR] To see the full stack trace of the errors, re-run Maven with the -e switch.
[ERROR] Re-run Maven using the -X switch to enable full debug logging.
[ERROR]
[ERROR] For more information about the errors and possible solutions, please read the following articles:
[ERROR] [Help 1] http://cwiki.apache.org/confluence/display/MAVEN/MojoFailureException
[ERROR]
[ERROR] After correcting the problems, you can resume the build with the command
[ERROR]   mvn <goals> -rf :poi-main
Build step 'Invoke top-level Maven targets' marked build as failure

---------------------------------------------------------------------
To unsubscribe, e-mail: [hidden email]
For additional commands, e-mail: [hidden email]

Reply | Threaded
Open this post in threaded view
|

Jenkins build is back to normal : POI-DSL-Maven #404

Apache Jenkins Server
See <https://builds.apache.org/job/POI-DSL-Maven/404/display/redirect?page=changes>


---------------------------------------------------------------------
To unsubscribe, e-mail: [hidden email]
For additional commands, e-mail: [hidden email]

Reply | Threaded
Open this post in threaded view
|

Re: Build failed in Jenkins: POI-DSL-Maven #402

Dominik Stadler
In reply to this post by Greg Woolsey
Yes, looked very strange, I cleaned out the workspace to try if that helps,
the following build still failed, but the latest one did succeed, not sure
if the cleanup fixed it or it was just luck now and will appear again.

Dominik.

On Wed, Nov 15, 2017 at 9:32 PM, Greg Woolsey <[hidden email]>
wrote:

> Anyone know what's up with the "permission denied" errors?
>
> On Wed, Nov 15, 2017 at 12:06 PM Apache Jenkins Server <
> [hidden email]> wrote:
>
> > See <
> > https://builds.apache.org/job/POI-DSL-Maven/402/display/
> redirect?page=changes
> > >
> >
> > Changes:
> >
> > [gwoolsey] ignore a unit test that snuck in.  It was created to
> > investigate an open bug report.  It fails, as expected, which broke the
> > build.
> >
> > ------------------------------------------
> > [...truncated 99.25 KB...]
> > Tests run: 9, Failures: 0, Errors: 0, Skipped: 0, Time elapsed: 0.001 sec
> > - in org.apache.poi.ss.formula.functions.TestMatch
> > Running org.apache.poi.ss.formula.functions.TestMid
> > Tests run: 4, Failures: 0, Errors: 0, Skipped: 0, Time elapsed: 0 sec -
> in
> > org.apache.poi.ss.formula.functions.TestMid
> > Running org.apache.poi.ss.formula.functions.TestMirr
> > Tests run: 4, Failures: 0, Errors: 0, Skipped: 0, Time elapsed: 0.001 sec
> > - in org.apache.poi.ss.formula.functions.TestMirr
> > Running org.apache.poi.ss.formula.functions.TestCountFuncs
> > Tests run: 16, Failures: 0, Errors: 0, Skipped: 0, Time elapsed: 0.008
> sec
> > - in org.apache.poi.ss.formula.functions.TestCountFuncs
> > Running org.apache.poi.ss.formula.functions.TestIntercept
> > Tests run: 4, Failures: 0, Errors: 0, Skipped: 0, Time elapsed: 0 sec -
> in
> > org.apache.poi.ss.formula.functions.TestIntercept
> > Running org.apache.poi.ss.formula.functions.TestSumifs
> > Tests run: 7, Failures: 0, Errors: 0, Skipped: 0, Time elapsed: 0 sec -
> in
> > org.apache.poi.ss.formula.functions.TestSumifs
> > Running
> > org.apache.poi.ss.formula.functions.TestWeekNumFunctionsFromSpread
> sheet2013
> > Tests run: 7, Failures: 0, Errors: 0, Skipped: 0, Time elapsed: 0 sec -
> in
> > org.apache.poi.ss.formula.functions.TestWeekNumFunctionsFromSpread
> sheet2013
> > Running org.apache.poi.ss.formula.functions.TestSubtotal
> > Tests run: 11, Failures: 0, Errors: 0, Skipped: 0, Time elapsed: 0.003
> sec
> > - in org.apache.poi.ss.formula.functions.TestSubtotal
> > Running org.apache.poi.ss.formula.functions.TestComplex
> > Tests run: 2, Failures: 0, Errors: 0, Skipped: 0, Time elapsed: 0 sec -
> in
> > org.apache.poi.ss.formula.functions.TestComplex
> > Running org.apache.poi.ss.formula.functions.TestAddress
> > Tests run: 1, Failures: 0, Errors: 0, Skipped: 0, Time elapsed: 0 sec -
> in
> > org.apache.poi.ss.formula.functions.TestAddress
> > Running org.apache.poi.ss.formula.functions.TestBin2Dec
> > Tests run: 5, Failures: 0, Errors: 0, Skipped: 0, Time elapsed: 0 sec -
> in
> > org.apache.poi.ss.formula.functions.TestBin2Dec
> > Running org.apache.poi.ss.formula.functions.TestSumif
> > Tests run: 3, Failures: 0, Errors: 0, Skipped: 0, Time elapsed: 0 sec -
> in
> > org.apache.poi.ss.formula.functions.TestSumif
> > Running org.apache.poi.ss.formula.functions.TestText
> > Tests run: 4, Failures: 0, Errors: 0, Skipped: 0, Time elapsed: 0.002 sec
> > - in org.apache.poi.ss.formula.functions.TestText
> > Running org.apache.poi.ss.formula.functions.TestValue
> > Tests run: 2, Failures: 0, Errors: 0, Skipped: 0, Time elapsed: 0 sec -
> in
> > org.apache.poi.ss.formula.functions.TestValue
> > Running org.apache.poi.ss.formula.functions.TestStatsLib
> > Tests run: 9, Failures: 0, Errors: 0, Skipped: 0, Time elapsed: 0 sec -
> in
> > org.apache.poi.ss.formula.functions.TestStatsLib
> > Running
> > org.apache.poi.ss.formula.functions.TestIndexFunctionFromSpreadsheet
> > Tests run: 98, Failures: 0, Errors: 0, Skipped: 0, Time elapsed: 0.009
> sec
> > - in org.apache.poi.ss.formula.functions.TestIndexFunctionFromSpreadshe
> et
> > Running org.apache.poi.ss.formula.functions.TestLen
> > Tests run: 3, Failures: 0, Errors: 0, Skipped: 0, Time elapsed: 0 sec -
> in
> > org.apache.poi.ss.formula.functions.TestLen
> > Running org.apache.poi.ss.formula.functions.TestDec2Hex
> > Tests run: 12, Failures: 0, Errors: 0, Skipped: 0, Time elapsed: 0.015
> sec
> > - in org.apache.poi.ss.formula.functions.TestDec2Hex
> > Running org.apache.poi.ss.formula.functions.TestNpv
> > Tests run: 2, Failures: 0, Errors: 0, Skipped: 0, Time elapsed: 0.001 sec
> > - in org.apache.poi.ss.formula.functions.TestNpv
> > Running org.apache.poi.ss.formula.functions.TestOct2Dec
> > Tests run: 2, Failures: 0, Errors: 0, Skipped: 0, Time elapsed: 0 sec -
> in
> > org.apache.poi.ss.formula.functions.TestOct2Dec
> > Running org.apache.poi.ss.formula.functions.TestAverage
> > Tests run: 3, Failures: 0, Errors: 0, Skipped: 0, Time elapsed: 0 sec -
> in
> > org.apache.poi.ss.formula.functions.TestAverage
> > Running
> > org.apache.poi.ss.formula.functions.TestDStarFunctionsFromSpreadsheet
> > Tests run: 4, Failures: 0, Errors: 0, Skipped: 0, Time elapsed: 0 sec -
> in
> > org.apache.poi.ss.formula.functions.TestDStarFunctionsFromSpreadsheet
> > Running org.apache.poi.ss.formula.functions.TestPPMT
> > Tests run: 1, Failures: 0, Errors: 0, Skipped: 0, Time elapsed: 0.001 sec
> > - in org.apache.poi.ss.formula.functions.TestPPMT
> > Running org.apache.poi.ss.formula.functions.TestDelta
> > Tests run: 2, Failures: 0, Errors: 0, Skipped: 0, Time elapsed: 0 sec -
> in
> > org.apache.poi.ss.formula.functions.TestDelta
> > Running org.apache.poi.ss.formula.functions.TestIndex
> > Tests run: 3, Failures: 0, Errors: 0, Skipped: 0, Time elapsed: 0 sec -
> in
> > org.apache.poi.ss.formula.functions.TestIndex
> > Running org.apache.poi.ss.formula.functions.
> TestMultiOperandNumericFunction
> > Tests run: 1, Failures: 0, Errors: 0, Skipped: 0, Time elapsed: 0 sec -
> in
> > org.apache.poi.ss.formula.functions.TestMultiOperandNumericFunction
> > Running
> > org.apache.poi.ss.formula.functions.TestImaginaryFunctionsFromSpre
> adsheet
> > Tests run: 7, Failures: 0, Errors: 0, Skipped: 0, Time elapsed: 0 sec -
> in
> > org.apache.poi.ss.formula.functions.TestImaginaryFunctionsFromSpre
> adsheet
> > Running
> > org.apache.poi.ss.formula.functions.TestWeekNumFunctionsFromSpreadsheet
> > Tests run: 7, Failures: 0, Errors: 0, Skipped: 0, Time elapsed: 0 sec -
> in
> > org.apache.poi.ss.formula.functions.TestWeekNumFunctionsFromSpreadsheet
> > Running
> > org.apache.poi.ss.formula.functions.TestCodeFunctionsFromSpreadsheet
> > Tests run: 4, Failures: 0, Errors: 0, Skipped: 0, Time elapsed: 0 sec -
> in
> > org.apache.poi.ss.formula.functions.TestCodeFunctionsFromSpreadsheet
> > Running org.apache.poi.ss.formula.functions.TestFixed
> > Tests run: 2, Failures: 0, Errors: 0, Skipped: 0, Time elapsed: 0.001 sec
> > - in org.apache.poi.ss.formula.functions.TestFixed
> > Running org.apache.poi.ss.formula.functions.TestCalendarFieldFunction
> > Tests run: 4, Failures: 0, Errors: 0, Skipped: 0, Time elapsed: 0.001 sec
> > - in org.apache.poi.ss.formula.functions.TestCalendarFieldFunction
> > Running org.apache.poi.ss.formula.functions.TestIrr
> > Tests run: 3, Failures: 0, Errors: 0, Skipped: 0, Time elapsed: 0.001 sec
> > - in org.apache.poi.ss.formula.functions.TestIrr
> > Running org.apache.poi.ss.formula.functions.TestTrim
> > Tests run: 3, Failures: 0, Errors: 0, Skipped: 0, Time elapsed: 0 sec -
> in
> > org.apache.poi.ss.formula.functions.TestTrim
> > Running org.apache.poi.ss.formula.functions.TestTFunc
> > Tests run: 5, Failures: 0, Errors: 0, Skipped: 0, Time elapsed: 0 sec -
> in
> > org.apache.poi.ss.formula.functions.TestTFunc
> > Running
> > org.apache.poi.ss.formula.functions.TestImRealFunctionsFromSpreadsheet
> > Tests run: 7, Failures: 0, Errors: 0, Skipped: 0, Time elapsed: 0.001 sec
> > - in org.apache.poi.ss.formula.functions.TestImRealFunctionsFromSpreads
> heet
> > Running org.apache.poi.ss.formula.functions.TestDate
> > Tests run: 3, Failures: 0, Errors: 0, Skipped: 0, Time elapsed: 0.001 sec
> > - in org.apache.poi.ss.formula.functions.TestDate
> > Running org.apache.poi.ss.formula.functions.TestWeekdayFunc
> > Tests run: 2, Failures: 0, Errors: 0, Skipped: 0, Time elapsed: 0.001 sec
> > - in org.apache.poi.ss.formula.functions.TestWeekdayFunc
> > Running org.apache.poi.ss.util.TestCellRangeAddress
> > Tests run: 14, Failures: 0, Errors: 0, Skipped: 0, Time elapsed: 0.004
> sec
> > - in org.apache.poi.ss.util.TestCellRangeAddress
> > Running org.apache.poi.ss.util.TestDateFormatConverter
> > Tests run: 2, Failures: 0, Errors: 1, Skipped: 0, Time elapsed: 0.327 sec
> > <<< FAILURE! - in org.apache.poi.ss.util.TestDateFormatConverter
> > testJavaDateFormatsInExcel(org.apache.poi.ss.util.
> TestDateFormatConverter)
> > Time elapsed: 0.327 sec  <<< ERROR!
> > java.io.IOException: Permission denied
> >         at
> > org.apache.poi.ss.util.TestDateFormatConverter.outputLocaleDataFormats(
> TestDateFormatConverter.java:108)
> >         at
> > org.apache.poi.ss.util.TestDateFormatConverter.
> testJavaDateFormatsInExcel(TestDateFormatConverter.java:120)
> >
> > Running org.apache.poi.ss.util.TestPropertyTemplate
> > Tests run: 8, Failures: 0, Errors: 0, Skipped: 0, Time elapsed: 0.012 sec
> > - in org.apache.poi.ss.util.TestPropertyTemplate
> > Running org.apache.poi.ss.util.TestNumberComparer
> > Tests run: 4, Failures: 0, Errors: 0, Skipped: 0, Time elapsed: 0.022 sec
> > - in org.apache.poi.ss.util.TestNumberComparer
> > Running org.apache.poi.ss.util.TestSheetUtil
> > Tests run: 7, Failures: 0, Errors: 0, Skipped: 0, Time elapsed: 0.002 sec
> > - in org.apache.poi.ss.util.TestSheetUtil
> > Running org.apache.poi.ss.util.TestCellRangeUtil
> > Tests run: 1, Failures: 0, Errors: 0, Skipped: 0, Time elapsed: 0.014 sec
> > - in org.apache.poi.ss.util.TestCellRangeUtil
> > Running org.apache.poi.ss.util.TestCellReference
> > Tests run: 25, Failures: 0, Errors: 0, Skipped: 0, Time elapsed: 0.002
> sec
> > - in org.apache.poi.ss.util.TestCellReference
> > Running org.apache.poi.ss.util.TestAreaReference
> > Tests run: 2, Failures: 0, Errors: 0, Skipped: 0, Time elapsed: 0 sec -
> in
> > org.apache.poi.ss.util.TestAreaReference
> > Running org.apache.poi.ss.util.TestExpandedDouble
> > Tests run: 3, Failures: 0, Errors: 0, Skipped: 0, Time elapsed: 0 sec -
> in
> > org.apache.poi.ss.util.TestExpandedDouble
> > Running org.apache.poi.ss.util.TestHSSFCellUtil
> > Tests run: 13, Failures: 0, Errors: 0, Skipped: 0, Time elapsed: 0.002
> sec
> > - in org.apache.poi.ss.util.TestHSSFCellUtil
> > Running org.apache.poi.ss.util.TestSheetBuilder
> > Tests run: 3, Failures: 0, Errors: 0, Skipped: 0, Time elapsed: 0.001 sec
> > - in org.apache.poi.ss.util.TestSheetBuilder
> > Running org.apache.poi.ss.util.TestNumberToTextConverter
> > Tests run: 2, Failures: 0, Errors: 0, Skipped: 0, Time elapsed: 0.003 sec
> > - in org.apache.poi.ss.util.TestNumberToTextConverter
> > Running org.apache.poi.ss.util.TestRegionUtil
> > Tests run: 10, Failures: 0, Errors: 0, Skipped: 0, Time elapsed: 0.005
> sec
> > - in org.apache.poi.ss.util.TestRegionUtil
> > Running org.apache.poi.ss.util.TestCellAddress
> > Tests run: 6, Failures: 0, Errors: 0, Skipped: 0, Time elapsed: 0.002 sec
> > - in org.apache.poi.ss.util.TestCellAddress
> > Running org.apache.poi.ss.util.TestWorkbookUtil
> > Tests run: 1, Failures: 0, Errors: 0, Skipped: 0, Time elapsed: 0 sec -
> in
> > org.apache.poi.ss.util.TestWorkbookUtil
> > Running org.apache.poi.ss.util.cellwalk.TestCellWalk
> > Tests run: 1, Failures: 0, Errors: 0, Skipped: 0, Time elapsed: 0.004 sec
> > - in org.apache.poi.ss.util.cellwalk.TestCellWalk
> > Running org.apache.poi.ss.format.TestCellFormat
> > Nov 15, 2017 8:06:31 PM org.apache.poi.ss.format.CellFormatPart getColor
> > WARNING: Unknown color: "Red"
> > Tests run: 40, Failures: 0, Errors: 0, Skipped: 0, Time elapsed: 0.129
> sec
> > - in org.apache.poi.ss.format.TestCellFormat
> > Running org.apache.poi.ss.format.TestCellFormatCondition
> > Tests run: 1, Failures: 0, Errors: 0, Skipped: 0, Time elapsed: 0 sec -
> in
> > org.apache.poi.ss.format.TestCellFormatCondition
> > Running org.apache.poi.ss.format.TestCellFormatResult
> > Tests run: 1, Failures: 0, Errors: 0, Skipped: 0, Time elapsed: 0 sec -
> in
> > org.apache.poi.ss.format.TestCellFormatResult
> > Running org.apache.poi.ss.TestSpreadsheetVersion
> > Tests run: 2, Failures: 0, Errors: 0, Skipped: 0, Time elapsed: 0 sec -
> in
> > org.apache.poi.ss.TestSpreadsheetVersion
> > Running org.apache.poi.ss.usermodel.TestDateUtil
> > Tests run: 5, Failures: 0, Errors: 0, Skipped: 0, Time elapsed: 0 sec -
> in
> > org.apache.poi.ss.usermodel.TestDateUtil
> > Running org.apache.poi.ss.usermodel.TestIndexedColors
> > Tests run: 3, Failures: 0, Errors: 0, Skipped: 0, Time elapsed: 0 sec -
> in
> > org.apache.poi.ss.usermodel.TestIndexedColors
> > Running org.apache.poi.ss.usermodel.TestFractionFormat
> > Tests run: 2, Failures: 0, Errors: 0, Skipped: 0, Time elapsed: 0.105 sec
> > - in org.apache.poi.ss.usermodel.TestFractionFormat
> > Running org.apache.poi.ss.usermodel.TestExcelStyleDateFormatter
> > Tests run: 4, Failures: 0, Errors: 0, Skipped: 0, Time elapsed: 0.01 sec
> -
> > in org.apache.poi.ss.usermodel.TestExcelStyleDateFormatter
> > Running org.apache.poi.ss.usermodel.TestHSSFBorderStyle
> > Tests run: 1, Failures: 0, Errors: 0, Skipped: 0, Time elapsed: 0 sec -
> in
> > org.apache.poi.ss.usermodel.TestHSSFBorderStyle
> > Running org.apache.poi.ss.usermodel.charts.TestDataSources
> > Tests run: 6, Failures: 0, Errors: 0, Skipped: 0, Time elapsed: 0.004 sec
> > - in org.apache.poi.ss.usermodel.charts.TestDataSources
> > Running org.apache.poi.ss.usermodel.TestDataFormatter
> > Tests run: 33, Failures: 0, Errors: 0, Skipped: 1, Time elapsed: 0.05 sec
> > - in org.apache.poi.ss.usermodel.TestDataFormatter
> > Running org.apache.poi.TestPOIDocumentMain
> > Tests run: 6, Failures: 0, Errors: 0, Skipped: 0, Time elapsed: 0.006 sec
> > - in org.apache.poi.TestPOIDocumentMain
> >
> > Results :
> >
> > Failed tests:
> >   TestTempFile.testSetTempFileCreationStrategy
> > Expected: an instance of java.lang.IllegalArgumentException
> >      but: <org.junit.internal.runners.model.MultipleFailureException:
> > There were 2 errors:
> >   java.lang.IllegalArgumentException(strategy == null)
> >   java.io.IOException(Permission denied)> is a
> > org.junit.internal.runners.model.MultipleFailureException
> > Stacktrace was: org.junit.internal.runners.model.
> MultipleFailureException:
> > There were 2 errors:
> >   java.lang.IllegalArgumentException(strategy == null)
> >   java.io.IOException(Permission denied)
> >         at
> > org.junit.runners.model.MultipleFailureException.assertEmpty(
> MultipleFailureException.java:67)
> >         at
> > org.junit.internal.runners.statements.RunAfters.evaluate(
> RunAfters.java:39)
> >         at
> > org.junit.rules.ExpectedException$ExpectedExceptionStatement.
> evaluate(ExpectedException.java:239)
> >         at org.junit.rules.RunRules.evaluate(RunRules.java:20)
> >         at org.junit.runners.ParentRunner.runLeaf(ParentRunner.java:325)
> >         at
> > org.junit.runners.BlockJUnit4ClassRunner.runChild(
> BlockJUnit4ClassRunner.java:78)
> >         at
> > org.junit.runners.BlockJUnit4ClassRunner.runChild(
> BlockJUnit4ClassRunner.java:57)
> >         at org.junit.runners.ParentRunner$3.run(ParentRunner.java:290)
> >         at org.junit.runners.ParentRunner$1.schedule(
> ParentRunner.java:71)
> >         at
> > org.junit.runners.ParentRunner.runChildren(ParentRunner.java:288)
> >         at org.junit.runners.ParentRunner.access$000(
> ParentRunner.java:58)
> >         at org.junit.runners.ParentRunner$2.evaluate(
> ParentRunner.java:268)
> >         at org.junit.runners.ParentRunner.run(ParentRunner.java:363)
> >         at org.junit.runners.Suite.runChild(Suite.java:128)
> >         at org.junit.runners.Suite.runChild(Suite.java:27)
> >         at org.junit.runners.ParentRunner$3.run(ParentRunner.java:290)
> >         at org.junit.runners.ParentRunner$1.schedule(
> ParentRunner.java:71)
> >         at
> > org.junit.runners.ParentRunner.runChildren(ParentRunner.java:288)
> >         at org.junit.runners.ParentRunner.access$000(
> ParentRunner.java:58)
> >         at org.junit.runners.ParentRunner$2.evaluate(
> ParentRunner.java:268)
> >         at org.junit.runners.ParentRunner.run(ParentRunner.java:363)
> >         at
> > org.apache.maven.surefire.junitcore.JUnitCore.run(JUnitCore.java:55)
> >         at
> > org.apache.maven.surefire.junitcore.JUnitCoreWrapper.
> createRequestAndRun(JUnitCoreWrapper.java:137)
> >         at
> > org.apache.maven.surefire.junitcore.JUnitCoreWrapper.
> executeEager(JUnitCoreWrapper.java:107)
> >         at
> > org.apache.maven.surefire.junitcore.JUnitCoreWrapper.
> execute(JUnitCoreWrapper.java:83)
> >         at
> > org.apache.maven.surefire.junitcore.JUnitCoreWrapper.
> execute(JUnitCoreWrapper.java:75)
> >         at
> > org.apache.maven.surefire.junitcore.JUnitCoreProvider.
> invoke(JUnitCoreProvider.java:161)
> >         at
> > org.apache.maven.surefire.booter.ForkedBooter.
> invokeProviderInSameClassLoader(ForkedBooter.java:290)
> >         at
> > org.apache.maven.surefire.booter.ForkedBooter.runSuitesInProcess(
> ForkedBooter.java:242)
> >         at
> > org.apache.maven.surefire.booter.ForkedBooter.main(
> ForkedBooter.java:121)
> >
> > Tests in error:
> >   TestWrite.dictionary:475 » IO Permission denied
> >   TestWrite.dictionaryWithInvalidCodepage »  Unexpected exception,
> > expected<org....
> >   TestWrite.inPlaceNPOIFSWrite:526 » IO Permission denied
> >   TestWrite.withoutAFormatID »  Unexpected exception,
> > expected<org.apache.poi.hp...
> >   TestWriteWellKnown.testWriteWellKnown:170 » IO Permission denied
> >   TestCellStyle.testDataStyle:104 » IO Permission denied
> >   TestCellStyle.testWriteSheetFont:64 » IO Permission denied
> >   TestCellStyle.testWriteSheetStyle:176 » IO Permission denied
> >   TestFormulas.test27272_1:927 » IO Permission denied
> >   TestFormulas.test27272_2:939 » IO Permission denied
> >   TestFormulas.testComplexSheetRefs:914 » IO Permission denied
> >   TestFormulas.testRVAoperands:637 » IO Permission denied
> >   TestHSSFWorkbook.inPlaceWrite:1270 » IO Permission denied
> >   TestHSSFWorkbook.testRewriteFileBug58480:1137 » IO Permission denied
> >   TestHSSFWorkbook.testWriteToNewFile:1310 » IO Permission denied
> >   TestPOIFSDump.testFailToWrite »  Unexpected exception,
> > expected<java.lang.Inde...
> >   TestNPOIFSFileSystem.createWriteRead:1005->writeOutFileAndReadBack:103
> »
> > IO Pe...
> >   TestDataSource.testFileWritable:58 » IO Permission denied
> >   TestDataSource.testRewritableFile:86 » IO Permission denied
> >
> > TestDateFormatConverter.testJavaDateFormatsInExcel:
> 120->outputLocaleDataFormats:108
> > » IO
> >   TestHexDump.testMain:268 » IO Permission denied
> >
> > org.apache.poi.util.TestTempFile.createTempFileWithDefaultSuffi
> x(org.apache.poi.util.TestTempFile)
> >   Run 1: TestTempFile.createTempFileWithDefaultSuffix:109 » IO
> Permission
> > denied
> >   Run 2: TestTempFile.tearDown:81 » IO Permission denied
> >
> >
> > org.apache.poi.util.TestTempFile.testCreateTempDirectory(org.
> apache.poi.util.TestTempFile)
> >   Run 1: TestTempFile.testCreateTempDirectory:117 » IO Could not create
> > temporary direc...
> >   Run 2: TestTempFile.tearDown:81 » IO Permission denied
> >
> >
> > org.apache.poi.util.TestTempFile.testCreateTempFile(org.apache.
> poi.util.TestTempFile)
> >   Run 1: TestTempFile.testCreateTempFile:89 » IO Permission denied
> >   Run 2: TestTempFile.tearDown:81 » IO Permission denied
> >
> >
> > Tests run: 6527, Failures: 1, Errors: 24, Skipped: 776
> >
> > [INFO]
> > ------------------------------------------------------------------------
> > [INFO] Reactor Summary:
> > [INFO]
> > [INFO] Apache POI - the Java API for Microsoft Documents . SUCCESS [
> > 0.002 s]
> > [INFO] Apache POI Main package ........................... FAILURE [01:25
> > min]
> > [INFO] Apache POI Scratchpad package ..................... SKIPPED
> > [INFO] Apache POI - Openxmlformats Schema package ........ SKIPPED
> > [INFO] Apache POI - Openxmlformats Encryption Schema package  SKIPPED
> > [INFO] Apache POI - Openxmlformats Security-Schema package  SKIPPED
> > [INFO] Apache POI OOXML package .......................... SKIPPED
> > [INFO] Apache POI ExcelAnt package ....................... SKIPPED
> > [INFO] Apache POI Examples package ....................... SKIPPED
> > [INFO]
> > ------------------------------------------------------------------------
> > [INFO] BUILD FAILURE
> > [INFO]
> > ------------------------------------------------------------------------
> > [INFO] Total time: 01:26 min
> > [INFO] Finished at: 2017-11-15T20:06:32+00:00
> > [INFO] Final Memory: 29M/827M
> > [INFO]
> > ------------------------------------------------------------------------
> > [ERROR] Failed to execute goal
> > org.apache.maven.plugins:maven-surefire-plugin:2.19.1:test
> (default-test)
> > on project poi-main: There are test failures.
> > [ERROR]
> > [ERROR] Please refer to <
> > https://builds.apache.org/job/POI-DSL-Maven/ws/sonar/main/
> target/surefire-reports>
> > for the individual test results.
> > [ERROR] -> [Help 1]
> > [ERROR]
> > [ERROR] To see the full stack trace of the errors, re-run Maven with the
> > -e switch.
> > [ERROR] Re-run Maven using the -X switch to enable full debug logging.
> > [ERROR]
> > [ERROR] For more information about the errors and possible solutions,
> > please read the following articles:
> > [ERROR] [Help 1]
> > http://cwiki.apache.org/confluence/display/MAVEN/MojoFailureException
> > [ERROR]
> > [ERROR] After correcting the problems, you can resume the build with the
> > command
> > [ERROR]   mvn <goals> -rf :poi-main
> > Build step 'Invoke top-level Maven targets' marked build as failure
> >
> > ---------------------------------------------------------------------
> > To unsubscribe, e-mail: [hidden email]
> > For additional commands, e-mail: [hidden email]
> >
> >
>