Build failed in Jenkins: POI-DSL-Maven #396

classic Classic list List threaded Threaded
3 messages Options
Reply | Threaded
Open this post in threaded view
|

Build failed in Jenkins: POI-DSL-Maven #396

Apache Jenkins Server
See <https://builds.apache.org/job/POI-DSL-Maven/396/display/redirect?page=changes>

Changes:

[onealj] XWPFTable#getRows() should return an unmodifiable list unless the method can correctly update xmlbeans in response to modifying the list

[onealj] make tableRows final; initialize where defined rather than in constructor.

[onealj] deprecate XWPFTable#addNewRowBetween(int,int), which has not been implemented since 2008 when this class was first authored. (Unrelated: This closes #82 on github).

------------------------------------------
[...truncated 99.73 KB...]
Tests run: 9, Failures: 0, Errors: 0, Skipped: 0, Time elapsed: 0 sec - in org.apache.poi.ss.formula.functions.TestMatch
Running org.apache.poi.ss.formula.functions.TestMid
Tests run: 4, Failures: 0, Errors: 0, Skipped: 0, Time elapsed: 0 sec - in org.apache.poi.ss.formula.functions.TestMid
Running org.apache.poi.ss.formula.functions.TestMirr
Tests run: 4, Failures: 0, Errors: 0, Skipped: 0, Time elapsed: 0.001 sec - in org.apache.poi.ss.formula.functions.TestMirr
Running org.apache.poi.ss.formula.functions.TestCountFuncs
Tests run: 16, Failures: 0, Errors: 0, Skipped: 0, Time elapsed: 0.008 sec - in org.apache.poi.ss.formula.functions.TestCountFuncs
Running org.apache.poi.ss.formula.functions.TestIntercept
Tests run: 4, Failures: 0, Errors: 0, Skipped: 0, Time elapsed: 0.005 sec - in org.apache.poi.ss.formula.functions.TestIntercept
Running org.apache.poi.ss.formula.functions.TestSumifs
Tests run: 7, Failures: 0, Errors: 0, Skipped: 0, Time elapsed: 0.002 sec - in org.apache.poi.ss.formula.functions.TestSumifs
Running org.apache.poi.ss.formula.functions.TestWeekNumFunctionsFromSpreadsheet2013
Tests run: 7, Failures: 0, Errors: 0, Skipped: 0, Time elapsed: 0 sec - in org.apache.poi.ss.formula.functions.TestWeekNumFunctionsFromSpreadsheet2013
Running org.apache.poi.ss.formula.functions.TestSubtotal
Tests run: 11, Failures: 0, Errors: 0, Skipped: 0, Time elapsed: 0.004 sec - in org.apache.poi.ss.formula.functions.TestSubtotal
Running org.apache.poi.ss.formula.functions.TestComplex
Tests run: 2, Failures: 0, Errors: 0, Skipped: 0, Time elapsed: 0 sec - in org.apache.poi.ss.formula.functions.TestComplex
Running org.apache.poi.ss.formula.functions.TestAddress
Tests run: 1, Failures: 0, Errors: 0, Skipped: 0, Time elapsed: 0 sec - in org.apache.poi.ss.formula.functions.TestAddress
Running org.apache.poi.ss.formula.functions.TestBin2Dec
Tests run: 5, Failures: 0, Errors: 0, Skipped: 0, Time elapsed: 0 sec - in org.apache.poi.ss.formula.functions.TestBin2Dec
Running org.apache.poi.ss.formula.functions.TestSumif
Tests run: 3, Failures: 0, Errors: 0, Skipped: 0, Time elapsed: 0.001 sec - in org.apache.poi.ss.formula.functions.TestSumif
Running org.apache.poi.ss.formula.functions.TestText
Tests run: 4, Failures: 0, Errors: 0, Skipped: 0, Time elapsed: 0.003 sec - in org.apache.poi.ss.formula.functions.TestText
Running org.apache.poi.ss.formula.functions.TestValue
Tests run: 2, Failures: 0, Errors: 0, Skipped: 0, Time elapsed: 0 sec - in org.apache.poi.ss.formula.functions.TestValue
Running org.apache.poi.ss.formula.functions.TestStatsLib
Tests run: 9, Failures: 0, Errors: 0, Skipped: 0, Time elapsed: 0 sec - in org.apache.poi.ss.formula.functions.TestStatsLib
Running org.apache.poi.ss.formula.functions.TestIndexFunctionFromSpreadsheet
Tests run: 98, Failures: 0, Errors: 0, Skipped: 0, Time elapsed: 0.006 sec - in org.apache.poi.ss.formula.functions.TestIndexFunctionFromSpreadsheet
Running org.apache.poi.ss.formula.functions.TestLen
Tests run: 3, Failures: 0, Errors: 0, Skipped: 0, Time elapsed: 0 sec - in org.apache.poi.ss.formula.functions.TestLen
Running org.apache.poi.ss.formula.functions.TestDec2Hex
Tests run: 12, Failures: 0, Errors: 0, Skipped: 0, Time elapsed: 0.018 sec - in org.apache.poi.ss.formula.functions.TestDec2Hex
Running org.apache.poi.ss.formula.functions.TestNpv
Tests run: 2, Failures: 0, Errors: 0, Skipped: 0, Time elapsed: 0.001 sec - in org.apache.poi.ss.formula.functions.TestNpv
Running org.apache.poi.ss.formula.functions.TestOct2Dec
Tests run: 2, Failures: 0, Errors: 0, Skipped: 0, Time elapsed: 0 sec - in org.apache.poi.ss.formula.functions.TestOct2Dec
Running org.apache.poi.ss.formula.functions.TestAverage
Tests run: 3, Failures: 0, Errors: 0, Skipped: 0, Time elapsed: 0 sec - in org.apache.poi.ss.formula.functions.TestAverage
Running org.apache.poi.ss.formula.functions.TestDStarFunctionsFromSpreadsheet
Tests run: 4, Failures: 0, Errors: 0, Skipped: 0, Time elapsed: 0 sec - in org.apache.poi.ss.formula.functions.TestDStarFunctionsFromSpreadsheet
Running org.apache.poi.ss.formula.functions.TestPPMT
Tests run: 1, Failures: 0, Errors: 0, Skipped: 0, Time elapsed: 0.001 sec - in org.apache.poi.ss.formula.functions.TestPPMT
Running org.apache.poi.ss.formula.functions.TestDelta
Tests run: 2, Failures: 0, Errors: 0, Skipped: 0, Time elapsed: 0 sec - in org.apache.poi.ss.formula.functions.TestDelta
Running org.apache.poi.ss.formula.functions.TestIndex
Tests run: 3, Failures: 0, Errors: 0, Skipped: 0, Time elapsed: 0 sec - in org.apache.poi.ss.formula.functions.TestIndex
Running org.apache.poi.ss.formula.functions.TestMultiOperandNumericFunction
Tests run: 1, Failures: 0, Errors: 0, Skipped: 0, Time elapsed: 0 sec - in org.apache.poi.ss.formula.functions.TestMultiOperandNumericFunction
Running org.apache.poi.ss.formula.functions.TestImaginaryFunctionsFromSpreadsheet
Tests run: 7, Failures: 0, Errors: 0, Skipped: 0, Time elapsed: 0 sec - in org.apache.poi.ss.formula.functions.TestImaginaryFunctionsFromSpreadsheet
Running org.apache.poi.ss.formula.functions.TestWeekNumFunctionsFromSpreadsheet
Tests run: 7, Failures: 0, Errors: 0, Skipped: 0, Time elapsed: 0 sec - in org.apache.poi.ss.formula.functions.TestWeekNumFunctionsFromSpreadsheet
Running org.apache.poi.ss.formula.functions.TestCodeFunctionsFromSpreadsheet
Tests run: 4, Failures: 0, Errors: 0, Skipped: 0, Time elapsed: 0 sec - in org.apache.poi.ss.formula.functions.TestCodeFunctionsFromSpreadsheet
Running org.apache.poi.ss.formula.functions.TestFixed
Tests run: 2, Failures: 0, Errors: 0, Skipped: 0, Time elapsed: 0.001 sec - in org.apache.poi.ss.formula.functions.TestFixed
Running org.apache.poi.ss.formula.functions.TestCalendarFieldFunction
Tests run: 4, Failures: 0, Errors: 0, Skipped: 0, Time elapsed: 0.003 sec - in org.apache.poi.ss.formula.functions.TestCalendarFieldFunction
Running org.apache.poi.ss.formula.functions.TestIrr
Tests run: 3, Failures: 0, Errors: 0, Skipped: 0, Time elapsed: 0 sec - in org.apache.poi.ss.formula.functions.TestIrr
Running org.apache.poi.ss.formula.functions.TestTrim
Tests run: 3, Failures: 0, Errors: 0, Skipped: 0, Time elapsed: 0 sec - in org.apache.poi.ss.formula.functions.TestTrim
Running org.apache.poi.ss.formula.functions.TestTFunc
Tests run: 5, Failures: 0, Errors: 0, Skipped: 0, Time elapsed: 0 sec - in org.apache.poi.ss.formula.functions.TestTFunc
Running org.apache.poi.ss.formula.functions.TestImRealFunctionsFromSpreadsheet
Tests run: 7, Failures: 0, Errors: 0, Skipped: 0, Time elapsed: 0 sec - in org.apache.poi.ss.formula.functions.TestImRealFunctionsFromSpreadsheet
Running org.apache.poi.ss.formula.functions.TestDate
Tests run: 3, Failures: 0, Errors: 0, Skipped: 0, Time elapsed: 0 sec - in org.apache.poi.ss.formula.functions.TestDate
Running org.apache.poi.ss.formula.functions.TestWeekdayFunc
Tests run: 2, Failures: 0, Errors: 0, Skipped: 0, Time elapsed: 0 sec - in org.apache.poi.ss.formula.functions.TestWeekdayFunc
Running org.apache.poi.ss.util.TestCellRangeAddress
Tests run: 14, Failures: 0, Errors: 0, Skipped: 0, Time elapsed: 0.002 sec - in org.apache.poi.ss.util.TestCellRangeAddress
Running org.apache.poi.ss.util.TestDateFormatConverter
Tests run: 2, Failures: 0, Errors: 1, Skipped: 0, Time elapsed: 0.487 sec <<< FAILURE! - in org.apache.poi.ss.util.TestDateFormatConverter
testJavaDateFormatsInExcel(org.apache.poi.ss.util.TestDateFormatConverter)  Time elapsed: 0.487 sec  <<< ERROR!
java.io.IOException: Permission denied
        at org.apache.poi.ss.util.TestDateFormatConverter.outputLocaleDataFormats(TestDateFormatConverter.java:108)
        at org.apache.poi.ss.util.TestDateFormatConverter.testJavaDateFormatsInExcel(TestDateFormatConverter.java:120)

Running org.apache.poi.ss.util.TestPropertyTemplate
Tests run: 8, Failures: 0, Errors: 0, Skipped: 0, Time elapsed: 0.012 sec - in org.apache.poi.ss.util.TestPropertyTemplate
Running org.apache.poi.ss.util.TestNumberComparer
Tests run: 4, Failures: 0, Errors: 0, Skipped: 0, Time elapsed: 0.024 sec - in org.apache.poi.ss.util.TestNumberComparer
Running org.apache.poi.ss.util.TestSheetUtil
Tests run: 7, Failures: 0, Errors: 0, Skipped: 0, Time elapsed: 0.001 sec - in org.apache.poi.ss.util.TestSheetUtil
Running org.apache.poi.ss.util.TestCellRangeUtil
Tests run: 1, Failures: 0, Errors: 0, Skipped: 0, Time elapsed: 0.031 sec - in org.apache.poi.ss.util.TestCellRangeUtil
Running org.apache.poi.ss.util.TestCellReference
Tests run: 25, Failures: 0, Errors: 0, Skipped: 0, Time elapsed: 0.001 sec - in org.apache.poi.ss.util.TestCellReference
Running org.apache.poi.ss.util.TestAreaReference
Tests run: 2, Failures: 0, Errors: 0, Skipped: 0, Time elapsed: 0 sec - in org.apache.poi.ss.util.TestAreaReference
Running org.apache.poi.ss.util.TestExpandedDouble
Tests run: 3, Failures: 0, Errors: 0, Skipped: 0, Time elapsed: 0 sec - in org.apache.poi.ss.util.TestExpandedDouble
Running org.apache.poi.ss.util.TestHSSFCellUtil
Tests run: 13, Failures: 0, Errors: 0, Skipped: 0, Time elapsed: 0.003 sec - in org.apache.poi.ss.util.TestHSSFCellUtil
Running org.apache.poi.ss.util.TestSheetBuilder
Tests run: 3, Failures: 0, Errors: 0, Skipped: 0, Time elapsed: 0 sec - in org.apache.poi.ss.util.TestSheetBuilder
Running org.apache.poi.ss.util.TestNumberToTextConverter
Tests run: 2, Failures: 0, Errors: 0, Skipped: 0, Time elapsed: 0.003 sec - in org.apache.poi.ss.util.TestNumberToTextConverter
Running org.apache.poi.ss.util.TestRegionUtil
Tests run: 10, Failures: 0, Errors: 0, Skipped: 0, Time elapsed: 0.004 sec - in org.apache.poi.ss.util.TestRegionUtil
Running org.apache.poi.ss.util.TestCellAddress
Tests run: 6, Failures: 0, Errors: 0, Skipped: 0, Time elapsed: 0.001 sec - in org.apache.poi.ss.util.TestCellAddress
Running org.apache.poi.ss.util.TestWorkbookUtil
Tests run: 1, Failures: 0, Errors: 0, Skipped: 0, Time elapsed: 0 sec - in org.apache.poi.ss.util.TestWorkbookUtil
Running org.apache.poi.ss.util.cellwalk.TestCellWalk
Tests run: 1, Failures: 0, Errors: 0, Skipped: 0, Time elapsed: 0.001 sec - in org.apache.poi.ss.util.cellwalk.TestCellWalk
Running org.apache.poi.ss.format.TestCellFormat
Nov 12, 2017 4:05:32 AM org.apache.poi.ss.format.CellFormatPart getColor
WARNING: Unknown color: "Red"
Tests run: 40, Failures: 0, Errors: 0, Skipped: 0, Time elapsed: 0.049 sec - in org.apache.poi.ss.format.TestCellFormat
Running org.apache.poi.ss.format.TestCellFormatCondition
Tests run: 1, Failures: 0, Errors: 0, Skipped: 0, Time elapsed: 0 sec - in org.apache.poi.ss.format.TestCellFormatCondition
Running org.apache.poi.ss.format.TestCellFormatResult
Tests run: 1, Failures: 0, Errors: 0, Skipped: 0, Time elapsed: 0.001 sec - in org.apache.poi.ss.format.TestCellFormatResult
Running org.apache.poi.ss.TestSpreadsheetVersion
Tests run: 2, Failures: 0, Errors: 0, Skipped: 0, Time elapsed: 0 sec - in org.apache.poi.ss.TestSpreadsheetVersion
Running org.apache.poi.ss.usermodel.TestDateUtil
Tests run: 5, Failures: 0, Errors: 0, Skipped: 0, Time elapsed: 0 sec - in org.apache.poi.ss.usermodel.TestDateUtil
Running org.apache.poi.ss.usermodel.TestIndexedColors
Tests run: 3, Failures: 0, Errors: 0, Skipped: 0, Time elapsed: 0 sec - in org.apache.poi.ss.usermodel.TestIndexedColors
Running org.apache.poi.ss.usermodel.TestFractionFormat
Tests run: 2, Failures: 0, Errors: 0, Skipped: 0, Time elapsed: 0.058 sec - in org.apache.poi.ss.usermodel.TestFractionFormat
Running org.apache.poi.ss.usermodel.TestExcelStyleDateFormatter
Tests run: 4, Failures: 0, Errors: 0, Skipped: 0, Time elapsed: 0.003 sec - in org.apache.poi.ss.usermodel.TestExcelStyleDateFormatter
Running org.apache.poi.ss.usermodel.TestHSSFBorderStyle
Tests run: 1, Failures: 0, Errors: 0, Skipped: 0, Time elapsed: 0.001 sec - in org.apache.poi.ss.usermodel.TestHSSFBorderStyle
Running org.apache.poi.ss.usermodel.charts.TestDataSources
Tests run: 6, Failures: 0, Errors: 0, Skipped: 0, Time elapsed: 0.003 sec - in org.apache.poi.ss.usermodel.charts.TestDataSources
Running org.apache.poi.ss.usermodel.TestDataFormatter
Tests run: 33, Failures: 0, Errors: 0, Skipped: 1, Time elapsed: 0.024 sec - in org.apache.poi.ss.usermodel.TestDataFormatter
Running org.apache.poi.TestPOIDocumentMain
Tests run: 6, Failures: 0, Errors: 0, Skipped: 0, Time elapsed: 0.006 sec - in org.apache.poi.TestPOIDocumentMain

Results :

Failed tests:
  TestTempFile.testSetTempFileCreationStrategy
Expected: an instance of java.lang.IllegalArgumentException
     but: <org.junit.internal.runners.model.MultipleFailureException: There were 2 errors:
  java.lang.IllegalArgumentException(strategy == null)
  java.io.IOException(Permission denied)> is a org.junit.internal.runners.model.MultipleFailureException
Stacktrace was: org.junit.internal.runners.model.MultipleFailureException: There were 2 errors:
  java.lang.IllegalArgumentException(strategy == null)
  java.io.IOException(Permission denied)
        at org.junit.runners.model.MultipleFailureException.assertEmpty(MultipleFailureException.java:67)
        at org.junit.internal.runners.statements.RunAfters.evaluate(RunAfters.java:39)
        at org.junit.rules.ExpectedException$ExpectedExceptionStatement.evaluate(ExpectedException.java:239)
        at org.junit.rules.RunRules.evaluate(RunRules.java:20)
        at org.junit.runners.ParentRunner.runLeaf(ParentRunner.java:325)
        at org.junit.runners.BlockJUnit4ClassRunner.runChild(BlockJUnit4ClassRunner.java:78)
        at org.junit.runners.BlockJUnit4ClassRunner.runChild(BlockJUnit4ClassRunner.java:57)
        at org.junit.runners.ParentRunner$3.run(ParentRunner.java:290)
        at org.junit.runners.ParentRunner$1.schedule(ParentRunner.java:71)
        at org.junit.runners.ParentRunner.runChildren(ParentRunner.java:288)
        at org.junit.runners.ParentRunner.access$000(ParentRunner.java:58)
        at org.junit.runners.ParentRunner$2.evaluate(ParentRunner.java:268)
        at org.junit.runners.ParentRunner.run(ParentRunner.java:363)
        at org.junit.runners.Suite.runChild(Suite.java:128)
        at org.junit.runners.Suite.runChild(Suite.java:27)
        at org.junit.runners.ParentRunner$3.run(ParentRunner.java:290)
        at org.junit.runners.ParentRunner$1.schedule(ParentRunner.java:71)
        at org.junit.runners.ParentRunner.runChildren(ParentRunner.java:288)
        at org.junit.runners.ParentRunner.access$000(ParentRunner.java:58)
        at org.junit.runners.ParentRunner$2.evaluate(ParentRunner.java:268)
        at org.junit.runners.ParentRunner.run(ParentRunner.java:363)
        at org.apache.maven.surefire.junitcore.JUnitCore.run(JUnitCore.java:55)
        at org.apache.maven.surefire.junitcore.JUnitCoreWrapper.createRequestAndRun(JUnitCoreWrapper.java:137)
        at org.apache.maven.surefire.junitcore.JUnitCoreWrapper.executeEager(JUnitCoreWrapper.java:107)
        at org.apache.maven.surefire.junitcore.JUnitCoreWrapper.execute(JUnitCoreWrapper.java:83)
        at org.apache.maven.surefire.junitcore.JUnitCoreWrapper.execute(JUnitCoreWrapper.java:75)
        at org.apache.maven.surefire.junitcore.JUnitCoreProvider.invoke(JUnitCoreProvider.java:161)
        at org.apache.maven.surefire.booter.ForkedBooter.invokeProviderInSameClassLoader(ForkedBooter.java:290)
        at org.apache.maven.surefire.booter.ForkedBooter.runSuitesInProcess(ForkedBooter.java:242)
        at org.apache.maven.surefire.booter.ForkedBooter.main(ForkedBooter.java:121)

Tests in error:
  TestWrite.dictionary:475 » IO Permission denied
  TestWrite.dictionaryWithInvalidCodepage »  Unexpected exception, expected<org....
  TestWrite.inPlaceNPOIFSWrite:526 » IO Permission denied
  TestWrite.withoutAFormatID »  Unexpected exception, expected<org.apache.poi.hp...
  TestWriteWellKnown.testWriteWellKnown:170 » IO Permission denied
  TestCellStyle.testDataStyle:104 » IO Permission denied
  TestCellStyle.testWriteSheetFont:64 » IO Permission denied
  TestCellStyle.testWriteSheetStyle:176 » IO Permission denied
  TestFormulas.test27272_1:927 » IO Permission denied
  TestFormulas.test27272_2:939 » IO Permission denied
  TestFormulas.testComplexSheetRefs:914 » IO Permission denied
  TestFormulas.testRVAoperands:637 » IO Permission denied
  TestHSSFWorkbook.inPlaceWrite:1270 » IO Permission denied
  TestHSSFWorkbook.testRewriteFileBug58480:1137 » IO Permission denied
  TestHSSFWorkbook.testWriteToNewFile:1310 » IO Permission denied
  TestPOIFSDump.testFailToWrite »  Unexpected exception, expected<java.lang.Inde...
  TestNPOIFSFileSystem.createWriteRead:1005->writeOutFileAndReadBack:103 » IO Pe...
  TestDataSource.testFileWritable:58 » IO Permission denied
  TestDataSource.testRewritableFile:86 » IO Permission denied
  TestDateFormatConverter.testJavaDateFormatsInExcel:120->outputLocaleDataFormats:108 » IO
  TestHexDump.testMain:268 » IO Permission denied
org.apache.poi.util.TestTempFile.createTempFileWithDefaultSuffix(org.apache.poi.util.TestTempFile)
  Run 1: TestTempFile.createTempFileWithDefaultSuffix:109 » IO Permission denied
  Run 2: TestTempFile.tearDown:81 » IO Permission denied

org.apache.poi.util.TestTempFile.testCreateTempDirectory(org.apache.poi.util.TestTempFile)
  Run 1: TestTempFile.testCreateTempDirectory:117 » IO Could not create temporary direc...
  Run 2: TestTempFile.tearDown:81 » IO Permission denied

org.apache.poi.util.TestTempFile.testCreateTempFile(org.apache.poi.util.TestTempFile)
  Run 1: TestTempFile.testCreateTempFile:89 » IO Permission denied
  Run 2: TestTempFile.tearDown:81 » IO Permission denied


Tests run: 6527, Failures: 1, Errors: 24, Skipped: 776

[INFO] ------------------------------------------------------------------------
[INFO] Reactor Summary:
[INFO]
[INFO] Apache POI - the Java API for Microsoft Documents . SUCCESS [  0.002 s]
[INFO] Apache POI Main package ........................... FAILURE [01:17 min]
[INFO] Apache POI Scratchpad package ..................... SKIPPED
[INFO] Apache POI - Openxmlformats Schema package ........ SKIPPED
[INFO] Apache POI - Openxmlformats Encryption Schema package  SKIPPED
[INFO] Apache POI - Openxmlformats Security-Schema package  SKIPPED
[INFO] Apache POI OOXML package .......................... SKIPPED
[INFO] Apache POI ExcelAnt package ....................... SKIPPED
[INFO] Apache POI Examples package ....................... SKIPPED
[INFO] ------------------------------------------------------------------------
[INFO] BUILD FAILURE
[INFO] ------------------------------------------------------------------------
[INFO] Total time: 01:18 min
[INFO] Finished at: 2017-11-12T04:05:32+00:00
[INFO] Final Memory: 31M/813M
[INFO] ------------------------------------------------------------------------
[ERROR] Failed to execute goal org.apache.maven.plugins:maven-surefire-plugin:2.19.1:test (default-test) on project poi-main: There are test failures.
[ERROR]
[ERROR] Please refer to <https://builds.apache.org/job/POI-DSL-Maven/ws/sonar/main/target/surefire-reports> for the individual test results.
[ERROR] -> [Help 1]
[ERROR]
[ERROR] To see the full stack trace of the errors, re-run Maven with the -e switch.
[ERROR] Re-run Maven using the -X switch to enable full debug logging.
[ERROR]
[ERROR] For more information about the errors and possible solutions, please read the following articles:
[ERROR] [Help 1] http://cwiki.apache.org/confluence/display/MAVEN/MojoFailureException
[ERROR]
[ERROR] After correcting the problems, you can resume the build with the command
[ERROR]   mvn <goals> -rf :poi-main
Build step 'Invoke top-level Maven targets' marked build as failure

---------------------------------------------------------------------
To unsubscribe, e-mail: [hidden email]
For additional commands, e-mail: [hidden email]

Reply | Threaded
Open this post in threaded view
|

Build failed in Jenkins: POI-DSL-Maven #397

Apache Jenkins Server
See <https://builds.apache.org/job/POI-DSL-Maven/397/display/redirect?page=changes>

Changes:

[onealj] +svn:eol-style native *.java

[onealj] github #81: sheet names are case insensitive

------------------------------------------
[...truncated 98.81 KB...]
Tests run: 9, Failures: 0, Errors: 0, Skipped: 0, Time elapsed: 0 sec - in org.apache.poi.ss.formula.functions.TestMatch
Running org.apache.poi.ss.formula.functions.TestMid
Tests run: 4, Failures: 0, Errors: 0, Skipped: 0, Time elapsed: 0 sec - in org.apache.poi.ss.formula.functions.TestMid
Running org.apache.poi.ss.formula.functions.TestMirr
Tests run: 4, Failures: 0, Errors: 0, Skipped: 0, Time elapsed: 0 sec - in org.apache.poi.ss.formula.functions.TestMirr
Running org.apache.poi.ss.formula.functions.TestCountFuncs
Tests run: 16, Failures: 0, Errors: 0, Skipped: 0, Time elapsed: 0.007 sec - in org.apache.poi.ss.formula.functions.TestCountFuncs
Running org.apache.poi.ss.formula.functions.TestIntercept
Tests run: 4, Failures: 0, Errors: 0, Skipped: 0, Time elapsed: 0.004 sec - in org.apache.poi.ss.formula.functions.TestIntercept
Running org.apache.poi.ss.formula.functions.TestSumifs
Tests run: 7, Failures: 0, Errors: 0, Skipped: 0, Time elapsed: 0.001 sec - in org.apache.poi.ss.formula.functions.TestSumifs
Running org.apache.poi.ss.formula.functions.TestWeekNumFunctionsFromSpreadsheet2013
Tests run: 7, Failures: 0, Errors: 0, Skipped: 0, Time elapsed: 0 sec - in org.apache.poi.ss.formula.functions.TestWeekNumFunctionsFromSpreadsheet2013
Running org.apache.poi.ss.formula.functions.TestSubtotal
Tests run: 11, Failures: 0, Errors: 0, Skipped: 0, Time elapsed: 0 sec - in org.apache.poi.ss.formula.functions.TestSubtotal
Running org.apache.poi.ss.formula.functions.TestComplex
Tests run: 2, Failures: 0, Errors: 0, Skipped: 0, Time elapsed: 0 sec - in org.apache.poi.ss.formula.functions.TestComplex
Running org.apache.poi.ss.formula.functions.TestAddress
Tests run: 1, Failures: 0, Errors: 0, Skipped: 0, Time elapsed: 0 sec - in org.apache.poi.ss.formula.functions.TestAddress
Running org.apache.poi.ss.formula.functions.TestBin2Dec
Tests run: 5, Failures: 0, Errors: 0, Skipped: 0, Time elapsed: 0.002 sec - in org.apache.poi.ss.formula.functions.TestBin2Dec
Running org.apache.poi.ss.formula.functions.TestSumif
Tests run: 3, Failures: 0, Errors: 0, Skipped: 0, Time elapsed: 0 sec - in org.apache.poi.ss.formula.functions.TestSumif
Running org.apache.poi.ss.formula.functions.TestText
Tests run: 4, Failures: 0, Errors: 0, Skipped: 0, Time elapsed: 0.001 sec - in org.apache.poi.ss.formula.functions.TestText
Running org.apache.poi.ss.formula.functions.TestValue
Tests run: 2, Failures: 0, Errors: 0, Skipped: 0, Time elapsed: 0 sec - in org.apache.poi.ss.formula.functions.TestValue
Running org.apache.poi.ss.formula.functions.TestStatsLib
Tests run: 9, Failures: 0, Errors: 0, Skipped: 0, Time elapsed: 0 sec - in org.apache.poi.ss.formula.functions.TestStatsLib
Running org.apache.poi.ss.formula.functions.TestIndexFunctionFromSpreadsheet
Tests run: 98, Failures: 0, Errors: 0, Skipped: 0, Time elapsed: 0.001 sec - in org.apache.poi.ss.formula.functions.TestIndexFunctionFromSpreadsheet
Running org.apache.poi.ss.formula.functions.TestLen
Tests run: 3, Failures: 0, Errors: 0, Skipped: 0, Time elapsed: 0 sec - in org.apache.poi.ss.formula.functions.TestLen
Running org.apache.poi.ss.formula.functions.TestDec2Hex
Tests run: 12, Failures: 0, Errors: 0, Skipped: 0, Time elapsed: 0.01 sec - in org.apache.poi.ss.formula.functions.TestDec2Hex
Running org.apache.poi.ss.formula.functions.TestNpv
Tests run: 2, Failures: 0, Errors: 0, Skipped: 0, Time elapsed: 0.001 sec - in org.apache.poi.ss.formula.functions.TestNpv
Running org.apache.poi.ss.formula.functions.TestOct2Dec
Tests run: 2, Failures: 0, Errors: 0, Skipped: 0, Time elapsed: 0 sec - in org.apache.poi.ss.formula.functions.TestOct2Dec
Running org.apache.poi.ss.formula.functions.TestAverage
Tests run: 3, Failures: 0, Errors: 0, Skipped: 0, Time elapsed: 0 sec - in org.apache.poi.ss.formula.functions.TestAverage
Running org.apache.poi.ss.formula.functions.TestDStarFunctionsFromSpreadsheet
Tests run: 4, Failures: 0, Errors: 0, Skipped: 0, Time elapsed: 0 sec - in org.apache.poi.ss.formula.functions.TestDStarFunctionsFromSpreadsheet
Running org.apache.poi.ss.formula.functions.TestPPMT
Tests run: 1, Failures: 0, Errors: 0, Skipped: 0, Time elapsed: 0 sec - in org.apache.poi.ss.formula.functions.TestPPMT
Running org.apache.poi.ss.formula.functions.TestDelta
Tests run: 2, Failures: 0, Errors: 0, Skipped: 0, Time elapsed: 0 sec - in org.apache.poi.ss.formula.functions.TestDelta
Running org.apache.poi.ss.formula.functions.TestIndex
Tests run: 3, Failures: 0, Errors: 0, Skipped: 0, Time elapsed: 0.001 sec - in org.apache.poi.ss.formula.functions.TestIndex
Running org.apache.poi.ss.formula.functions.TestMultiOperandNumericFunction
Tests run: 1, Failures: 0, Errors: 0, Skipped: 0, Time elapsed: 0 sec - in org.apache.poi.ss.formula.functions.TestMultiOperandNumericFunction
Running org.apache.poi.ss.formula.functions.TestImaginaryFunctionsFromSpreadsheet
Tests run: 7, Failures: 0, Errors: 0, Skipped: 0, Time elapsed: 0 sec - in org.apache.poi.ss.formula.functions.TestImaginaryFunctionsFromSpreadsheet
Running org.apache.poi.ss.formula.functions.TestWeekNumFunctionsFromSpreadsheet
Tests run: 7, Failures: 0, Errors: 0, Skipped: 0, Time elapsed: 0 sec - in org.apache.poi.ss.formula.functions.TestWeekNumFunctionsFromSpreadsheet
Running org.apache.poi.ss.formula.functions.TestCodeFunctionsFromSpreadsheet
Tests run: 4, Failures: 0, Errors: 0, Skipped: 0, Time elapsed: 0 sec - in org.apache.poi.ss.formula.functions.TestCodeFunctionsFromSpreadsheet
Running org.apache.poi.ss.formula.functions.TestFixed
Tests run: 2, Failures: 0, Errors: 0, Skipped: 0, Time elapsed: 0 sec - in org.apache.poi.ss.formula.functions.TestFixed
Running org.apache.poi.ss.formula.functions.TestCalendarFieldFunction
Tests run: 4, Failures: 0, Errors: 0, Skipped: 0, Time elapsed: 0.005 sec - in org.apache.poi.ss.formula.functions.TestCalendarFieldFunction
Running org.apache.poi.ss.formula.functions.TestIrr
Tests run: 3, Failures: 0, Errors: 0, Skipped: 0, Time elapsed: 0 sec - in org.apache.poi.ss.formula.functions.TestIrr
Running org.apache.poi.ss.formula.functions.TestTrim
Tests run: 3, Failures: 0, Errors: 0, Skipped: 0, Time elapsed: 0 sec - in org.apache.poi.ss.formula.functions.TestTrim
Running org.apache.poi.ss.formula.functions.TestTFunc
Tests run: 5, Failures: 0, Errors: 0, Skipped: 0, Time elapsed: 0 sec - in org.apache.poi.ss.formula.functions.TestTFunc
Running org.apache.poi.ss.formula.functions.TestImRealFunctionsFromSpreadsheet
Tests run: 7, Failures: 0, Errors: 0, Skipped: 0, Time elapsed: 0.001 sec - in org.apache.poi.ss.formula.functions.TestImRealFunctionsFromSpreadsheet
Running org.apache.poi.ss.formula.functions.TestDate
Tests run: 3, Failures: 0, Errors: 0, Skipped: 0, Time elapsed: 0 sec - in org.apache.poi.ss.formula.functions.TestDate
Running org.apache.poi.ss.formula.functions.TestWeekdayFunc
Tests run: 2, Failures: 0, Errors: 0, Skipped: 0, Time elapsed: 0 sec - in org.apache.poi.ss.formula.functions.TestWeekdayFunc
Running org.apache.poi.ss.util.TestCellRangeAddress
Tests run: 14, Failures: 0, Errors: 0, Skipped: 0, Time elapsed: 0 sec - in org.apache.poi.ss.util.TestCellRangeAddress
Running org.apache.poi.ss.util.TestDateFormatConverter
Tests run: 2, Failures: 0, Errors: 1, Skipped: 0, Time elapsed: 0.22 sec <<< FAILURE! - in org.apache.poi.ss.util.TestDateFormatConverter
testJavaDateFormatsInExcel(org.apache.poi.ss.util.TestDateFormatConverter)  Time elapsed: 0.22 sec  <<< ERROR!
java.io.IOException: Permission denied
        at org.apache.poi.ss.util.TestDateFormatConverter.outputLocaleDataFormats(TestDateFormatConverter.java:108)
        at org.apache.poi.ss.util.TestDateFormatConverter.testJavaDateFormatsInExcel(TestDateFormatConverter.java:120)

Running org.apache.poi.ss.util.TestPropertyTemplate
Tests run: 8, Failures: 0, Errors: 0, Skipped: 0, Time elapsed: 0.013 sec - in org.apache.poi.ss.util.TestPropertyTemplate
Running org.apache.poi.ss.util.TestNumberComparer
Tests run: 4, Failures: 0, Errors: 0, Skipped: 0, Time elapsed: 0.028 sec - in org.apache.poi.ss.util.TestNumberComparer
Running org.apache.poi.ss.util.TestSheetUtil
Tests run: 7, Failures: 0, Errors: 0, Skipped: 0, Time elapsed: 0.002 sec - in org.apache.poi.ss.util.TestSheetUtil
Running org.apache.poi.ss.util.TestCellRangeUtil
Tests run: 1, Failures: 0, Errors: 0, Skipped: 0, Time elapsed: 0.017 sec - in org.apache.poi.ss.util.TestCellRangeUtil
Running org.apache.poi.ss.util.TestCellReference
Tests run: 25, Failures: 0, Errors: 0, Skipped: 0, Time elapsed: 0.001 sec - in org.apache.poi.ss.util.TestCellReference
Running org.apache.poi.ss.util.TestAreaReference
Tests run: 2, Failures: 0, Errors: 0, Skipped: 0, Time elapsed: 0 sec - in org.apache.poi.ss.util.TestAreaReference
Running org.apache.poi.ss.util.TestExpandedDouble
Tests run: 3, Failures: 0, Errors: 0, Skipped: 0, Time elapsed: 0 sec - in org.apache.poi.ss.util.TestExpandedDouble
Running org.apache.poi.ss.util.TestHSSFCellUtil
Tests run: 13, Failures: 0, Errors: 0, Skipped: 0, Time elapsed: 0.002 sec - in org.apache.poi.ss.util.TestHSSFCellUtil
Running org.apache.poi.ss.util.TestSheetBuilder
Tests run: 3, Failures: 0, Errors: 0, Skipped: 0, Time elapsed: 0 sec - in org.apache.poi.ss.util.TestSheetBuilder
Running org.apache.poi.ss.util.TestNumberToTextConverter
Tests run: 2, Failures: 0, Errors: 0, Skipped: 0, Time elapsed: 0.01 sec - in org.apache.poi.ss.util.TestNumberToTextConverter
Running org.apache.poi.ss.util.TestRegionUtil
Tests run: 10, Failures: 0, Errors: 0, Skipped: 0, Time elapsed: 0 sec - in org.apache.poi.ss.util.TestRegionUtil
Running org.apache.poi.ss.util.TestCellAddress
Tests run: 6, Failures: 0, Errors: 0, Skipped: 0, Time elapsed: 0 sec - in org.apache.poi.ss.util.TestCellAddress
Running org.apache.poi.ss.util.TestWorkbookUtil
Tests run: 1, Failures: 0, Errors: 0, Skipped: 0, Time elapsed: 0 sec - in org.apache.poi.ss.util.TestWorkbookUtil
Running org.apache.poi.ss.util.cellwalk.TestCellWalk
Tests run: 1, Failures: 0, Errors: 0, Skipped: 0, Time elapsed: 0 sec - in org.apache.poi.ss.util.cellwalk.TestCellWalk
Running org.apache.poi.ss.format.TestCellFormat
Nov 12, 2017 8:05:27 AM org.apache.poi.ss.format.CellFormatPart getColor
WARNING: Unknown color: "Red"
Tests run: 40, Failures: 0, Errors: 0, Skipped: 0, Time elapsed: 0.051 sec - in org.apache.poi.ss.format.TestCellFormat
Running org.apache.poi.ss.format.TestCellFormatCondition
Tests run: 1, Failures: 0, Errors: 0, Skipped: 0, Time elapsed: 0 sec - in org.apache.poi.ss.format.TestCellFormatCondition
Running org.apache.poi.ss.format.TestCellFormatResult
Tests run: 1, Failures: 0, Errors: 0, Skipped: 0, Time elapsed: 0 sec - in org.apache.poi.ss.format.TestCellFormatResult
Running org.apache.poi.ss.TestSpreadsheetVersion
Tests run: 2, Failures: 0, Errors: 0, Skipped: 0, Time elapsed: 0 sec - in org.apache.poi.ss.TestSpreadsheetVersion
Running org.apache.poi.ss.usermodel.TestDateUtil
Tests run: 5, Failures: 0, Errors: 0, Skipped: 0, Time elapsed: 0.001 sec - in org.apache.poi.ss.usermodel.TestDateUtil
Running org.apache.poi.ss.usermodel.TestIndexedColors
Tests run: 3, Failures: 0, Errors: 0, Skipped: 0, Time elapsed: 0.001 sec - in org.apache.poi.ss.usermodel.TestIndexedColors
Running org.apache.poi.ss.usermodel.TestFractionFormat
Tests run: 2, Failures: 0, Errors: 0, Skipped: 0, Time elapsed: 0.047 sec - in org.apache.poi.ss.usermodel.TestFractionFormat
Running org.apache.poi.ss.usermodel.TestExcelStyleDateFormatter
Tests run: 4, Failures: 0, Errors: 0, Skipped: 0, Time elapsed: 0.002 sec - in org.apache.poi.ss.usermodel.TestExcelStyleDateFormatter
Running org.apache.poi.ss.usermodel.TestHSSFBorderStyle
Tests run: 1, Failures: 0, Errors: 0, Skipped: 0, Time elapsed: 0 sec - in org.apache.poi.ss.usermodel.TestHSSFBorderStyle
Running org.apache.poi.ss.usermodel.charts.TestDataSources
Tests run: 6, Failures: 0, Errors: 0, Skipped: 0, Time elapsed: 0.002 sec - in org.apache.poi.ss.usermodel.charts.TestDataSources
Running org.apache.poi.ss.usermodel.TestDataFormatter
Tests run: 33, Failures: 0, Errors: 0, Skipped: 1, Time elapsed: 0.03 sec - in org.apache.poi.ss.usermodel.TestDataFormatter
Running org.apache.poi.TestPOIDocumentMain
Tests run: 6, Failures: 0, Errors: 0, Skipped: 0, Time elapsed: 0.004 sec - in org.apache.poi.TestPOIDocumentMain

Results :

Failed tests:
  TestTempFile.testSetTempFileCreationStrategy
Expected: an instance of java.lang.IllegalArgumentException
     but: <org.junit.internal.runners.model.MultipleFailureException: There were 2 errors:
  java.lang.IllegalArgumentException(strategy == null)
  java.io.IOException(Permission denied)> is a org.junit.internal.runners.model.MultipleFailureException
Stacktrace was: org.junit.internal.runners.model.MultipleFailureException: There were 2 errors:
  java.lang.IllegalArgumentException(strategy == null)
  java.io.IOException(Permission denied)
        at org.junit.runners.model.MultipleFailureException.assertEmpty(MultipleFailureException.java:67)
        at org.junit.internal.runners.statements.RunAfters.evaluate(RunAfters.java:39)
        at org.junit.rules.ExpectedException$ExpectedExceptionStatement.evaluate(ExpectedException.java:239)
        at org.junit.rules.RunRules.evaluate(RunRules.java:20)
        at org.junit.runners.ParentRunner.runLeaf(ParentRunner.java:325)
        at org.junit.runners.BlockJUnit4ClassRunner.runChild(BlockJUnit4ClassRunner.java:78)
        at org.junit.runners.BlockJUnit4ClassRunner.runChild(BlockJUnit4ClassRunner.java:57)
        at org.junit.runners.ParentRunner$3.run(ParentRunner.java:290)
        at org.junit.runners.ParentRunner$1.schedule(ParentRunner.java:71)
        at org.junit.runners.ParentRunner.runChildren(ParentRunner.java:288)
        at org.junit.runners.ParentRunner.access$000(ParentRunner.java:58)
        at org.junit.runners.ParentRunner$2.evaluate(ParentRunner.java:268)
        at org.junit.runners.ParentRunner.run(ParentRunner.java:363)
        at org.junit.runners.Suite.runChild(Suite.java:128)
        at org.junit.runners.Suite.runChild(Suite.java:27)
        at org.junit.runners.ParentRunner$3.run(ParentRunner.java:290)
        at org.junit.runners.ParentRunner$1.schedule(ParentRunner.java:71)
        at org.junit.runners.ParentRunner.runChildren(ParentRunner.java:288)
        at org.junit.runners.ParentRunner.access$000(ParentRunner.java:58)
        at org.junit.runners.ParentRunner$2.evaluate(ParentRunner.java:268)
        at org.junit.runners.ParentRunner.run(ParentRunner.java:363)
        at org.apache.maven.surefire.junitcore.JUnitCore.run(JUnitCore.java:55)
        at org.apache.maven.surefire.junitcore.JUnitCoreWrapper.createRequestAndRun(JUnitCoreWrapper.java:137)
        at org.apache.maven.surefire.junitcore.JUnitCoreWrapper.executeEager(JUnitCoreWrapper.java:107)
        at org.apache.maven.surefire.junitcore.JUnitCoreWrapper.execute(JUnitCoreWrapper.java:83)
        at org.apache.maven.surefire.junitcore.JUnitCoreWrapper.execute(JUnitCoreWrapper.java:75)
        at org.apache.maven.surefire.junitcore.JUnitCoreProvider.invoke(JUnitCoreProvider.java:161)
        at org.apache.maven.surefire.booter.ForkedBooter.invokeProviderInSameClassLoader(ForkedBooter.java:290)
        at org.apache.maven.surefire.booter.ForkedBooter.runSuitesInProcess(ForkedBooter.java:242)
        at org.apache.maven.surefire.booter.ForkedBooter.main(ForkedBooter.java:121)

Tests in error:
  TestWrite.dictionary:475 » IO Permission denied
  TestWrite.dictionaryWithInvalidCodepage »  Unexpected exception, expected<org....
  TestWrite.inPlaceNPOIFSWrite:526 » IO Permission denied
  TestWrite.withoutAFormatID »  Unexpected exception, expected<org.apache.poi.hp...
  TestWriteWellKnown.testWriteWellKnown:170 » IO Permission denied
  TestCellStyle.testDataStyle:104 » IO Permission denied
  TestCellStyle.testWriteSheetFont:64 » IO Permission denied
  TestCellStyle.testWriteSheetStyle:176 » IO Permission denied
  TestFormulas.test27272_1:927 » IO Permission denied
  TestFormulas.test27272_2:939 » IO Permission denied
  TestFormulas.testComplexSheetRefs:914 » IO Permission denied
  TestFormulas.testRVAoperands:637 » IO Permission denied
  TestHSSFWorkbook.inPlaceWrite:1270 » IO Permission denied
  TestHSSFWorkbook.testRewriteFileBug58480:1137 » IO Permission denied
  TestHSSFWorkbook.testWriteToNewFile:1310 » IO Permission denied
  TestPOIFSDump.testFailToWrite »  Unexpected exception, expected<java.lang.Inde...
  TestNPOIFSFileSystem.createWriteRead:1005->writeOutFileAndReadBack:103 » IO Pe...
  TestDataSource.testFileWritable:58 » IO Permission denied
  TestDataSource.testRewritableFile:86 » IO Permission denied
  TestDateFormatConverter.testJavaDateFormatsInExcel:120->outputLocaleDataFormats:108 » IO
  TestHexDump.testMain:268 » IO Permission denied
org.apache.poi.util.TestTempFile.createTempFileWithDefaultSuffix(org.apache.poi.util.TestTempFile)
  Run 1: TestTempFile.createTempFileWithDefaultSuffix:109 » IO Permission denied
  Run 2: TestTempFile.tearDown:81 » IO Permission denied

org.apache.poi.util.TestTempFile.testCreateTempDirectory(org.apache.poi.util.TestTempFile)
  Run 1: TestTempFile.testCreateTempDirectory:117 » IO Could not create temporary direc...
  Run 2: TestTempFile.tearDown:81 » IO Permission denied

org.apache.poi.util.TestTempFile.testCreateTempFile(org.apache.poi.util.TestTempFile)
  Run 1: TestTempFile.testCreateTempFile:89 » IO Permission denied
  Run 2: TestTempFile.tearDown:81 » IO Permission denied


Tests run: 6527, Failures: 1, Errors: 24, Skipped: 776

[INFO] ------------------------------------------------------------------------
[INFO] Reactor Summary:
[INFO]
[INFO] Apache POI - the Java API for Microsoft Documents . SUCCESS [  0.002 s]
[INFO] Apache POI Main package ........................... FAILURE [01:20 min]
[INFO] Apache POI Scratchpad package ..................... SKIPPED
[INFO] Apache POI - Openxmlformats Schema package ........ SKIPPED
[INFO] Apache POI - Openxmlformats Encryption Schema package  SKIPPED
[INFO] Apache POI - Openxmlformats Security-Schema package  SKIPPED
[INFO] Apache POI OOXML package .......................... SKIPPED
[INFO] Apache POI ExcelAnt package ....................... SKIPPED
[INFO] Apache POI Examples package ....................... SKIPPED
[INFO] ------------------------------------------------------------------------
[INFO] BUILD FAILURE
[INFO] ------------------------------------------------------------------------
[INFO] Total time: 01:20 min
[INFO] Finished at: 2017-11-12T08:05:27+00:00
[INFO] Final Memory: 31M/814M
[INFO] ------------------------------------------------------------------------
[ERROR] Failed to execute goal org.apache.maven.plugins:maven-surefire-plugin:2.19.1:test (default-test) on project poi-main: There are test failures.
[ERROR]
[ERROR] Please refer to <https://builds.apache.org/job/POI-DSL-Maven/ws/sonar/main/target/surefire-reports> for the individual test results.
[ERROR] -> [Help 1]
[ERROR]
[ERROR] To see the full stack trace of the errors, re-run Maven with the -e switch.
[ERROR] Re-run Maven using the -X switch to enable full debug logging.
[ERROR]
[ERROR] For more information about the errors and possible solutions, please read the following articles:
[ERROR] [Help 1] http://cwiki.apache.org/confluence/display/MAVEN/MojoFailureException
[ERROR]
[ERROR] After correcting the problems, you can resume the build with the command
[ERROR]   mvn <goals> -rf :poi-main
Build step 'Invoke top-level Maven targets' marked build as failure

---------------------------------------------------------------------
To unsubscribe, e-mail: [hidden email]
For additional commands, e-mail: [hidden email]

Reply | Threaded
Open this post in threaded view
|

Jenkins build is back to normal : POI-DSL-Maven #398

Apache Jenkins Server
See <https://builds.apache.org/job/POI-DSL-Maven/398/display/redirect?page=changes>


---------------------------------------------------------------------
To unsubscribe, e-mail: [hidden email]
For additional commands, e-mail: [hidden email]