Build failed in Jenkins: POI-DSL-Maven #357

classic Classic list List threaded Threaded
2 messages Options
Reply | Threaded
Open this post in threaded view
|

Build failed in Jenkins: POI-DSL-Maven #357

Apache Jenkins Server
See <https://builds.apache.org/job/POI-DSL-Maven/357/display/redirect?page=changes>

Changes:

[centic] Replace deprecated CellReference class and some other warnings fixed

------------------------------------------
[...truncated 78.72 KB...]
Running org.apache.poi.ss.formula.functions.TestRoundFuncs
Tests run: 5, Failures: 0, Errors: 0, Skipped: 1, Time elapsed: 0 sec - in org.apache.poi.ss.formula.functions.TestRoundFuncs
Running org.apache.poi.ss.formula.functions.TestIsBlank
Tests run: 1, Failures: 0, Errors: 0, Skipped: 0, Time elapsed: 0 sec - in org.apache.poi.ss.formula.functions.TestIsBlank
Running org.apache.poi.ss.formula.functions.TestIndirectFunctionFromSpreadsheet
Tests run: 11, Failures: 0, Errors: 0, Skipped: 0, Time elapsed: 0.008 sec - in org.apache.poi.ss.formula.functions.TestIndirectFunctionFromSpreadsheet
Running org.apache.poi.ss.formula.functions.TestNper
Tests run: 2, Failures: 0, Errors: 0, Skipped: 0, Time elapsed: 0 sec - in org.apache.poi.ss.formula.functions.TestNper
Running org.apache.poi.ss.formula.functions.TestLookupFunctionsFromSpreadsheet
Tests run: 199, Failures: 0, Errors: 0, Skipped: 0, Time elapsed: 0.043 sec - in org.apache.poi.ss.formula.functions.TestLookupFunctionsFromSpreadsheet
Running org.apache.poi.ss.formula.functions.TestDeltaFunctionsFromSpreadsheet
Tests run: 7, Failures: 0, Errors: 0, Skipped: 0, Time elapsed: 0.002 sec - in org.apache.poi.ss.formula.functions.TestDeltaFunctionsFromSpreadsheet
Running org.apache.poi.ss.formula.functions.TestFixedFunctionsFromSpreadsheet
Tests run: 20, Failures: 0, Errors: 0, Skipped: 0, Time elapsed: 0.005 sec - in org.apache.poi.ss.formula.functions.TestFixedFunctionsFromSpreadsheet
Running org.apache.poi.ss.formula.functions.TestMathX
Tests run: 23, Failures: 0, Errors: 0, Skipped: 0, Time elapsed: 0.005 sec - in org.apache.poi.ss.formula.functions.TestMathX
Running org.apache.poi.ss.formula.functions.TestPoisson
Tests run: 6, Failures: 0, Errors: 0, Skipped: 0, Time elapsed: 0.001 sec - in org.apache.poi.ss.formula.functions.TestPoisson
Running org.apache.poi.ss.formula.functions.TestFind
Tests run: 1, Failures: 0, Errors: 0, Skipped: 0, Time elapsed: 0.002 sec - in org.apache.poi.ss.formula.functions.TestFind
Running org.apache.poi.ss.formula.functions.TestSumproduct
Tests run: 5, Failures: 0, Errors: 0, Skipped: 0, Time elapsed: 0.002 sec - in org.apache.poi.ss.formula.functions.TestSumproduct
Running org.apache.poi.ss.formula.functions.TestCode
Tests run: 2, Failures: 0, Errors: 0, Skipped: 0, Time elapsed: 0 sec - in org.apache.poi.ss.formula.functions.TestCode
Running org.apache.poi.ss.formula.functions.TestQuotientFunctionsFromSpreadsheet
Tests run: 8, Failures: 0, Errors: 0, Skipped: 0, Time elapsed: 0.002 sec - in org.apache.poi.ss.formula.functions.TestQuotientFunctionsFromSpreadsheet
Running org.apache.poi.ss.formula.functions.TestHex2Dec
Tests run: 5, Failures: 0, Errors: 0, Skipped: 0, Time elapsed: 0.001 sec - in org.apache.poi.ss.formula.functions.TestHex2Dec
Running org.apache.poi.ss.formula.functions.TestLeftRight
Tests run: 2, Failures: 0, Errors: 0, Skipped: 0, Time elapsed: 0 sec - in org.apache.poi.ss.formula.functions.TestLeftRight
Running org.apache.poi.ss.formula.functions.TestEOMonth
Tests run: 9, Failures: 0, Errors: 0, Skipped: 0, Time elapsed: 0.005 sec - in org.apache.poi.ss.formula.functions.TestEOMonth
Running org.apache.poi.ss.formula.functions.TestReptFunctionsFromSpreadsheet
Tests run: 5, Failures: 0, Errors: 0, Skipped: 0, Time elapsed: 0.003 sec - in org.apache.poi.ss.formula.functions.TestReptFunctionsFromSpreadsheet
Running org.apache.poi.ss.formula.functions.TestSlope
Tests run: 3, Failures: 0, Errors: 0, Skipped: 0, Time elapsed: 0.001 sec - in org.apache.poi.ss.formula.functions.TestSlope
Running org.apache.poi.ss.formula.functions.TestTrunc
Tests run: 5, Failures: 0, Errors: 0, Skipped: 0, Time elapsed: 0.001 sec - in org.apache.poi.ss.formula.functions.TestTrunc
Running org.apache.poi.ss.formula.functions.TestClean
Tests run: 1, Failures: 0, Errors: 0, Skipped: 0, Time elapsed: 0.001 sec - in org.apache.poi.ss.formula.functions.TestClean
Running org.apache.poi.ss.formula.functions.TestIndirect
Tests run: 3, Failures: 0, Errors: 0, Skipped: 0, Time elapsed: 0.003 sec - in org.apache.poi.ss.formula.functions.TestIndirect
Running org.apache.poi.ss.formula.functions.TestFactDoubleFunctionsFromSpreadsheet
Tests run: 8, Failures: 0, Errors: 0, Skipped: 0, Time elapsed: 0.002 sec - in org.apache.poi.ss.formula.functions.TestFactDoubleFunctionsFromSpreadsheet
Running org.apache.poi.ss.formula.functions.TestLogicalFunction
Tests run: 2, Failures: 0, Errors: 0, Skipped: 0, Time elapsed: 0.001 sec - in org.apache.poi.ss.formula.functions.TestLogicalFunction
Running org.apache.poi.ss.formula.functions.TestOffset
Tests run: 2, Failures: 0, Errors: 0, Skipped: 0, Time elapsed: 0 sec - in org.apache.poi.ss.formula.functions.TestOffset
Running org.apache.poi.ss.formula.functions.TestDec2Bin
Tests run: 15, Failures: 0, Errors: 0, Skipped: 0, Time elapsed: 0.026 sec - in org.apache.poi.ss.formula.functions.TestDec2Bin
Running org.apache.poi.ss.formula.functions.TestRomanFunctionsFromSpreadsheet
Tests run: 35, Failures: 0, Errors: 0, Skipped: 0, Time elapsed: 0.008 sec - in org.apache.poi.ss.formula.functions.TestRomanFunctionsFromSpreadsheet
Running org.apache.poi.ss.formula.functions.TestDGetFunctionsFromSpreadsheet
Tests run: 78, Failures: 0, Errors: 0, Skipped: 0, Time elapsed: 0.024 sec - in org.apache.poi.ss.formula.functions.TestDGetFunctionsFromSpreadsheet
Running org.apache.poi.ss.formula.functions.TestRowCol
Tests run: 4, Failures: 0, Errors: 0, Skipped: 0, Time elapsed: 0 sec - in org.apache.poi.ss.formula.functions.TestRowCol
Running org.apache.poi.ss.formula.functions.TestComplexFunctionsFromSpreadsheet
Tests run: 12, Failures: 0, Errors: 0, Skipped: 0, Time elapsed: 0.001 sec - in org.apache.poi.ss.formula.functions.TestComplexFunctionsFromSpreadsheet
Running org.apache.poi.ss.formula.functions.TestTime
Tests run: 2, Failures: 0, Errors: 0, Skipped: 0, Time elapsed: 0.002 sec - in org.apache.poi.ss.formula.functions.TestTime
Running org.apache.poi.ss.formula.functions.TestDays360
Tests run: 2, Failures: 0, Errors: 0, Skipped: 0, Time elapsed: 0.007 sec - in org.apache.poi.ss.formula.functions.TestDays360
Running org.apache.poi.ss.formula.functions.TestXYNumericFunction
Tests run: 3, Failures: 0, Errors: 0, Skipped: 0, Time elapsed: 0.001 sec - in org.apache.poi.ss.formula.functions.TestXYNumericFunction
Running org.apache.poi.ss.formula.functions.TestRank
Tests run: 1, Failures: 0, Errors: 0, Skipped: 0, Time elapsed: 0.003 sec - in org.apache.poi.ss.formula.functions.TestRank
Running org.apache.poi.ss.formula.functions.TestMatchFunctionsFromSpreadsheet
Tests run: 13, Failures: 0, Errors: 0, Skipped: 0, Time elapsed: 0.003 sec - in org.apache.poi.ss.formula.functions.TestMatchFunctionsFromSpreadsheet
Running org.apache.poi.ss.formula.functions.TestEDate
Tests run: 9, Failures: 0, Errors: 0, Skipped: 0, Time elapsed: 0.002 sec - in org.apache.poi.ss.formula.functions.TestEDate
Running org.apache.poi.ss.formula.functions.TestQuotient
Tests run: 2, Failures: 0, Errors: 0, Skipped: 0, Time elapsed: 0.001 sec - in org.apache.poi.ss.formula.functions.TestQuotient
Running org.apache.poi.ss.formula.functions.TestPmt
Tests run: 2, Failures: 0, Errors: 0, Skipped: 0, Time elapsed: 0.001 sec - in org.apache.poi.ss.formula.functions.TestPmt
Running org.apache.poi.ss.formula.functions.TestFinanceLib
Tests run: 5, Failures: 0, Errors: 0, Skipped: 0, Time elapsed: 0.002 sec - in org.apache.poi.ss.formula.functions.TestFinanceLib
Running org.apache.poi.ss.formula.functions.TestIPMT
Tests run: 1, Failures: 0, Errors: 0, Skipped: 0, Time elapsed: 0.001 sec - in org.apache.poi.ss.formula.functions.TestIPMT
Running org.apache.poi.ss.formula.functions.TestMatch
Tests run: 9, Failures: 0, Errors: 0, Skipped: 0, Time elapsed: 0.003 sec - in org.apache.poi.ss.formula.functions.TestMatch
Running org.apache.poi.ss.formula.functions.TestMid
Tests run: 4, Failures: 0, Errors: 0, Skipped: 0, Time elapsed: 0.001 sec - in org.apache.poi.ss.formula.functions.TestMid
Running org.apache.poi.ss.formula.functions.TestMirr
Tests run: 4, Failures: 0, Errors: 0, Skipped: 0, Time elapsed: 0.002 sec - in org.apache.poi.ss.formula.functions.TestMirr
Running org.apache.poi.ss.formula.functions.TestCountFuncs
Tests run: 16, Failures: 0, Errors: 0, Skipped: 0, Time elapsed: 0.012 sec - in org.apache.poi.ss.formula.functions.TestCountFuncs
Running org.apache.poi.ss.formula.functions.TestIntercept
Tests run: 4, Failures: 0, Errors: 0, Skipped: 0, Time elapsed: 0.001 sec - in org.apache.poi.ss.formula.functions.TestIntercept
Running org.apache.poi.ss.formula.functions.TestSumifs
Tests run: 7, Failures: 0, Errors: 0, Skipped: 0, Time elapsed: 0 sec - in org.apache.poi.ss.formula.functions.TestSumifs
Running org.apache.poi.ss.formula.functions.TestWeekNumFunctionsFromSpreadsheet2013
Tests run: 7, Failures: 0, Errors: 0, Skipped: 0, Time elapsed: 0.003 sec - in org.apache.poi.ss.formula.functions.TestWeekNumFunctionsFromSpreadsheet2013
Running org.apache.poi.ss.formula.functions.TestSubtotal
Tests run: 11, Failures: 0, Errors: 0, Skipped: 0, Time elapsed: 0.004 sec - in org.apache.poi.ss.formula.functions.TestSubtotal
Running org.apache.poi.ss.formula.functions.TestComplex
Tests run: 2, Failures: 0, Errors: 0, Skipped: 0, Time elapsed: 0 sec - in org.apache.poi.ss.formula.functions.TestComplex
Running org.apache.poi.ss.formula.functions.TestAddress
Tests run: 1, Failures: 0, Errors: 0, Skipped: 0, Time elapsed: 0 sec - in org.apache.poi.ss.formula.functions.TestAddress
Running org.apache.poi.ss.formula.functions.TestBin2Dec
Tests run: 5, Failures: 0, Errors: 0, Skipped: 0, Time elapsed: 0 sec - in org.apache.poi.ss.formula.functions.TestBin2Dec
Running org.apache.poi.ss.formula.functions.TestSumif
Tests run: 3, Failures: 0, Errors: 0, Skipped: 0, Time elapsed: 0 sec - in org.apache.poi.ss.formula.functions.TestSumif
Running org.apache.poi.ss.formula.functions.TestText
Tests run: 4, Failures: 0, Errors: 0, Skipped: 0, Time elapsed: 0.001 sec - in org.apache.poi.ss.formula.functions.TestText
Running org.apache.poi.ss.formula.functions.TestValue
Tests run: 2, Failures: 0, Errors: 0, Skipped: 0, Time elapsed: 0 sec - in org.apache.poi.ss.formula.functions.TestValue
Running org.apache.poi.ss.formula.functions.TestStatsLib
Tests run: 9, Failures: 0, Errors: 0, Skipped: 0, Time elapsed: 0.004 sec - in org.apache.poi.ss.formula.functions.TestStatsLib
Running org.apache.poi.ss.formula.functions.TestIndexFunctionFromSpreadsheet
Tests run: 98, Failures: 0, Errors: 0, Skipped: 0, Time elapsed: 0.018 sec - in org.apache.poi.ss.formula.functions.TestIndexFunctionFromSpreadsheet
Running org.apache.poi.ss.formula.functions.TestLen
Tests run: 3, Failures: 0, Errors: 0, Skipped: 0, Time elapsed: 0.001 sec - in org.apache.poi.ss.formula.functions.TestLen
Running org.apache.poi.ss.formula.functions.TestDec2Hex
Tests run: 12, Failures: 0, Errors: 0, Skipped: 0, Time elapsed: 0.02 sec - in org.apache.poi.ss.formula.functions.TestDec2Hex
Running org.apache.poi.ss.formula.functions.TestNpv
Tests run: 2, Failures: 0, Errors: 0, Skipped: 0, Time elapsed: 0.002 sec - in org.apache.poi.ss.formula.functions.TestNpv
Running org.apache.poi.ss.formula.functions.TestOct2Dec
Tests run: 2, Failures: 0, Errors: 0, Skipped: 0, Time elapsed: 0.001 sec - in org.apache.poi.ss.formula.functions.TestOct2Dec
Running org.apache.poi.ss.formula.functions.TestAverage
Tests run: 3, Failures: 0, Errors: 0, Skipped: 0, Time elapsed: 0 sec - in org.apache.poi.ss.formula.functions.TestAverage
Running org.apache.poi.ss.formula.functions.TestDStarFunctionsFromSpreadsheet
Tests run: 4, Failures: 0, Errors: 0, Skipped: 0, Time elapsed: 0.001 sec - in org.apache.poi.ss.formula.functions.TestDStarFunctionsFromSpreadsheet
Running org.apache.poi.ss.formula.functions.TestPPMT
Tests run: 1, Failures: 0, Errors: 0, Skipped: 0, Time elapsed: 0 sec - in org.apache.poi.ss.formula.functions.TestPPMT
Running org.apache.poi.ss.formula.functions.TestDelta
Tests run: 2, Failures: 0, Errors: 0, Skipped: 0, Time elapsed: 0 sec - in org.apache.poi.ss.formula.functions.TestDelta
Running org.apache.poi.ss.formula.functions.TestIndex
Tests run: 3, Failures: 0, Errors: 0, Skipped: 0, Time elapsed: 0 sec - in org.apache.poi.ss.formula.functions.TestIndex
Running org.apache.poi.ss.formula.functions.TestMultiOperandNumericFunction
Tests run: 1, Failures: 0, Errors: 0, Skipped: 0, Time elapsed: 0.001 sec - in org.apache.poi.ss.formula.functions.TestMultiOperandNumericFunction
Running org.apache.poi.ss.formula.functions.TestImaginaryFunctionsFromSpreadsheet
Tests run: 7, Failures: 0, Errors: 0, Skipped: 0, Time elapsed: 0.001 sec - in org.apache.poi.ss.formula.functions.TestImaginaryFunctionsFromSpreadsheet
Running org.apache.poi.ss.formula.functions.TestWeekNumFunctionsFromSpreadsheet
Tests run: 7, Failures: 0, Errors: 0, Skipped: 0, Time elapsed: 0 sec - in org.apache.poi.ss.formula.functions.TestWeekNumFunctionsFromSpreadsheet
Running org.apache.poi.ss.formula.functions.TestCodeFunctionsFromSpreadsheet
Tests run: 4, Failures: 0, Errors: 0, Skipped: 0, Time elapsed: 0 sec - in org.apache.poi.ss.formula.functions.TestCodeFunctionsFromSpreadsheet
Running org.apache.poi.ss.formula.functions.TestFixed
Tests run: 2, Failures: 0, Errors: 0, Skipped: 0, Time elapsed: 0 sec - in org.apache.poi.ss.formula.functions.TestFixed
Running org.apache.poi.ss.formula.functions.TestCalendarFieldFunction
Tests run: 4, Failures: 0, Errors: 0, Skipped: 0, Time elapsed: 0 sec - in org.apache.poi.ss.formula.functions.TestCalendarFieldFunction
Running org.apache.poi.ss.formula.functions.TestIrr
Tests run: 3, Failures: 0, Errors: 0, Skipped: 0, Time elapsed: 0.002 sec - in org.apache.poi.ss.formula.functions.TestIrr
Running org.apache.poi.ss.formula.functions.TestTrim
Tests run: 3, Failures: 0, Errors: 0, Skipped: 0, Time elapsed: 0.001 sec - in org.apache.poi.ss.formula.functions.TestTrim
Running org.apache.poi.ss.formula.functions.TestTFunc
Tests run: 5, Failures: 0, Errors: 0, Skipped: 0, Time elapsed: 0.001 sec - in org.apache.poi.ss.formula.functions.TestTFunc
Running org.apache.poi.ss.formula.functions.TestImRealFunctionsFromSpreadsheet
Tests run: 7, Failures: 0, Errors: 0, Skipped: 0, Time elapsed: 0 sec - in org.apache.poi.ss.formula.functions.TestImRealFunctionsFromSpreadsheet
Running org.apache.poi.ss.formula.functions.TestDate
Tests run: 3, Failures: 0, Errors: 0, Skipped: 0, Time elapsed: 0 sec - in org.apache.poi.ss.formula.functions.TestDate
Running org.apache.poi.ss.formula.functions.TestWeekdayFunc
Tests run: 2, Failures: 0, Errors: 0, Skipped: 0, Time elapsed: 0 sec - in org.apache.poi.ss.formula.functions.TestWeekdayFunc
Running org.apache.poi.ss.util.TestCellRangeAddress
Tests run: 13, Failures: 0, Errors: 0, Skipped: 0, Time elapsed: 0 sec - in org.apache.poi.ss.util.TestCellRangeAddress
Running org.apache.poi.ss.util.TestDateFormatConverter
Tests run: 2, Failures: 0, Errors: 0, Skipped: 0, Time elapsed: 0.6 sec - in org.apache.poi.ss.util.TestDateFormatConverter
Running org.apache.poi.ss.util.TestPropertyTemplate
Tests run: 8, Failures: 0, Errors: 0, Skipped: 0, Time elapsed: 0.013 sec - in org.apache.poi.ss.util.TestPropertyTemplate
Running org.apache.poi.ss.util.TestNumberComparer
Tests run: 4, Failures: 0, Errors: 0, Skipped: 0, Time elapsed: 0.025 sec - in org.apache.poi.ss.util.TestNumberComparer
Running org.apache.poi.ss.util.TestSheetUtil
Tests run: 7, Failures: 0, Errors: 0, Skipped: 0, Time elapsed: 0.004 sec - in org.apache.poi.ss.util.TestSheetUtil
Running org.apache.poi.ss.util.TestCellReference
Tests run: 25, Failures: 0, Errors: 0, Skipped: 0, Time elapsed: 0.002 sec - in org.apache.poi.ss.util.TestCellReference
Running org.apache.poi.ss.util.TestAreaReference
Tests run: 2, Failures: 0, Errors: 0, Skipped: 0, Time elapsed: 0 sec - in org.apache.poi.ss.util.TestAreaReference
Running org.apache.poi.ss.util.TestExpandedDouble
Tests run: 3, Failures: 0, Errors: 0, Skipped: 0, Time elapsed: 0.001 sec - in org.apache.poi.ss.util.TestExpandedDouble
Running org.apache.poi.ss.util.TestHSSFCellUtil
Tests run: 14, Failures: 0, Errors: 0, Skipped: 0, Time elapsed: 0.001 sec - in org.apache.poi.ss.util.TestHSSFCellUtil
Running org.apache.poi.ss.util.TestSheetBuilder
Tests run: 3, Failures: 0, Errors: 0, Skipped: 0, Time elapsed: 0.004 sec - in org.apache.poi.ss.util.TestSheetBuilder
Running org.apache.poi.ss.util.TestNumberToTextConverter
Tests run: 2, Failures: 0, Errors: 0, Skipped: 0, Time elapsed: 0.004 sec - in org.apache.poi.ss.util.TestNumberToTextConverter
Running org.apache.poi.ss.util.TestRegionUtil
Tests run: 10, Failures: 0, Errors: 0, Skipped: 0, Time elapsed: 0.006 sec - in org.apache.poi.ss.util.TestRegionUtil
Running org.apache.poi.ss.util.TestCellAddress
Tests run: 6, Failures: 0, Errors: 0, Skipped: 0, Time elapsed: 0.001 sec - in org.apache.poi.ss.util.TestCellAddress
Running org.apache.poi.ss.util.TestWorkbookUtil
Tests run: 1, Failures: 0, Errors: 0, Skipped: 0, Time elapsed: 0 sec - in org.apache.poi.ss.util.TestWorkbookUtil
Running org.apache.poi.ss.util.cellwalk.TestCellWalk
Tests run: 1, Failures: 0, Errors: 0, Skipped: 0, Time elapsed: 0.001 sec - in org.apache.poi.ss.util.cellwalk.TestCellWalk
Running org.apache.poi.ss.format.TestCellFormat
Sep 26, 2017 12:05:51 PM org.apache.poi.ss.format.CellFormatPart getColor
WARNING: Unknown color: "Red"
Tests run: 40, Failures: 0, Errors: 0, Skipped: 0, Time elapsed: 0.089 sec - in org.apache.poi.ss.format.TestCellFormat
Running org.apache.poi.ss.format.TestCellFormatCondition
Tests run: 1, Failures: 0, Errors: 0, Skipped: 0, Time elapsed: 0 sec - in org.apache.poi.ss.format.TestCellFormatCondition
Running org.apache.poi.ss.format.TestCellFormatResult
Tests run: 1, Failures: 0, Errors: 0, Skipped: 0, Time elapsed: 0.001 sec - in org.apache.poi.ss.format.TestCellFormatResult
Running org.apache.poi.ss.TestSpreadsheetVersion
Tests run: 2, Failures: 0, Errors: 0, Skipped: 0, Time elapsed: 0.001 sec - in org.apache.poi.ss.TestSpreadsheetVersion
Running org.apache.poi.ss.usermodel.TestDateUtil
Tests run: 5, Failures: 0, Errors: 0, Skipped: 0, Time elapsed: 0.001 sec - in org.apache.poi.ss.usermodel.TestDateUtil
Running org.apache.poi.ss.usermodel.TestIndexedColors
Tests run: 3, Failures: 0, Errors: 0, Skipped: 0, Time elapsed: 0.001 sec - in org.apache.poi.ss.usermodel.TestIndexedColors
Running org.apache.poi.ss.usermodel.TestFractionFormat
Tests run: 2, Failures: 0, Errors: 0, Skipped: 0, Time elapsed: 0.054 sec - in org.apache.poi.ss.usermodel.TestFractionFormat
Running org.apache.poi.ss.usermodel.TestExcelStyleDateFormatter
Tests run: 4, Failures: 0, Errors: 0, Skipped: 0, Time elapsed: 0.004 sec - in org.apache.poi.ss.usermodel.TestExcelStyleDateFormatter
Running org.apache.poi.ss.usermodel.TestHSSFBorderStyle
Tests run: 1, Failures: 0, Errors: 0, Skipped: 0, Time elapsed: 0.001 sec - in org.apache.poi.ss.usermodel.TestHSSFBorderStyle
Running org.apache.poi.ss.usermodel.charts.TestDataSources
Tests run: 6, Failures: 0, Errors: 0, Skipped: 0, Time elapsed: 0.005 sec - in org.apache.poi.ss.usermodel.charts.TestDataSources
Running org.apache.poi.ss.usermodel.TestDataFormatter
Tests run: 33, Failures: 0, Errors: 0, Skipped: 1, Time elapsed: 0.025 sec - in org.apache.poi.ss.usermodel.TestDataFormatter
Running org.apache.poi.TestPOIDocumentMain
Tests run: 6, Failures: 0, Errors: 0, Skipped: 0, Time elapsed: 0.006 sec - in org.apache.poi.TestPOIDocumentMain

Results :

Failed tests:
  TestHSSFComment>BaseTestCellComment.attemptToSave2CommentsWithSameCoordinates:377 expected:<...l comments for cell [$A$]1> but was:<...l comments for cell [A]1>

Tests run: 6505, Failures: 1, Errors: 0, Skipped: 775

[INFO] ------------------------------------------------------------------------
[INFO] Reactor Summary:
[INFO]
[INFO] Apache POI - the Java API for Microsoft Documents . SUCCESS [  0.001 s]
[INFO] Apache POI Main package ........................... FAILURE [01:38 min]
[INFO] Apache POI Scratchpad package ..................... SKIPPED
[INFO] Apache POI - Openxmlformats Schema package ........ SKIPPED
[INFO] Apache POI - Openxmlformats Encryption Schema package  SKIPPED
[INFO] Apache POI - Openxmlformats Security-Schema package  SKIPPED
[INFO] Apache POI OOXML package .......................... SKIPPED
[INFO] Apache POI ExcelAnt package ....................... SKIPPED
[INFO] Apache POI Examples package ....................... SKIPPED
[INFO] ------------------------------------------------------------------------
[INFO] BUILD FAILURE
[INFO] ------------------------------------------------------------------------
[INFO] Total time: 01:38 min
[INFO] Finished at: 2017-09-26T12:05:52+00:00
[INFO] Final Memory: 31M/813M
[INFO] ------------------------------------------------------------------------
[ERROR] Failed to execute goal org.apache.maven.plugins:maven-surefire-plugin:2.19.1:test (default-test) on project poi-main: There are test failures.
[ERROR]
[ERROR] Please refer to <https://builds.apache.org/job/POI-DSL-Maven/ws/sonar/main/target/surefire-reports> for the individual test results.
[ERROR] -> [Help 1]
[ERROR]
[ERROR] To see the full stack trace of the errors, re-run Maven with the -e switch.
[ERROR] Re-run Maven using the -X switch to enable full debug logging.
[ERROR]
[ERROR] For more information about the errors and possible solutions, please read the following articles:
[ERROR] [Help 1] http://cwiki.apache.org/confluence/display/MAVEN/MojoFailureException
[ERROR]
[ERROR] After correcting the problems, you can resume the build with the command
[ERROR]   mvn <goals> -rf :poi-main
Build step 'Invoke top-level Maven targets' marked build as failure

---------------------------------------------------------------------
To unsubscribe, e-mail: [hidden email]
For additional commands, e-mail: [hidden email]

Reply | Threaded
Open this post in threaded view
|

Jenkins build is back to normal : POI-DSL-Maven #358

Apache Jenkins Server
See <https://builds.apache.org/job/POI-DSL-Maven/358/display/redirect?page=changes>


---------------------------------------------------------------------
To unsubscribe, e-mail: [hidden email]
For additional commands, e-mail: [hidden email]