Build failed in Jenkins: POI-DSL-Maven #353

classic Classic list List threaded Threaded
2 messages Options
Reply | Threaded
Open this post in threaded view
|

Build failed in Jenkins: POI-DSL-Maven #353

Apache Jenkins Server
See <https://builds.apache.org/job/POI-DSL-Maven/353/display/redirect?page=changes>

Changes:

[centic] Tried to enable this test, but it is broken since a long time and I am not sure how this is expected to behave...

[centic] Apply patch to add endSheet() to the XSSFEventBasedExcelExtractor, fixes bug 60737, thanks to user zakim for the patch

[centic] More IntelliJ warnings fixes

------------------------------------------
[...truncated 1.16 MB...]
Running org.apache.poi.xssf.extractor.TestXSSFExportToXML
Tests run: 17, Failures: 0, Errors: 0, Skipped: 1, Time elapsed: 0.192 sec - in org.apache.poi.xssf.extractor.TestXSSFExportToXML
Running org.apache.poi.xssf.extractor.TestXSSFExcelExtractorUsingFactory
Tests run: 8, Failures: 0, Errors: 0, Skipped: 0, Time elapsed: 0.169 sec - in org.apache.poi.xssf.extractor.TestXSSFExcelExtractorUsingFactory
Running org.apache.poi.xssf.eventusermodel.TestXSSFReader
Tests run: 12, Failures: 0, Errors: 0, Skipped: 0, Time elapsed: 0.034 sec - in org.apache.poi.xssf.eventusermodel.TestXSSFReader
Running org.apache.poi.xssf.eventusermodel.TestReadOnlySharedStringsTable
Tests run: 4, Failures: 0, Errors: 0, Skipped: 0, Time elapsed: 0.007 sec - in org.apache.poi.xssf.eventusermodel.TestReadOnlySharedStringsTable
Running org.apache.poi.xssf.eventusermodel.TestXSSFBReader
Tests run: 4, Failures: 0, Errors: 0, Skipped: 0, Time elapsed: 0.018 sec - in org.apache.poi.xssf.eventusermodel.TestXSSFBReader
Running org.apache.poi.xdgf.usermodel.section.CombinedIteratorTest
Tests run: 7, Failures: 0, Errors: 0, Skipped: 0, Time elapsed: 0 sec - in org.apache.poi.xdgf.usermodel.section.CombinedIteratorTest
Running org.apache.poi.xdgf.extractor.TestXDGFVisioExtractor
Tests run: 3, Failures: 0, Errors: 0, Skipped: 0, Time elapsed: 0.272 sec - in org.apache.poi.xdgf.extractor.TestXDGFVisioExtractor
Running org.apache.poi.TestDetectAsOOXML
Tests run: 3, Failures: 0, Errors: 0, Skipped: 0, Time elapsed: 0.002 sec - in org.apache.poi.TestDetectAsOOXML
Running org.apache.poi.TestPOIXMLDocument
Tests run: 10, Failures: 0, Errors: 0, Skipped: 0, Time elapsed: 2.219 sec - in org.apache.poi.TestPOIXMLDocument
Running org.apache.poi.xslf.TestXSLFSlideShow
Tests run: 5, Failures: 0, Errors: 0, Skipped: 0, Time elapsed: 0.063 sec - in org.apache.poi.xslf.TestXSLFSlideShow
Running org.apache.poi.xslf.TestXSLFBugs
Tests run: 22, Failures: 0, Errors: 0, Skipped: 1, Time elapsed: 0.962 sec - in org.apache.poi.xslf.TestXSLFBugs
Running org.apache.poi.xslf.usermodel.TestXSLFColor
Tests run: 6, Failures: 0, Errors: 0, Skipped: 0, Time elapsed: 0.027 sec - in org.apache.poi.xslf.usermodel.TestXSLFColor
Running org.apache.poi.xslf.usermodel.TestXSLFTextParagraph
Tests run: 5, Failures: 0, Errors: 0, Skipped: 1, Time elapsed: 0.037 sec - in org.apache.poi.xslf.usermodel.TestXSLFTextParagraph
Running org.apache.poi.xslf.usermodel.TestXSLFTableRow
Tests run: 7, Failures: 0, Errors: 0, Skipped: 0, Time elapsed: 0.083 sec - in org.apache.poi.xslf.usermodel.TestXSLFTableRow
Running org.apache.poi.xslf.usermodel.TestXSLFSheet
Tests run: 1, Failures: 0, Errors: 0, Skipped: 0, Time elapsed: 0.028 sec - in org.apache.poi.xslf.usermodel.TestXSLFSheet
Running org.apache.poi.xslf.usermodel.TestPPTX2PNG
Tests run: 10, Failures: 0, Errors: 0, Skipped: 0, Time elapsed: 5.899 sec - in org.apache.poi.xslf.usermodel.TestPPTX2PNG
Running org.apache.poi.xslf.usermodel.TestXSLFTextBox
Tests run: 2, Failures: 0, Errors: 0, Skipped: 0, Time elapsed: 0.027 sec - in org.apache.poi.xslf.usermodel.TestXSLFTextBox
Running org.apache.poi.xslf.usermodel.TestXSLFTextShape
Tests run: 4, Failures: 0, Errors: 0, Skipped: 0, Time elapsed: 0.088 sec - in org.apache.poi.xslf.usermodel.TestXSLFTextShape
Running org.apache.poi.xslf.usermodel.TestXSLFShape
Tests run: 2, Failures: 0, Errors: 0, Skipped: 0, Time elapsed: 0.026 sec - in org.apache.poi.xslf.usermodel.TestXSLFShape
Running org.apache.poi.xslf.usermodel.TestXMLSlideShow
Tests run: 9, Failures: 0, Errors: 0, Skipped: 0, Time elapsed: 0.146 sec - in org.apache.poi.xslf.usermodel.TestXMLSlideShow
Running org.apache.poi.xslf.usermodel.TestXSLFTable
Tests run: 5, Failures: 0, Errors: 0, Skipped: 0, Time elapsed: 1.736 sec - in org.apache.poi.xslf.usermodel.TestXSLFTable
Running org.apache.poi.xslf.usermodel.TestXSLFGroupShape
Tests run: 2, Failures: 0, Errors: 0, Skipped: 0, Time elapsed: 0.022 sec - in org.apache.poi.xslf.usermodel.TestXSLFGroupShape
Running org.apache.poi.xslf.usermodel.TestXSLFAutoShape
Tests run: 4, Failures: 0, Errors: 0, Skipped: 0, Time elapsed: 0.044 sec - in org.apache.poi.xslf.usermodel.TestXSLFAutoShape
Running org.apache.poi.xslf.usermodel.TestXSLFSlide
Tests run: 4, Failures: 0, Errors: 0, Skipped: 0, Time elapsed: 0.429 sec - in org.apache.poi.xslf.usermodel.TestXSLFSlide
Running org.apache.poi.xslf.usermodel.TestXSLFTableStyles
Tests run: 1, Failures: 0, Errors: 0, Skipped: 0, Time elapsed: 0.009 sec - in org.apache.poi.xslf.usermodel.TestXSLFTableStyles
Running org.apache.poi.xslf.usermodel.TestXSLFChart
Tests run: 1, Failures: 0, Errors: 0, Skipped: 0, Time elapsed: 0.021 sec - in org.apache.poi.xslf.usermodel.TestXSLFChart
Running org.apache.poi.xslf.usermodel.TestXSLFSlideShowFactory
Tests run: 6, Failures: 0, Errors: 0, Skipped: 0, Time elapsed: 0.317 sec - in org.apache.poi.xslf.usermodel.TestXSLFSlideShowFactory
Running org.apache.poi.xslf.usermodel.TestXSLFShapeContainer
Tests run: 1, Failures: 0, Errors: 0, Skipped: 0, Time elapsed: 0.01 sec - in org.apache.poi.xslf.usermodel.TestXSLFShapeContainer
Running org.apache.poi.xslf.usermodel.TestXSLFHyperlink
Tests run: 3, Failures: 0, Errors: 0, Skipped: 0, Time elapsed: 0.059 sec - in org.apache.poi.xslf.usermodel.TestXSLFHyperlink
Running org.apache.poi.xslf.usermodel.TestXSLFNotes
Tests run: 3, Failures: 0, Errors: 0, Skipped: 0, Time elapsed: 0.042 sec - in org.apache.poi.xslf.usermodel.TestXSLFNotes
Running org.apache.poi.xslf.usermodel.TestXSLFSlideShow
Tests run: 6, Failures: 0, Errors: 0, Skipped: 0, Time elapsed: 0.101 sec - in org.apache.poi.xslf.usermodel.TestXSLFSlideShow
Running org.apache.poi.xslf.usermodel.TestXSLFTextRun
Tests run: 1, Failures: 0, Errors: 0, Skipped: 0, Time elapsed: 0.01 sec - in org.apache.poi.xslf.usermodel.TestXSLFTextRun
Running org.apache.poi.xslf.usermodel.TestXSLFFreeformShape
Tests run: 1, Failures: 0, Errors: 0, Skipped: 0, Time elapsed: 0.017 sec - in org.apache.poi.xslf.usermodel.TestXSLFFreeformShape
Running org.apache.poi.xslf.usermodel.TestXSLFConnectorShape
Tests run: 2, Failures: 0, Errors: 0, Skipped: 0, Time elapsed: 0.035 sec - in org.apache.poi.xslf.usermodel.TestXSLFConnectorShape
Running org.apache.poi.xslf.usermodel.TestXSLFSimpleShape
Tests run: 8, Failures: 0, Errors: 0, Skipped: 0, Time elapsed: 2.082 sec - in org.apache.poi.xslf.usermodel.TestXSLFSimpleShape
Running org.apache.poi.xslf.usermodel.TestXSLFTheme
Tests run: 1, Failures: 0, Errors: 0, Skipped: 0, Time elapsed: 0.094 sec - in org.apache.poi.xslf.usermodel.TestXSLFTheme
Running org.apache.poi.xslf.usermodel.TestXSLFPictureShape
Tests run: 6, Failures: 0, Errors: 0, Skipped: 0, Time elapsed: 0.193 sec - in org.apache.poi.xslf.usermodel.TestXSLFPictureShape
Running org.apache.poi.xslf.extractor.TestXSLFPowerPointExtractor
Tests run: 5, Failures: 0, Errors: 0, Skipped: 0, Time elapsed: 0.155 sec - in org.apache.poi.xslf.extractor.TestXSLFPowerPointExtractor
Running org.apache.poi.xslf.geom.TestFormulaParser
Tests run: 1, Failures: 0, Errors: 0, Skipped: 0, Time elapsed: 0 sec - in org.apache.poi.xslf.geom.TestFormulaParser
Running org.apache.poi.dev.TestOOXMLLister
Tests run: 2, Failures: 0, Errors: 0, Skipped: 0, Time elapsed: 0.007 sec - in org.apache.poi.dev.TestOOXMLLister
Running org.apache.poi.dev.TestOOXMLPrettyPrint
Tests run: 1, Failures: 0, Errors: 0, Skipped: 0, Time elapsed: 0.021 sec - in org.apache.poi.dev.TestOOXMLPrettyPrint
Running org.apache.poi.dev.TestRecordGenerator
Tests run: 3, Failures: 0, Errors: 0, Skipped: 3, Time elapsed: 0 sec - in org.apache.poi.dev.TestRecordGenerator
Running org.apache.poi.ss.formula.TestStructuredReferences
Tests run: 2, Failures: 0, Errors: 0, Skipped: 0, Time elapsed: 0.01 sec - in org.apache.poi.ss.formula.TestStructuredReferences
Running org.apache.poi.ss.formula.TestFormulaParser
Tests run: 9, Failures: 0, Errors: 0, Skipped: 0, Time elapsed: 0.028 sec - in org.apache.poi.ss.formula.TestFormulaParser
Running org.apache.poi.ss.formula.eval.TestXSSFCircularReferences
Tests run: 4, Failures: 0, Errors: 0, Skipped: 0, Time elapsed: 0.006 sec - in org.apache.poi.ss.formula.eval.TestXSSFCircularReferences
Running org.apache.poi.ss.formula.functions.TestProper
Tests run: 4, Failures: 0, Errors: 0, Skipped: 0, Time elapsed: 1.271 sec - in org.apache.poi.ss.formula.functions.TestProper
Running org.apache.poi.ss.formula.functions.TestSumifsXSSF
Tests run: 1, Failures: 0, Errors: 0, Skipped: 0, Time elapsed: 0.017 sec - in org.apache.poi.ss.formula.functions.TestSumifsXSSF
Running org.apache.poi.ss.util.TestXSSFCellUtil
Tests run: 14, Failures: 0, Errors: 0, Skipped: 0, Time elapsed: 0.04 sec - in org.apache.poi.ss.util.TestXSSFCellUtil
Running org.apache.poi.ss.util.TestSXSSFCellUtil
Tests run: 14, Failures: 0, Errors: 0, Skipped: 0, Time elapsed: 0.04 sec - in org.apache.poi.ss.util.TestSXSSFCellUtil
Running org.apache.poi.ss.util.TestXSSFPropertyTemplate
Tests run: 2, Failures: 0, Errors: 0, Skipped: 0, Time elapsed: 0.046 sec - in org.apache.poi.ss.util.TestXSSFPropertyTemplate
Running org.apache.poi.ss.format.TestCellFormatPart
Tests run: 6, Failures: 0, Errors: 0, Skipped: 0, Time elapsed: 0.18 sec - in org.apache.poi.ss.format.TestCellFormatPart
Running org.apache.poi.ss.TestWorkbookFactory
Tests run: 8, Failures: 0, Errors: 0, Skipped: 0, Time elapsed: 0.192 sec - in org.apache.poi.ss.TestWorkbookFactory
Running org.apache.poi.ss.usermodel.TestEmbedOLEPackage
Tests run: 2, Failures: 0, Errors: 0, Skipped: 0, Time elapsed: 0.037 sec - in org.apache.poi.ss.usermodel.TestEmbedOLEPackage
Running org.apache.poi.ss.usermodel.TestXSSFBorderStyle
Tests run: 1, Failures: 0, Errors: 0, Skipped: 0, Time elapsed: 0.004 sec - in org.apache.poi.ss.usermodel.TestXSSFBorderStyle
Running org.apache.poi.ss.usermodel.ConditionalFormattingEvalTest
Tests run: 2, Failures: 0, Errors: 0, Skipped: 0, Time elapsed: 0.158 sec - in org.apache.poi.ss.usermodel.ConditionalFormattingEvalTest
Running org.apache.poi.ss.extractor.TestEmbeddedExtractor
Tests run: 3, Failures: 0, Errors: 0, Skipped: 0, Time elapsed: 0.148 sec - in org.apache.poi.ss.extractor.TestEmbeddedExtractor
Running org.apache.poi.TestEmbeded
Tests run: 3, Failures: 0, Errors: 0, Skipped: 0, Time elapsed: 0.031 sec - in org.apache.poi.TestEmbeded
Running org.apache.poi.extractor.TestExtractorFactory
Tests run: 11, Failures: 0, Errors: 0, Skipped: 0, Time elapsed: 0.448 sec - in org.apache.poi.extractor.TestExtractorFactory
Running org.apache.poi.TestPOIXMLProperties
Tests run: 6, Failures: 0, Errors: 0, Skipped: 0, Time elapsed: 0.051 sec - in org.apache.poi.TestPOIXMLProperties

Results :

Tests run: 2317, Failures: 0, Errors: 0, Skipped: 157

[INFO]
[INFO] --- maven-jar-plugin:2.4:jar (default-jar) @ poi-ooxml ---
[INFO] Building jar: <https://builds.apache.org/job/POI-DSL-Maven/ws/sonar/ooxml/target/poi-ooxml-4.0.0-SNAPSHOT.jar>
[INFO]                                                                        
[INFO] ------------------------------------------------------------------------
[INFO] Building Apache POI ExcelAnt package 4.0.0-SNAPSHOT
[INFO] ------------------------------------------------------------------------
[INFO]
[INFO] --- maven-resources-plugin:3.0.1:copy-resources (copy-sources) @ poi-excelant ---
[INFO] Using 'UTF-8' encoding to copy filtered resources.
[INFO] Copying 14 resources
[INFO]
[INFO] --- maven-resources-plugin:3.0.1:copy-resources (copy-resources) @ poi-excelant ---
[INFO] Using 'UTF-8' encoding to copy filtered resources.
[INFO] Copying 1 resource
[INFO]
[INFO] --- maven-resources-plugin:3.0.1:resources (default-resources) @ poi-excelant ---
[INFO] Using 'UTF-8' encoding to copy filtered resources.
[INFO] Copying 1 resource
[INFO]
[INFO] --- maven-compiler-plugin:3.5.1:compile (default-compile) @ poi-excelant ---
[INFO] Changes detected - recompiling the module!
[INFO] Compiling 14 source files to <https://builds.apache.org/job/POI-DSL-Maven/ws/sonar/excelant/target/classes>
[INFO]
[INFO] --- maven-resources-plugin:3.0.1:copy-resources (copy-tests) @ poi-excelant ---
[INFO] Using 'UTF-8' encoding to copy filtered resources.
[INFO] Copying 14 resources
[INFO]
[INFO] --- maven-resources-plugin:3.0.1:testResources (default-testResources) @ poi-excelant ---
[INFO] Using 'UTF-8' encoding to copy filtered resources.
[INFO] skip non existing resourceDirectory <https://builds.apache.org/job/POI-DSL-Maven/ws/sonar/excelant/src/test/resources>
[INFO]
[INFO] --- maven-compiler-plugin:3.5.1:testCompile (default-testCompile) @ poi-excelant ---
[INFO] Changes detected - recompiling the module!
[INFO] Compiling 13 source files to <https://builds.apache.org/job/POI-DSL-Maven/ws/sonar/excelant/target/test-classes>
[INFO]
[INFO] --- maven-surefire-plugin:2.19.1:test (default-test) @ poi-excelant ---

-------------------------------------------------------
 T E S T S
-------------------------------------------------------
Running org.apache.poi.ss.excelant.util.TestExcelAntWorkbookUtilFactory
Tests run: 2, Failures: 0, Errors: 0, Skipped: 0, Time elapsed: 0.379 sec - in org.apache.poi.ss.excelant.util.TestExcelAntWorkbookUtilFactory
Running org.apache.poi.ss.excelant.util.TestExcelAntWorkbookUtil
ExcelAntEvaluationResult [evaluationCompletedWithError=true, didPass=false, returnValue=0.0, errorMessage=Evaluation failed due to an evaluation error of 42 which is #N/A, actualDelta=0.0, cellName='ErrorCell'!A1]
Tests run: 23, Failures: 0, Errors: 0, Skipped: 0, Time elapsed: 1.108 sec - in org.apache.poi.ss.excelant.util.TestExcelAntWorkbookUtil
Running org.apache.poi.ss.excelant.util.TestExcelAntEvaluationResult
Tests run: 4, Failures: 0, Errors: 0, Skipped: 0, Time elapsed: 0.001 sec - in org.apache.poi.ss.excelant.util.TestExcelAntEvaluationResult
Running org.apache.poi.ss.excelant.TestExcelAntPrecision
Tests run: 1, Failures: 0, Errors: 0, Skipped: 0, Time elapsed: 0 sec - in org.apache.poi.ss.excelant.TestExcelAntPrecision
Running org.apache.poi.ss.excelant.TestExcelAntSetDoubleCell
Tests run: 1, Failures: 0, Errors: 0, Skipped: 0, Time elapsed: 0 sec - in org.apache.poi.ss.excelant.TestExcelAntSetDoubleCell
Running org.apache.poi.ss.excelant.TestExcelAntSet
Tests run: 2, Failures: 0, Errors: 0, Skipped: 0, Time elapsed: 0 sec - in org.apache.poi.ss.excelant.TestExcelAntSet
Running org.apache.poi.ss.excelant.TestBuildFile
Tests run: 14, Failures: 0, Errors: 0, Skipped: 0, Time elapsed: 0.489 sec - in org.apache.poi.ss.excelant.TestBuildFile
Running org.apache.poi.ss.examples.formula.TestExcelAntUserDefinedFunction
Tests run: 2, Failures: 0, Errors: 0, Skipped: 0, Time elapsed: 0.001 sec - in org.apache.poi.ss.examples.formula.TestExcelAntUserDefinedFunction

Results :

Tests run: 49, Failures: 0, Errors: 0, Skipped: 0

[INFO]
[INFO] --- maven-jar-plugin:2.4:jar (default-jar) @ poi-excelant ---
[INFO] Building jar: <https://builds.apache.org/job/POI-DSL-Maven/ws/sonar/excelant/target/poi-excelant-4.0.0-SNAPSHOT.jar>
[INFO]                                                                        
[INFO] ------------------------------------------------------------------------
[INFO] Building Apache POI Examples package 4.0.0-SNAPSHOT
[INFO] ------------------------------------------------------------------------
[INFO]
[INFO] --- maven-resources-plugin:3.0.1:copy-resources (copy-sources) @ poi-examples ---
[INFO] Using 'UTF-8' encoding to copy filtered resources.
[INFO] Copying 157 resources
[INFO]
[INFO] --- maven-resources-plugin:3.0.1:resources (default-resources) @ poi-examples ---
[INFO] Using 'UTF-8' encoding to copy filtered resources.
[INFO] skip non existing resourceDirectory <https://builds.apache.org/job/POI-DSL-Maven/ws/sonar/examples/src/main/resources>
[INFO]
[INFO] --- maven-compiler-plugin:3.5.1:compile (default-compile) @ poi-examples ---
[INFO] Changes detected - recompiling the module!
[INFO] Compiling 149 source files to <https://builds.apache.org/job/POI-DSL-Maven/ws/sonar/examples/target/classes>
[INFO] <https://builds.apache.org/job/POI-DSL-Maven/ws/sonar/examples/src/main/java/org/apache/poi/ss/examples/ExcelComparator.java>: <https://builds.apache.org/job/POI-DSL-Maven/ws/sonar/examples/src/main/java/org/apache/poi/ss/examples/ExcelComparator.java> uses or overrides a deprecated API.
[INFO] <https://builds.apache.org/job/POI-DSL-Maven/ws/sonar/examples/src/main/java/org/apache/poi/ss/examples/ExcelComparator.java>: Recompile with -Xlint:deprecation for details.
[INFO] <https://builds.apache.org/job/POI-DSL-Maven/ws/sonar/examples/src/main/java/org/apache/poi/hssf/view/SVRowHeader.java>: <https://builds.apache.org/job/POI-DSL-Maven/ws/sonar/examples/src/main/java/org/apache/poi/hssf/view/SVRowHeader.java> uses unchecked or unsafe operations.
[INFO] <https://builds.apache.org/job/POI-DSL-Maven/ws/sonar/examples/src/main/java/org/apache/poi/hssf/view/SVRowHeader.java>: Recompile with -Xlint:unchecked for details.
[INFO] -------------------------------------------------------------
[ERROR] COMPILATION ERROR :
[INFO] -------------------------------------------------------------
[ERROR] <https://builds.apache.org/job/POI-DSL-Maven/ws/sonar/examples/src/main/java/org/apache/poi/xssf/eventusermodel/XLSX2CSV.java>:[72,13] org.apache.poi.xssf.eventusermodel.XLSX2CSV.SheetToCSV is not abstract and does not override abstract method endSheet() in org.apache.poi.xssf.eventusermodel.XSSFSheetXMLHandler.SheetContentsHandler
[ERROR] <https://builds.apache.org/job/POI-DSL-Maven/ws/sonar/examples/src/main/java/org/apache/poi/xssf/streaming/examples/HybridStreaming.java>:[61,43] <anonymous org.apache.poi.xssf.streaming.examples.HybridStreaming$2> is not abstract and does not override abstract method endSheet() in org.apache.poi.xssf.eventusermodel.XSSFSheetXMLHandler.SheetContentsHandler
[INFO] 2 errors
[INFO] -------------------------------------------------------------
[INFO] ------------------------------------------------------------------------
[INFO] Reactor Summary:
[INFO]
[INFO] Apache POI - the Java API for Microsoft Documents . SUCCESS [  0.002 s]
[INFO] Apache POI Main package ........................... SUCCESS [01:15 min]
[INFO] Apache POI Scratchpad package ..................... SUCCESS [ 15.310 s]
[INFO] Apache POI - Openxmlformats Schema package ........ SUCCESS [01:01 min]
[INFO] Apache POI - Openxmlformats Encryption Schema package  SUCCESS [  0.481 s]
[INFO] Apache POI - Openxmlformats Security-Schema package  SUCCESS [  7.243 s]
[INFO] Apache POI OOXML package .......................... SUCCESS [01:37 min]
[INFO] Apache POI ExcelAnt package ....................... SUCCESS [  3.020 s]
[INFO] Apache POI Examples package ....................... FAILURE [  0.641 s]
[INFO] ------------------------------------------------------------------------
[INFO] BUILD FAILURE
[INFO] ------------------------------------------------------------------------
[INFO] Total time: 04:20 min
[INFO] Finished at: 2017-09-23T08:08:28+00:00
[INFO] Final Memory: 61M/904M
[INFO] ------------------------------------------------------------------------
[ERROR] Failed to execute goal org.apache.maven.plugins:maven-compiler-plugin:3.5.1:compile (default-compile) on project poi-examples: Compilation failure: Compilation failure:
[ERROR] <https://builds.apache.org/job/POI-DSL-Maven/ws/sonar/examples/src/main/java/org/apache/poi/xssf/eventusermodel/XLSX2CSV.java>:[72,13] org.apache.poi.xssf.eventusermodel.XLSX2CSV.SheetToCSV is not abstract and does not override abstract method endSheet() in org.apache.poi.xssf.eventusermodel.XSSFSheetXMLHandler.SheetContentsHandler
[ERROR] <https://builds.apache.org/job/POI-DSL-Maven/ws/sonar/examples/src/main/java/org/apache/poi/xssf/streaming/examples/HybridStreaming.java>:[61,43] <anonymous org.apache.poi.xssf.streaming.examples.HybridStreaming$2> is not abstract and does not override abstract method endSheet() in org.apache.poi.xssf.eventusermodel.XSSFSheetXMLHandler.SheetContentsHandler
[ERROR] -> [Help 1]
[ERROR]
[ERROR] To see the full stack trace of the errors, re-run Maven with the -e switch.
[ERROR] Re-run Maven using the -X switch to enable full debug logging.
[ERROR]
[ERROR] For more information about the errors and possible solutions, please read the following articles:
[ERROR] [Help 1] http://cwiki.apache.org/confluence/display/MAVEN/MojoFailureException
[ERROR]
[ERROR] After correcting the problems, you can resume the build with the command
[ERROR]   mvn <goals> -rf :poi-examples
Build step 'Invoke top-level Maven targets' marked build as failure

---------------------------------------------------------------------
To unsubscribe, e-mail: [hidden email]
For additional commands, e-mail: [hidden email]

Reply | Threaded
Open this post in threaded view
|

Jenkins build is back to normal : POI-DSL-Maven #354

Apache Jenkins Server
See <https://builds.apache.org/job/POI-DSL-Maven/354/display/redirect?page=changes>


---------------------------------------------------------------------
To unsubscribe, e-mail: [hidden email]
For additional commands, e-mail: [hidden email]