Build failed in Jenkins: POI-DSL-Maven #288

classic Classic list List threaded Threaded
7 messages Options
Reply | Threaded
Open this post in threaded view
|  
Report Content as Inappropriate

Build failed in Jenkins: POI-DSL-Maven #288

Apache Jenkins Server
See <https://builds.apache.org/job/POI-DSL-Maven/288/display/redirect?page=changes>

Changes:

[fanningpj] [Bug-61354] fix issue with extracting text from Word docs. This closes #66

------------------------------------------
[...truncated 124.38 KB...]
Running org.apache.poi.ss.formula.atp.TestWorkdayFunction
Tests run: 12, Failures: 0, Errors: 0, Skipped: 0, Time elapsed: 0.02 sec - in org.apache.poi.ss.formula.atp.TestWorkdayFunction
Running org.apache.poi.ss.formula.atp.TestIfError
Tests run: 1, Failures: 0, Errors: 0, Skipped: 0, Time elapsed: 0.003 sec - in org.apache.poi.ss.formula.atp.TestIfError
Running org.apache.poi.ss.formula.atp.TestWorkdayCalculator
Tests run: 17, Failures: 0, Errors: 0, Skipped: 0, Time elapsed: 0.023 sec - in org.apache.poi.ss.formula.atp.TestWorkdayCalculator
Running org.apache.poi.ss.formula.atp.TestYearFracCalculatorFromSpreadsheet
Tests run: 1, Failures: 0, Errors: 0, Skipped: 0, Time elapsed: 0.04 sec - in org.apache.poi.ss.formula.atp.TestYearFracCalculatorFromSpreadsheet
Running org.apache.poi.ss.formula.atp.TestYearFracCalculator
Tests run: 1, Failures: 0, Errors: 0, Skipped: 0, Time elapsed: 0.002 sec - in org.apache.poi.ss.formula.atp.TestYearFracCalculator
Running org.apache.poi.ss.formula.atp.TestDateParser
Tests run: 5, Failures: 0, Errors: 0, Skipped: 0, Time elapsed: 0.003 sec - in org.apache.poi.ss.formula.atp.TestDateParser
Running org.apache.poi.ss.formula.atp.TestRandBetween
Tests run: 6, Failures: 0, Errors: 0, Skipped: 0, Time elapsed: 0.019 sec - in org.apache.poi.ss.formula.atp.TestRandBetween
Running org.apache.poi.ss.formula.TestPlainCellCache
Tests run: 1, Failures: 0, Errors: 0, Skipped: 0, Time elapsed: 1.411 sec - in org.apache.poi.ss.formula.TestPlainCellCache
Running org.apache.poi.ss.formula.constant.TestConstantValueParser
Tests run: 3, Failures: 0, Errors: 0, Skipped: 0, Time elapsed: 0 sec - in org.apache.poi.ss.formula.constant.TestConstantValueParser
Running org.apache.poi.ss.formula.udf.TestDefaultUDFFinder
Tests run: 1, Failures: 0, Errors: 0, Skipped: 0, Time elapsed: 0 sec - in org.apache.poi.ss.formula.udf.TestDefaultUDFFinder
Running org.apache.poi.ss.formula.udf.TestAggregatingUDFFinder
Tests run: 2, Failures: 0, Errors: 0, Skipped: 0, Time elapsed: 0 sec - in org.apache.poi.ss.formula.udf.TestAggregatingUDFFinder
Running org.apache.poi.ss.formula.TestFormulaShifter
Tests run: 11, Failures: 0, Errors: 0, Skipped: 0, Time elapsed: 0 sec - in org.apache.poi.ss.formula.TestFormulaShifter
Running org.apache.poi.ss.formula.TestMissingWorkbook
Tests run: 3, Failures: 0, Errors: 0, Skipped: 0, Time elapsed: 0.005 sec - in org.apache.poi.ss.formula.TestMissingWorkbook
Running org.apache.poi.ss.formula.TestWorkbookEvaluator
Tests run: 22, Failures: 0, Errors: 0, Skipped: 4, Time elapsed: 0.062 sec - in org.apache.poi.ss.formula.TestWorkbookEvaluator
Running org.apache.poi.ss.formula.TestEvaluationCache
Tests run: 8, Failures: 0, Errors: 0, Skipped: 0, Time elapsed: 9.83 sec - in org.apache.poi.ss.formula.TestEvaluationCache
Running org.apache.poi.ss.formula.ptg.TestArrayPtg
Tests run: 5, Failures: 0, Errors: 0, Skipped: 0, Time elapsed: 0.001 sec - in org.apache.poi.ss.formula.ptg.TestArrayPtg
Running org.apache.poi.ss.formula.ptg.TestIntersectionPtg
Tests run: 1, Failures: 0, Errors: 0, Skipped: 0, Time elapsed: 0 sec - in org.apache.poi.ss.formula.ptg.TestIntersectionPtg
Running org.apache.poi.ss.formula.ptg.TestExternalNameReference
Tests run: 3, Failures: 0, Errors: 0, Skipped: 0, Time elapsed: 0.009 sec - in org.apache.poi.ss.formula.ptg.TestExternalNameReference
Running org.apache.poi.ss.formula.ptg.TestExternalFunctionFormulas
Tests run: 3, Failures: 0, Errors: 0, Skipped: 0, Time elapsed: 0.004 sec - in org.apache.poi.ss.formula.ptg.TestExternalFunctionFormulas
Running org.apache.poi.ss.formula.ptg.TestFuncVarPtg
Tests run: 1, Failures: 0, Errors: 0, Skipped: 0, Time elapsed: 0 sec - in org.apache.poi.ss.formula.ptg.TestFuncVarPtg
Running org.apache.poi.ss.formula.ptg.TestAbstractFunctionPtg
Tests run: 3, Failures: 0, Errors: 0, Skipped: 0, Time elapsed: 0 sec - in org.apache.poi.ss.formula.ptg.TestAbstractFunctionPtg
Running org.apache.poi.ss.formula.ptg.TestErrPtg
Tests run: 1, Failures: 0, Errors: 0, Skipped: 0, Time elapsed: 0 sec - in org.apache.poi.ss.formula.ptg.TestErrPtg
Running org.apache.poi.ss.formula.ptg.TestFuncPtg
Tests run: 2, Failures: 0, Errors: 0, Skipped: 0, Time elapsed: 0.001 sec - in org.apache.poi.ss.formula.ptg.TestFuncPtg
Running org.apache.poi.ss.formula.ptg.TestRangePtg
Tests run: 1, Failures: 0, Errors: 0, Skipped: 0, Time elapsed: 0 sec - in org.apache.poi.ss.formula.ptg.TestRangePtg
Running org.apache.poi.ss.formula.ptg.TestPercentPtg
Tests run: 1, Failures: 0, Errors: 0, Skipped: 0, Time elapsed: 0 sec - in org.apache.poi.ss.formula.ptg.TestPercentPtg
Running org.apache.poi.ss.formula.ptg.TestAreaPtg
Tests run: 5, Failures: 0, Errors: 0, Skipped: 0, Time elapsed: 0 sec - in org.apache.poi.ss.formula.ptg.TestAreaPtg
Running org.apache.poi.ss.formula.ptg.TestUnionPtg
Tests run: 1, Failures: 0, Errors: 0, Skipped: 0, Time elapsed: 0 sec - in org.apache.poi.ss.formula.ptg.TestUnionPtg
Running org.apache.poi.ss.formula.ptg.TestReferencePtg
Tests run: 4, Failures: 0, Errors: 0, Skipped: 0, Time elapsed: 0.01 sec - in org.apache.poi.ss.formula.ptg.TestReferencePtg
Running org.apache.poi.ss.formula.ptg.TestAttrPtg
Tests run: 1, Failures: 0, Errors: 0, Skipped: 0, Time elapsed: 0.001 sec - in org.apache.poi.ss.formula.ptg.TestAttrPtg
Running org.apache.poi.ss.formula.ptg.TestRef3DPtg
Tests run: 1, Failures: 0, Errors: 0, Skipped: 0, Time elapsed: 0.001 sec - in org.apache.poi.ss.formula.ptg.TestRef3DPtg
Running org.apache.poi.ss.formula.ptg.TestAreaErrPtg
Tests run: 1, Failures: 0, Errors: 0, Skipped: 0, Time elapsed: 0 sec - in org.apache.poi.ss.formula.ptg.TestAreaErrPtg
Running org.apache.poi.ss.formula.ptg.TestArea3DPtg
Tests run: 1, Failures: 0, Errors: 0, Skipped: 0, Time elapsed: 0.001 sec - in org.apache.poi.ss.formula.ptg.TestArea3DPtg
Running org.apache.poi.ss.usermodel.TestFractionFormat
Tests run: 2, Failures: 0, Errors: 0, Skipped: 0, Time elapsed: 0.312 sec - in org.apache.poi.ss.usermodel.TestFractionFormat
Running org.apache.poi.ss.usermodel.charts.TestDataSources
Tests run: 6, Failures: 0, Errors: 0, Skipped: 0, Time elapsed: 0.007 sec - in org.apache.poi.ss.usermodel.charts.TestDataSources
Running org.apache.poi.ss.usermodel.TestExcelStyleDateFormatter
Tests run: 4, Failures: 0, Errors: 0, Skipped: 0, Time elapsed: 0.026 sec - in org.apache.poi.ss.usermodel.TestExcelStyleDateFormatter
Running org.apache.poi.ss.usermodel.TestDateUtil
Tests run: 5, Failures: 0, Errors: 0, Skipped: 0, Time elapsed: 0 sec - in org.apache.poi.ss.usermodel.TestDateUtil
Running org.apache.poi.ss.usermodel.TestIndexedColors
Tests run: 3, Failures: 0, Errors: 0, Skipped: 0, Time elapsed: 0 sec - in org.apache.poi.ss.usermodel.TestIndexedColors
Running org.apache.poi.ss.usermodel.TestDataFormatter
Tests run: 33, Failures: 0, Errors: 0, Skipped: 1, Time elapsed: 0.08 sec - in org.apache.poi.ss.usermodel.TestDataFormatter
Running org.apache.poi.ss.usermodel.TestHSSFBorderStyle
Tests run: 1, Failures: 0, Errors: 0, Skipped: 0, Time elapsed: 0 sec - in org.apache.poi.ss.usermodel.TestHSSFBorderStyle
Running org.apache.poi.ss.TestSpreadsheetVersion
Tests run: 2, Failures: 0, Errors: 0, Skipped: 0, Time elapsed: 0 sec - in org.apache.poi.ss.TestSpreadsheetVersion
Running org.apache.poi.ss.util.TestWorkbookUtil
Tests run: 1, Failures: 0, Errors: 0, Skipped: 0, Time elapsed: 0 sec - in org.apache.poi.ss.util.TestWorkbookUtil
Running org.apache.poi.ss.util.TestCellAddress
Tests run: 6, Failures: 0, Errors: 0, Skipped: 0, Time elapsed: 0 sec - in org.apache.poi.ss.util.TestCellAddress
Running org.apache.poi.ss.util.TestSheetBuilder
Tests run: 3, Failures: 0, Errors: 0, Skipped: 0, Time elapsed: 0 sec - in org.apache.poi.ss.util.TestSheetBuilder
Running org.apache.poi.ss.util.TestSheetUtil
Tests run: 7, Failures: 0, Errors: 0, Skipped: 0, Time elapsed: 0 sec - in org.apache.poi.ss.util.TestSheetUtil
Running org.apache.poi.ss.util.TestExpandedDouble
Tests run: 3, Failures: 0, Errors: 0, Skipped: 0, Time elapsed: 0.006 sec - in org.apache.poi.ss.util.TestExpandedDouble
Running org.apache.poi.ss.util.TestAreaReference
Tests run: 2, Failures: 0, Errors: 0, Skipped: 0, Time elapsed: 0 sec - in org.apache.poi.ss.util.TestAreaReference
Running org.apache.poi.ss.util.TestPropertyTemplate
Tests run: 8, Failures: 0, Errors: 0, Skipped: 0, Time elapsed: 0.033 sec - in org.apache.poi.ss.util.TestPropertyTemplate
Running org.apache.poi.ss.util.TestCellRangeAddress
Tests run: 13, Failures: 0, Errors: 0, Skipped: 0, Time elapsed: 0.001 sec - in org.apache.poi.ss.util.TestCellRangeAddress
Running org.apache.poi.ss.util.TestDateFormatConverter
Open /tmp/poifiles/LocaleDatesDefault399008932216554070.xlsx in Excel
Open /tmp/poifiles/LocaleDatesShort1551587510444326622.xlsx in Excel
Open /tmp/poifiles/LocaleDatesMedium4983196451899507445.xlsx in Excel
Open /tmp/poifiles/LocaleDatesLong5354913879157894206.xlsx in Excel
Open /tmp/poifiles/LocaleDatesFull4015971169479143426.xlsx in Excel
Open /tmp/poifiles/LocaleDateTimesDefault2722949065503327039.xlsx in Excel
Open /tmp/poifiles/LocaleDateTimesShort2789065049027525733.xlsx in Excel
Open /tmp/poifiles/LocaleDateTimesMedium8665735376174646255.xlsx in Excel
Open /tmp/poifiles/LocaleDateTimesLong4776926297664030825.xlsx in Excel
Open /tmp/poifiles/LocaleDateTimesFull4067937941346785298.xlsx in Excel
Open /tmp/poifiles/LocaleTimesDefault1435480724413133681.xlsx in Excel
Open /tmp/poifiles/LocaleTimesShort618511362022862283.xlsx in Excel
Open /tmp/poifiles/LocaleTimesMedium8560024476439471621.xlsx in Excel
Open /tmp/poifiles/LocaleTimesLong4940215581643413701.xlsx in Excel
Open /tmp/poifiles/LocaleTimesFull2408295790906643011.xlsx in Excel
Tests run: 2, Failures: 0, Errors: 0, Skipped: 0, Time elapsed: 1.885 sec - in org.apache.poi.ss.util.TestDateFormatConverter
Running org.apache.poi.ss.util.TestNumberToTextConverter
Tests run: 2, Failures: 0, Errors: 0, Skipped: 0, Time elapsed: 0.01 sec - in org.apache.poi.ss.util.TestNumberToTextConverter
Running org.apache.poi.ss.util.cellwalk.TestCellWalk
Tests run: 1, Failures: 0, Errors: 0, Skipped: 0, Time elapsed: 0.001 sec - in org.apache.poi.ss.util.cellwalk.TestCellWalk
Running org.apache.poi.ss.util.TestNumberComparer
Tests run: 4, Failures: 0, Errors: 0, Skipped: 0, Time elapsed: 0.185 sec - in org.apache.poi.ss.util.TestNumberComparer
Running org.apache.poi.ss.util.TestHSSFCellUtil
setCellStyleProps start
setCellStyleProps nearing end
Tests run: 14, Failures: 0, Errors: 0, Skipped: 0, Time elapsed: 0.015 sec - in org.apache.poi.ss.util.TestHSSFCellUtil
Running org.apache.poi.ss.util.TestRegionUtil
Tests run: 10, Failures: 0, Errors: 0, Skipped: 0, Time elapsed: 0.025 sec - in org.apache.poi.ss.util.TestRegionUtil
Running org.apache.poi.ss.util.TestCellReference
Tests run: 25, Failures: 0, Errors: 0, Skipped: 0, Time elapsed: 0.005 sec - in org.apache.poi.ss.util.TestCellReference
Running org.apache.poi.ddf.TestEscherDgRecord
Tests run: 3, Failures: 0, Errors: 0, Skipped: 0, Time elapsed: 0 sec - in org.apache.poi.ddf.TestEscherDgRecord
Running org.apache.poi.ddf.TestEscherDggRecord
Tests run: 4, Failures: 0, Errors: 0, Skipped: 0, Time elapsed: 0 sec - in org.apache.poi.ddf.TestEscherDggRecord
Running org.apache.poi.ddf.TestEscherBlipRecord
Tests run: 4, Failures: 0, Errors: 0, Skipped: 0, Time elapsed: 0.042 sec - in org.apache.poi.ddf.TestEscherBlipRecord
Running org.apache.poi.ddf.TestEscherSpgrRecord
Tests run: 3, Failures: 0, Errors: 0, Skipped: 0, Time elapsed: 0 sec - in org.apache.poi.ddf.TestEscherSpgrRecord
Running org.apache.poi.ddf.TestEscherPropertyFactory
Tests run: 1, Failures: 0, Errors: 0, Skipped: 0, Time elapsed: 0 sec - in org.apache.poi.ddf.TestEscherPropertyFactory
Running org.apache.poi.ddf.TestEscherBoolProperty
Tests run: 1, Failures: 0, Errors: 0, Skipped: 0, Time elapsed: 0.001 sec - in org.apache.poi.ddf.TestEscherBoolProperty
Running org.apache.poi.ddf.TestEscherProperty
Tests run: 1, Failures: 0, Errors: 0, Skipped: 0, Time elapsed: 0 sec - in org.apache.poi.ddf.TestEscherProperty
Running org.apache.poi.ddf.TestEscherOptRecord
Tests run: 6, Failures: 0, Errors: 0, Skipped: 0, Time elapsed: 0.001 sec - in org.apache.poi.ddf.TestEscherOptRecord
Running org.apache.poi.ddf.TestUnknownEscherRecord
Tests run: 3, Failures: 0, Errors: 0, Skipped: 0, Time elapsed: 0 sec - in org.apache.poi.ddf.TestUnknownEscherRecord
Running org.apache.poi.ddf.TestEscherClientDataRecord
Tests run: 3, Failures: 0, Errors: 0, Skipped: 0, Time elapsed: 0 sec - in org.apache.poi.ddf.TestEscherClientDataRecord
Running org.apache.poi.ddf.TestEscherSpRecord
Tests run: 3, Failures: 0, Errors: 0, Skipped: 0, Time elapsed: 0.001 sec - in org.apache.poi.ddf.TestEscherSpRecord
Running org.apache.poi.ddf.TestEscherClientAnchorRecord
Tests run: 3, Failures: 0, Errors: 0, Skipped: 0, Time elapsed: 0.001 sec - in org.apache.poi.ddf.TestEscherClientAnchorRecord
Running org.apache.poi.ddf.TestEscherContainerRecord
Tests run: 6, Failures: 0, Errors: 0, Skipped: 0, Time elapsed: 0 sec - in org.apache.poi.ddf.TestEscherContainerRecord
Running org.apache.poi.ddf.TestEscherBSERecord
Tests run: 3, Failures: 0, Errors: 0, Skipped: 0, Time elapsed: 0 sec - in org.apache.poi.ddf.TestEscherBSERecord
Running org.apache.poi.ddf.TestEscherDump
Tests run: 3, Failures: 0, Errors: 0, Skipped: 0, Time elapsed: 0.023 sec - in org.apache.poi.ddf.TestEscherDump
Running org.apache.poi.ddf.TestEscherSplitMenuColorsRecord
Tests run: 3, Failures: 0, Errors: 0, Skipped: 0, Time elapsed: 0 sec - in org.apache.poi.ddf.TestEscherSplitMenuColorsRecord
Running org.apache.poi.ddf.TestEscherChildAnchorRecord
Tests run: 3, Failures: 0, Errors: 0, Skipped: 0, Time elapsed: 0.001 sec - in org.apache.poi.ddf.TestEscherChildAnchorRecord
Running org.apache.poi.TestPOITestCase
Tests run: 10, Failures: 0, Errors: 0, Skipped: 3, Time elapsed: 0 sec - in org.apache.poi.TestPOITestCase
Running org.apache.poi.sl.draw.geom.TestPresetGeometries
URL: <https://builds.apache.org/job/POI-DSL-Maven/ws/sonar/main/target/classes/org/apache/poi/sl/draw/geom/presetShapeDefinitions.xml>
Tests run: 2, Failures: 0, Errors: 0, Skipped: 0, Time elapsed: 2.516 sec - in org.apache.poi.sl.draw.geom.TestPresetGeometries
Running org.apache.poi.util.TestStaxHelper
Tests run: 3, Failures: 0, Errors: 0, Skipped: 0, Time elapsed: 0.003 sec - in org.apache.poi.util.TestStaxHelper
Running org.apache.poi.util.TestIntList
Tests run: 18, Failures: 0, Errors: 0, Skipped: 0, Time elapsed: 0.056 sec - in org.apache.poi.util.TestIntList
Running org.apache.poi.util.TestHexDump
00000000 74 65 73 74 73 74 72 69 6E 67                   teststring

Tests run: 10, Failures: 0, Errors: 0, Skipped: 0, Time elapsed: 0.019 sec - in org.apache.poi.util.TestHexDump
Running org.apache.poi.util.TestByteField
Tests run: 5, Failures: 0, Errors: 0, Skipped: 0, Time elapsed: 0 sec - in org.apache.poi.util.TestByteField
Running org.apache.poi.util.TestLittleEndian
Tests run: 14, Failures: 0, Errors: 0, Skipped: 0, Time elapsed: 0.001 sec - in org.apache.poi.util.TestLittleEndian
Running org.apache.poi.util.TestPOILogFactory
Tests run: 1, Failures: 0, Errors: 0, Skipped: 0, Time elapsed: 0 sec - in org.apache.poi.util.TestPOILogFactory
Running org.apache.poi.util.TestStringUtil
Tests run: 8, Failures: 0, Errors: 0, Skipped: 0, Time elapsed: 0 sec - in org.apache.poi.util.TestStringUtil
Running org.apache.poi.util.TestTempFile
Tests run: 4, Failures: 0, Errors: 0, Skipped: 0, Time elapsed: 0.005 sec - in org.apache.poi.util.TestTempFile
Running org.apache.poi.util.TestArrayUtil
Tests run: 2, Failures: 0, Errors: 0, Skipped: 0, Time elapsed: 0 sec - in org.apache.poi.util.TestArrayUtil
Running org.apache.poi.util.TestLittleEndianStreams
Tests run: 2, Failures: 0, Errors: 0, Skipped: 0, Time elapsed: 0.012 sec - in org.apache.poi.util.TestLittleEndianStreams
Running org.apache.poi.util.TestIOUtils
Tests run: 8, Failures: 0, Errors: 0, Skipped: 0, Time elapsed: 0 sec - in org.apache.poi.util.TestIOUtils
Running org.apache.poi.util.TestShortField
Tests run: 5, Failures: 0, Errors: 0, Skipped: 0, Time elapsed: 0 sec - in org.apache.poi.util.TestShortField
Running org.apache.poi.util.TestLittleEndianCP950Reader
65235
Tests run: 2, Failures: 0, Errors: 0, Skipped: 0, Time elapsed: 0.271 sec - in org.apache.poi.util.TestLittleEndianCP950Reader
Running org.apache.poi.util.TestLongField
Tests run: 5, Failures: 0, Errors: 0, Skipped: 0, Time elapsed: 0 sec - in org.apache.poi.util.TestLongField
Running org.apache.poi.util.TestIntegerField
Tests run: 5, Failures: 0, Errors: 0, Skipped: 0, Time elapsed: 0 sec - in org.apache.poi.util.TestIntegerField
Running org.apache.poi.util.TestRLEDecompressingInputStream
Tests run: 4, Failures: 0, Errors: 0, Skipped: 0, Time elapsed: 0 sec - in org.apache.poi.util.TestRLEDecompressingInputStream
Running org.apache.poi.util.TestBitField
Tests run: 16, Failures: 0, Errors: 0, Skipped: 0, Time elapsed: 0.139 sec - in org.apache.poi.util.TestBitField
Running org.apache.poi.util.TestLocaleUtil
Tests run: 3, Failures: 0, Errors: 0, Skipped: 0, Time elapsed: 0 sec - in org.apache.poi.util.TestLocaleUtil
Running org.apache.poi.util.TestPOILogger
Tests run: 1, Failures: 0, Errors: 0, Skipped: 0, Time elapsed: 0.001 sec - in org.apache.poi.util.TestPOILogger

Results :

Tests in error:
  TestPOIFSProperties.testFail:62->checkFromByteArray:108 » FileNotFound no such...
  TestPOIFSProperties.testOK:82->checkFromByteArray:108 » FileNotFound no such e...

Tests run: 6445, Failures: 0, Errors: 2, Skipped: 772

[INFO] ------------------------------------------------------------------------
[INFO] Reactor Summary:
[INFO]
[INFO] Apache POI - the Java API for Microsoft Documents . SUCCESS [  0.005 s]
[INFO] Apache POI Main package ........................... FAILURE [03:36 min]
[INFO] Apache POI Scratchpad package ..................... SKIPPED
[INFO] Apache POI - Openxmlformats Schema package ........ SKIPPED
[INFO] Apache POI - Openxmlformats Encryption Schema package  SKIPPED
[INFO] Apache POI - Openxmlformats Security-Schema package  SKIPPED
[INFO] Apache POI OOXML package .......................... SKIPPED
[INFO] Apache POI ExcelAnt package ....................... SKIPPED
[INFO] Apache POI Examples package ....................... SKIPPED
[INFO] ------------------------------------------------------------------------
[INFO] BUILD FAILURE
[INFO] ------------------------------------------------------------------------
[INFO] Total time: 03:37 min
[INFO] Finished at: 2017-07-28T08:07:34+00:00
[INFO] Final Memory: 28M/631M
[INFO] ------------------------------------------------------------------------
[ERROR] Failed to execute goal org.apache.maven.plugins:maven-surefire-plugin:2.19.1:test (default-test) on project poi-main: There are test failures.
[ERROR]
[ERROR] Please refer to <https://builds.apache.org/job/POI-DSL-Maven/ws/sonar/main/target/surefire-reports> for the individual test results.
[ERROR] -> [Help 1]
[ERROR]
[ERROR] To see the full stack trace of the errors, re-run Maven with the -e switch.
[ERROR] Re-run Maven using the -X switch to enable full debug logging.
[ERROR]
[ERROR] For more information about the errors and possible solutions, please read the following articles:
[ERROR] [Help 1] http://cwiki.apache.org/confluence/display/MAVEN/MojoFailureException
[ERROR]
[ERROR] After correcting the problems, you can resume the build with the command
[ERROR]   mvn <goals> -rf :poi-main
Build step 'Invoke top-level Maven targets' marked build as failure

---------------------------------------------------------------------
To unsubscribe, e-mail: [hidden email]
For additional commands, e-mail: [hidden email]

Reply | Threaded
Open this post in threaded view
|  
Report Content as Inappropriate

Build failed in Jenkins: POI-DSL-Maven #289

Apache Jenkins Server
See <https://builds.apache.org/job/POI-DSL-Maven/289/display/redirect?page=changes>

Changes:

[gwoolsey] Deleting a sheet did not delete table parts and relations.  Deleting a table needs to also delete any queryTable relations and parts.

Previous behavior didn't result in documents Excel complained about, but left dead entries in the ZIP structure, which made it bigger and bugged me.

This change does not attempt to delete query connection definitions, as those aren't referenced as relations, and don't have a usage counter to ensure we only delete them if there are no other references.  In my samples I had query tables on multiple sheets using the same connection definition, and wanted to delete only one sheet/table but leave others.

------------------------------------------
[...truncated 122.52 KB...]
Running org.apache.poi.ss.formula.atp.TestWorkdayFunction
Tests run: 12, Failures: 0, Errors: 0, Skipped: 0, Time elapsed: 0.018 sec - in org.apache.poi.ss.formula.atp.TestWorkdayFunction
Running org.apache.poi.ss.formula.atp.TestIfError
Tests run: 1, Failures: 0, Errors: 0, Skipped: 0, Time elapsed: 0 sec - in org.apache.poi.ss.formula.atp.TestIfError
Running org.apache.poi.ss.formula.atp.TestWorkdayCalculator
Tests run: 17, Failures: 0, Errors: 0, Skipped: 0, Time elapsed: 0.012 sec - in org.apache.poi.ss.formula.atp.TestWorkdayCalculator
Running org.apache.poi.ss.formula.atp.TestYearFracCalculatorFromSpreadsheet
Tests run: 1, Failures: 0, Errors: 0, Skipped: 0, Time elapsed: 0.043 sec - in org.apache.poi.ss.formula.atp.TestYearFracCalculatorFromSpreadsheet
Running org.apache.poi.ss.formula.atp.TestYearFracCalculator
Tests run: 1, Failures: 0, Errors: 0, Skipped: 0, Time elapsed: 0.001 sec - in org.apache.poi.ss.formula.atp.TestYearFracCalculator
Running org.apache.poi.ss.formula.atp.TestDateParser
Tests run: 5, Failures: 0, Errors: 0, Skipped: 0, Time elapsed: 0.001 sec - in org.apache.poi.ss.formula.atp.TestDateParser
Running org.apache.poi.ss.formula.atp.TestRandBetween
Tests run: 6, Failures: 0, Errors: 0, Skipped: 0, Time elapsed: 0.014 sec - in org.apache.poi.ss.formula.atp.TestRandBetween
Running org.apache.poi.ss.formula.TestPlainCellCache
Tests run: 1, Failures: 0, Errors: 0, Skipped: 0, Time elapsed: 1.532 sec - in org.apache.poi.ss.formula.TestPlainCellCache
Running org.apache.poi.ss.formula.constant.TestConstantValueParser
Tests run: 3, Failures: 0, Errors: 0, Skipped: 0, Time elapsed: 0 sec - in org.apache.poi.ss.formula.constant.TestConstantValueParser
Running org.apache.poi.ss.formula.udf.TestDefaultUDFFinder
Tests run: 1, Failures: 0, Errors: 0, Skipped: 0, Time elapsed: 0 sec - in org.apache.poi.ss.formula.udf.TestDefaultUDFFinder
Running org.apache.poi.ss.formula.udf.TestAggregatingUDFFinder
Tests run: 2, Failures: 0, Errors: 0, Skipped: 0, Time elapsed: 0 sec - in org.apache.poi.ss.formula.udf.TestAggregatingUDFFinder
Running org.apache.poi.ss.formula.TestFormulaShifter
Tests run: 11, Failures: 0, Errors: 0, Skipped: 0, Time elapsed: 0 sec - in org.apache.poi.ss.formula.TestFormulaShifter
Running org.apache.poi.ss.formula.TestMissingWorkbook
Tests run: 3, Failures: 0, Errors: 0, Skipped: 0, Time elapsed: 0.005 sec - in org.apache.poi.ss.formula.TestMissingWorkbook
Running org.apache.poi.ss.formula.TestWorkbookEvaluator
Tests run: 22, Failures: 0, Errors: 0, Skipped: 4, Time elapsed: 0.046 sec - in org.apache.poi.ss.formula.TestWorkbookEvaluator
Running org.apache.poi.ss.formula.TestEvaluationCache
Tests run: 8, Failures: 0, Errors: 0, Skipped: 0, Time elapsed: 11.173 sec - in org.apache.poi.ss.formula.TestEvaluationCache
Running org.apache.poi.ss.formula.ptg.TestArrayPtg
Tests run: 5, Failures: 0, Errors: 0, Skipped: 0, Time elapsed: 0.004 sec - in org.apache.poi.ss.formula.ptg.TestArrayPtg
Running org.apache.poi.ss.formula.ptg.TestIntersectionPtg
Tests run: 1, Failures: 0, Errors: 0, Skipped: 0, Time elapsed: 0.002 sec - in org.apache.poi.ss.formula.ptg.TestIntersectionPtg
Running org.apache.poi.ss.formula.ptg.TestExternalNameReference
Tests run: 3, Failures: 0, Errors: 0, Skipped: 0, Time elapsed: 0.01 sec - in org.apache.poi.ss.formula.ptg.TestExternalNameReference
Running org.apache.poi.ss.formula.ptg.TestExternalFunctionFormulas
Tests run: 3, Failures: 0, Errors: 0, Skipped: 0, Time elapsed: 0.007 sec - in org.apache.poi.ss.formula.ptg.TestExternalFunctionFormulas
Running org.apache.poi.ss.formula.ptg.TestFuncVarPtg
Tests run: 1, Failures: 0, Errors: 0, Skipped: 0, Time elapsed: 0.001 sec - in org.apache.poi.ss.formula.ptg.TestFuncVarPtg
Running org.apache.poi.ss.formula.ptg.TestAbstractFunctionPtg
Tests run: 3, Failures: 0, Errors: 0, Skipped: 0, Time elapsed: 0.002 sec - in org.apache.poi.ss.formula.ptg.TestAbstractFunctionPtg
Running org.apache.poi.ss.formula.ptg.TestErrPtg
Tests run: 1, Failures: 0, Errors: 0, Skipped: 0, Time elapsed: 0.002 sec - in org.apache.poi.ss.formula.ptg.TestErrPtg
Running org.apache.poi.ss.formula.ptg.TestFuncPtg
Tests run: 2, Failures: 0, Errors: 0, Skipped: 0, Time elapsed: 0.001 sec - in org.apache.poi.ss.formula.ptg.TestFuncPtg
Running org.apache.poi.ss.formula.ptg.TestRangePtg
Tests run: 1, Failures: 0, Errors: 0, Skipped: 0, Time elapsed: 0.001 sec - in org.apache.poi.ss.formula.ptg.TestRangePtg
Running org.apache.poi.ss.formula.ptg.TestPercentPtg
Tests run: 1, Failures: 0, Errors: 0, Skipped: 0, Time elapsed: 0.002 sec - in org.apache.poi.ss.formula.ptg.TestPercentPtg
Running org.apache.poi.ss.formula.ptg.TestAreaPtg
Tests run: 5, Failures: 0, Errors: 0, Skipped: 0, Time elapsed: 0.003 sec - in org.apache.poi.ss.formula.ptg.TestAreaPtg
Running org.apache.poi.ss.formula.ptg.TestUnionPtg
Tests run: 1, Failures: 0, Errors: 0, Skipped: 0, Time elapsed: 0.001 sec - in org.apache.poi.ss.formula.ptg.TestUnionPtg
Running org.apache.poi.ss.formula.ptg.TestReferencePtg
Tests run: 4, Failures: 0, Errors: 0, Skipped: 0, Time elapsed: 0.016 sec - in org.apache.poi.ss.formula.ptg.TestReferencePtg
Running org.apache.poi.ss.formula.ptg.TestAttrPtg
Tests run: 1, Failures: 0, Errors: 0, Skipped: 0, Time elapsed: 0 sec - in org.apache.poi.ss.formula.ptg.TestAttrPtg
Running org.apache.poi.ss.formula.ptg.TestRef3DPtg
Tests run: 1, Failures: 0, Errors: 0, Skipped: 0, Time elapsed: 0 sec - in org.apache.poi.ss.formula.ptg.TestRef3DPtg
Running org.apache.poi.ss.formula.ptg.TestAreaErrPtg
Tests run: 1, Failures: 0, Errors: 0, Skipped: 0, Time elapsed: 0 sec - in org.apache.poi.ss.formula.ptg.TestAreaErrPtg
Running org.apache.poi.ss.formula.ptg.TestArea3DPtg
Tests run: 1, Failures: 0, Errors: 0, Skipped: 0, Time elapsed: 0 sec - in org.apache.poi.ss.formula.ptg.TestArea3DPtg
Running org.apache.poi.ss.usermodel.TestFractionFormat
Tests run: 2, Failures: 0, Errors: 0, Skipped: 0, Time elapsed: 0.355 sec - in org.apache.poi.ss.usermodel.TestFractionFormat
Running org.apache.poi.ss.usermodel.charts.TestDataSources
Tests run: 6, Failures: 0, Errors: 0, Skipped: 0, Time elapsed: 0.011 sec - in org.apache.poi.ss.usermodel.charts.TestDataSources
Running org.apache.poi.ss.usermodel.TestExcelStyleDateFormatter
Tests run: 4, Failures: 0, Errors: 0, Skipped: 0, Time elapsed: 0.025 sec - in org.apache.poi.ss.usermodel.TestExcelStyleDateFormatter
Running org.apache.poi.ss.usermodel.TestDateUtil
Tests run: 5, Failures: 0, Errors: 0, Skipped: 0, Time elapsed: 0.003 sec - in org.apache.poi.ss.usermodel.TestDateUtil
Running org.apache.poi.ss.usermodel.TestIndexedColors
Tests run: 3, Failures: 0, Errors: 0, Skipped: 0, Time elapsed: 0.008 sec - in org.apache.poi.ss.usermodel.TestIndexedColors
Running org.apache.poi.ss.usermodel.TestDataFormatter
Tests run: 33, Failures: 0, Errors: 0, Skipped: 1, Time elapsed: 0.088 sec - in org.apache.poi.ss.usermodel.TestDataFormatter
Running org.apache.poi.ss.usermodel.TestHSSFBorderStyle
Tests run: 1, Failures: 0, Errors: 0, Skipped: 0, Time elapsed: 0 sec - in org.apache.poi.ss.usermodel.TestHSSFBorderStyle
Running org.apache.poi.ss.TestSpreadsheetVersion
Tests run: 2, Failures: 0, Errors: 0, Skipped: 0, Time elapsed: 0 sec - in org.apache.poi.ss.TestSpreadsheetVersion
Running org.apache.poi.ss.util.TestWorkbookUtil
Tests run: 1, Failures: 0, Errors: 0, Skipped: 0, Time elapsed: 0 sec - in org.apache.poi.ss.util.TestWorkbookUtil
Running org.apache.poi.ss.util.TestCellAddress
Tests run: 6, Failures: 0, Errors: 0, Skipped: 0, Time elapsed: 0 sec - in org.apache.poi.ss.util.TestCellAddress
Running org.apache.poi.ss.util.TestSheetBuilder
Tests run: 3, Failures: 0, Errors: 0, Skipped: 0, Time elapsed: 0 sec - in org.apache.poi.ss.util.TestSheetBuilder
Running org.apache.poi.ss.util.TestSheetUtil
Tests run: 7, Failures: 0, Errors: 0, Skipped: 0, Time elapsed: 0.001 sec - in org.apache.poi.ss.util.TestSheetUtil
Running org.apache.poi.ss.util.TestExpandedDouble
Tests run: 3, Failures: 0, Errors: 0, Skipped: 0, Time elapsed: 0.003 sec - in org.apache.poi.ss.util.TestExpandedDouble
Running org.apache.poi.ss.util.TestAreaReference
Tests run: 2, Failures: 0, Errors: 0, Skipped: 0, Time elapsed: 0 sec - in org.apache.poi.ss.util.TestAreaReference
Running org.apache.poi.ss.util.TestPropertyTemplate
Tests run: 8, Failures: 0, Errors: 0, Skipped: 0, Time elapsed: 0.047 sec - in org.apache.poi.ss.util.TestPropertyTemplate
Running org.apache.poi.ss.util.TestCellRangeAddress
Tests run: 13, Failures: 0, Errors: 0, Skipped: 0, Time elapsed: 0.011 sec - in org.apache.poi.ss.util.TestCellRangeAddress
Running org.apache.poi.ss.util.TestDateFormatConverter
Open /tmp/poifiles/LocaleDatesDefault8878321465324468817.xlsx in Excel
Open /tmp/poifiles/LocaleDatesShort7337868746977383511.xlsx in Excel
Open /tmp/poifiles/LocaleDatesMedium5627216205847267623.xlsx in Excel
Open /tmp/poifiles/LocaleDatesLong1206081650098244604.xlsx in Excel
Open /tmp/poifiles/LocaleDatesFull2133762275248678047.xlsx in Excel
Open /tmp/poifiles/LocaleDateTimesDefault7666390102689706543.xlsx in Excel
Open /tmp/poifiles/LocaleDateTimesShort7578742576320464800.xlsx in Excel
Open /tmp/poifiles/LocaleDateTimesMedium1033769159953399703.xlsx in Excel
Open /tmp/poifiles/LocaleDateTimesLong7740791621955709072.xlsx in Excel
Open /tmp/poifiles/LocaleDateTimesFull5081608219207024908.xlsx in Excel
Open /tmp/poifiles/LocaleTimesDefault8785118150364086771.xlsx in Excel
Open /tmp/poifiles/LocaleTimesShort7567604107713075022.xlsx in Excel
Open /tmp/poifiles/LocaleTimesMedium6226354321411576684.xlsx in Excel
Open /tmp/poifiles/LocaleTimesLong2361604561244930035.xlsx in Excel
Open /tmp/poifiles/LocaleTimesFull5083510095744250823.xlsx in Excel
Tests run: 2, Failures: 0, Errors: 0, Skipped: 0, Time elapsed: 2.102 sec - in org.apache.poi.ss.util.TestDateFormatConverter
Running org.apache.poi.ss.util.TestNumberToTextConverter
Tests run: 2, Failures: 0, Errors: 0, Skipped: 0, Time elapsed: 0.008 sec - in org.apache.poi.ss.util.TestNumberToTextConverter
Running org.apache.poi.ss.util.cellwalk.TestCellWalk
Tests run: 1, Failures: 0, Errors: 0, Skipped: 0, Time elapsed: 0.001 sec - in org.apache.poi.ss.util.cellwalk.TestCellWalk
Running org.apache.poi.ss.util.TestNumberComparer
Tests run: 4, Failures: 0, Errors: 0, Skipped: 0, Time elapsed: 0.257 sec - in org.apache.poi.ss.util.TestNumberComparer
Running org.apache.poi.ss.util.TestHSSFCellUtil
setCellStyleProps start
setCellStyleProps nearing end
Tests run: 14, Failures: 0, Errors: 0, Skipped: 0, Time elapsed: 0.016 sec - in org.apache.poi.ss.util.TestHSSFCellUtil
Running org.apache.poi.ss.util.TestRegionUtil
Tests run: 10, Failures: 0, Errors: 0, Skipped: 0, Time elapsed: 0.025 sec - in org.apache.poi.ss.util.TestRegionUtil
Running org.apache.poi.ss.util.TestCellReference
Tests run: 25, Failures: 0, Errors: 0, Skipped: 0, Time elapsed: 0.005 sec - in org.apache.poi.ss.util.TestCellReference
Running org.apache.poi.ddf.TestEscherDgRecord
Tests run: 3, Failures: 0, Errors: 0, Skipped: 0, Time elapsed: 0 sec - in org.apache.poi.ddf.TestEscherDgRecord
Running org.apache.poi.ddf.TestEscherDggRecord
Tests run: 4, Failures: 0, Errors: 0, Skipped: 0, Time elapsed: 0 sec - in org.apache.poi.ddf.TestEscherDggRecord
Running org.apache.poi.ddf.TestEscherBlipRecord
Tests run: 4, Failures: 0, Errors: 0, Skipped: 0, Time elapsed: 0.033 sec - in org.apache.poi.ddf.TestEscherBlipRecord
Running org.apache.poi.ddf.TestEscherSpgrRecord
Tests run: 3, Failures: 0, Errors: 0, Skipped: 0, Time elapsed: 0.001 sec - in org.apache.poi.ddf.TestEscherSpgrRecord
Running org.apache.poi.ddf.TestEscherPropertyFactory
Tests run: 1, Failures: 0, Errors: 0, Skipped: 0, Time elapsed: 0 sec - in org.apache.poi.ddf.TestEscherPropertyFactory
Running org.apache.poi.ddf.TestEscherBoolProperty
Tests run: 1, Failures: 0, Errors: 0, Skipped: 0, Time elapsed: 0 sec - in org.apache.poi.ddf.TestEscherBoolProperty
Running org.apache.poi.ddf.TestEscherProperty
Tests run: 1, Failures: 0, Errors: 0, Skipped: 0, Time elapsed: 0 sec - in org.apache.poi.ddf.TestEscherProperty
Running org.apache.poi.ddf.TestEscherOptRecord
Tests run: 6, Failures: 0, Errors: 0, Skipped: 0, Time elapsed: 0.001 sec - in org.apache.poi.ddf.TestEscherOptRecord
Running org.apache.poi.ddf.TestUnknownEscherRecord
Tests run: 3, Failures: 0, Errors: 0, Skipped: 0, Time elapsed: 0.001 sec - in org.apache.poi.ddf.TestUnknownEscherRecord
Running org.apache.poi.ddf.TestEscherClientDataRecord
Tests run: 3, Failures: 0, Errors: 0, Skipped: 0, Time elapsed: 0.002 sec - in org.apache.poi.ddf.TestEscherClientDataRecord
Running org.apache.poi.ddf.TestEscherSpRecord
Tests run: 3, Failures: 0, Errors: 0, Skipped: 0, Time elapsed: 0 sec - in org.apache.poi.ddf.TestEscherSpRecord
Running org.apache.poi.ddf.TestEscherClientAnchorRecord
Tests run: 3, Failures: 0, Errors: 0, Skipped: 0, Time elapsed: 0 sec - in org.apache.poi.ddf.TestEscherClientAnchorRecord
Running org.apache.poi.ddf.TestEscherContainerRecord
Tests run: 6, Failures: 0, Errors: 0, Skipped: 0, Time elapsed: 0.001 sec - in org.apache.poi.ddf.TestEscherContainerRecord
Running org.apache.poi.ddf.TestEscherBSERecord
Tests run: 3, Failures: 0, Errors: 0, Skipped: 0, Time elapsed: 0 sec - in org.apache.poi.ddf.TestEscherBSERecord
Running org.apache.poi.ddf.TestEscherDump
Tests run: 3, Failures: 0, Errors: 0, Skipped: 0, Time elapsed: 0.027 sec - in org.apache.poi.ddf.TestEscherDump
Running org.apache.poi.ddf.TestEscherSplitMenuColorsRecord
Tests run: 3, Failures: 0, Errors: 0, Skipped: 0, Time elapsed: 0.002 sec - in org.apache.poi.ddf.TestEscherSplitMenuColorsRecord
Running org.apache.poi.ddf.TestEscherChildAnchorRecord
Tests run: 3, Failures: 0, Errors: 0, Skipped: 0, Time elapsed: 0.002 sec - in org.apache.poi.ddf.TestEscherChildAnchorRecord
Running org.apache.poi.TestPOITestCase
Tests run: 10, Failures: 0, Errors: 0, Skipped: 3, Time elapsed: 0.006 sec - in org.apache.poi.TestPOITestCase
Running org.apache.poi.sl.draw.geom.TestPresetGeometries
URL: <https://builds.apache.org/job/POI-DSL-Maven/ws/sonar/main/target/classes/org/apache/poi/sl/draw/geom/presetShapeDefinitions.xml>
Tests run: 2, Failures: 0, Errors: 0, Skipped: 0, Time elapsed: 2.776 sec - in org.apache.poi.sl.draw.geom.TestPresetGeometries
Running org.apache.poi.util.TestStaxHelper
Tests run: 3, Failures: 0, Errors: 0, Skipped: 0, Time elapsed: 0 sec - in org.apache.poi.util.TestStaxHelper
Running org.apache.poi.util.TestIntList
Tests run: 18, Failures: 0, Errors: 0, Skipped: 0, Time elapsed: 0.043 sec - in org.apache.poi.util.TestIntList
Running org.apache.poi.util.TestHexDump
00000000 74 65 73 74 73 74 72 69 6E 67                   teststring

Tests run: 10, Failures: 0, Errors: 0, Skipped: 0, Time elapsed: 0.02 sec - in org.apache.poi.util.TestHexDump
Running org.apache.poi.util.TestByteField
Tests run: 5, Failures: 0, Errors: 0, Skipped: 0, Time elapsed: 0 sec - in org.apache.poi.util.TestByteField
Running org.apache.poi.util.TestLittleEndian
Tests run: 14, Failures: 0, Errors: 0, Skipped: 0, Time elapsed: 0.007 sec - in org.apache.poi.util.TestLittleEndian
Running org.apache.poi.util.TestPOILogFactory
Tests run: 1, Failures: 0, Errors: 0, Skipped: 0, Time elapsed: 0 sec - in org.apache.poi.util.TestPOILogFactory
Running org.apache.poi.util.TestStringUtil
Tests run: 8, Failures: 0, Errors: 0, Skipped: 0, Time elapsed: 0 sec - in org.apache.poi.util.TestStringUtil
Running org.apache.poi.util.TestTempFile
Tests run: 4, Failures: 0, Errors: 0, Skipped: 0, Time elapsed: 0 sec - in org.apache.poi.util.TestTempFile
Running org.apache.poi.util.TestArrayUtil
Tests run: 2, Failures: 0, Errors: 0, Skipped: 0, Time elapsed: 0 sec - in org.apache.poi.util.TestArrayUtil
Running org.apache.poi.util.TestLittleEndianStreams
Tests run: 2, Failures: 0, Errors: 0, Skipped: 0, Time elapsed: 0.013 sec - in org.apache.poi.util.TestLittleEndianStreams
Running org.apache.poi.util.TestIOUtils
Tests run: 8, Failures: 0, Errors: 0, Skipped: 0, Time elapsed: 0.002 sec - in org.apache.poi.util.TestIOUtils
Running org.apache.poi.util.TestShortField
Tests run: 5, Failures: 0, Errors: 0, Skipped: 0, Time elapsed: 0 sec - in org.apache.poi.util.TestShortField
Running org.apache.poi.util.TestLittleEndianCP950Reader
65235
Tests run: 2, Failures: 0, Errors: 0, Skipped: 0, Time elapsed: 0.001 sec - in org.apache.poi.util.TestLittleEndianCP950Reader
Running org.apache.poi.util.TestLongField
Tests run: 5, Failures: 0, Errors: 0, Skipped: 0, Time elapsed: 0 sec - in org.apache.poi.util.TestLongField
Running org.apache.poi.util.TestIntegerField
Tests run: 5, Failures: 0, Errors: 0, Skipped: 0, Time elapsed: 0 sec - in org.apache.poi.util.TestIntegerField
Running org.apache.poi.util.TestRLEDecompressingInputStream
Tests run: 4, Failures: 0, Errors: 0, Skipped: 0, Time elapsed: 0 sec - in org.apache.poi.util.TestRLEDecompressingInputStream
Running org.apache.poi.util.TestBitField
Tests run: 16, Failures: 0, Errors: 0, Skipped: 0, Time elapsed: 0.003 sec - in org.apache.poi.util.TestBitField
Running org.apache.poi.util.TestLocaleUtil
Tests run: 3, Failures: 0, Errors: 0, Skipped: 0, Time elapsed: 0.001 sec - in org.apache.poi.util.TestLocaleUtil
Running org.apache.poi.util.TestPOILogger
Tests run: 1, Failures: 0, Errors: 0, Skipped: 0, Time elapsed: 0 sec - in org.apache.poi.util.TestPOILogger

Results :

Tests in error:
  TestPOIFSProperties.testFail:62->checkFromByteArray:108 » FileNotFound no such...
  TestPOIFSProperties.testOK:82->checkFromByteArray:108 » FileNotFound no such e...

Tests run: 6445, Failures: 0, Errors: 2, Skipped: 772

[INFO] ------------------------------------------------------------------------
[INFO] Reactor Summary:
[INFO]
[INFO] Apache POI - the Java API for Microsoft Documents . SUCCESS [  0.005 s]
[INFO] Apache POI Main package ........................... FAILURE [03:37 min]
[INFO] Apache POI Scratchpad package ..................... SKIPPED
[INFO] Apache POI - Openxmlformats Schema package ........ SKIPPED
[INFO] Apache POI - Openxmlformats Encryption Schema package  SKIPPED
[INFO] Apache POI - Openxmlformats Security-Schema package  SKIPPED
[INFO] Apache POI OOXML package .......................... SKIPPED
[INFO] Apache POI ExcelAnt package ....................... SKIPPED
[INFO] Apache POI Examples package ....................... SKIPPED
[INFO] ------------------------------------------------------------------------
[INFO] BUILD FAILURE
[INFO] ------------------------------------------------------------------------
[INFO] Total time: 03:38 min
[INFO] Finished at: 2017-07-28T20:07:30+00:00
[INFO] Final Memory: 28M/651M
[INFO] ------------------------------------------------------------------------
[ERROR] Failed to execute goal org.apache.maven.plugins:maven-surefire-plugin:2.19.1:test (default-test) on project poi-main: There are test failures.
[ERROR]
[ERROR] Please refer to <https://builds.apache.org/job/POI-DSL-Maven/ws/sonar/main/target/surefire-reports> for the individual test results.
[ERROR] -> [Help 1]
[ERROR]
[ERROR] To see the full stack trace of the errors, re-run Maven with the -e switch.
[ERROR] Re-run Maven using the -X switch to enable full debug logging.
[ERROR]
[ERROR] For more information about the errors and possible solutions, please read the following articles:
[ERROR] [Help 1] http://cwiki.apache.org/confluence/display/MAVEN/MojoFailureException
[ERROR]
[ERROR] After correcting the problems, you can resume the build with the command
[ERROR]   mvn <goals> -rf :poi-main
Build step 'Invoke top-level Maven targets' marked build as failure

---------------------------------------------------------------------
To unsubscribe, e-mail: [hidden email]
For additional commands, e-mail: [hidden email]

Reply | Threaded
Open this post in threaded view
|  
Report Content as Inappropriate

Re: Build failed in Jenkins: POI-DSL-Maven #289

Greg Woolsey
The two tests in error pass on my local system (Windows 10).

The test log from the build [1] show the failing workbooks used by this
test on the build servers had different contents than what I'm seeing
locally.

Specifically, locally, I'm seeing it pass because the document contains a
SummaryInformation part, but the failing run only has a
DocumentSummaryInformation part:

java.io.FileNotFoundException: no such entry: " SummaryInformation",
had: [encryption,  DocumentSummaryInformation, Workbook]


Anyone have a clue what is happening?  This is apparently due to some other
recent change, nothing in my commit would touch this.

[1]
https://builds.apache.org/job/POI-DSL-Maven/ws/sonar/main/target/surefire-reports/org.apache.poi.hssf.usermodel.TestPOIFSProperties.txt


On Fri, Jul 28, 2017 at 1:07 PM Apache Jenkins Server <
[hidden email]> wrote:

> See <
> https://builds.apache.org/job/POI-DSL-Maven/289/display/redirect?page=changes
> >
>
> Changes:
>
> [gwoolsey] Deleting a sheet did not delete table parts and relations.
> Deleting a table needs to also delete any queryTable relations and parts.
>
> Previous behavior didn't result in documents Excel complained about, but
> left dead entries in the ZIP structure, which made it bigger and bugged me.
>
> This change does not attempt to delete query connection definitions, as
> those aren't referenced as relations, and don't have a usage counter to
> ensure we only delete them if there are no other references.  In my samples
> I had query tables on multiple sheets using the same connection definition,
> and wanted to delete only one sheet/table but leave others.
>
> ------------------------------------------
> [...truncated 122.52 KB...]
> Running org.apache.poi.ss.formula.atp.TestWorkdayFunction
> Tests run: 12, Failures: 0, Errors: 0, Skipped: 0, Time elapsed: 0.018 sec
> - in org.apache.poi.ss.formula.atp.TestWorkdayFunction
> Running org.apache.poi.ss.formula.atp.TestIfError
> Tests run: 1, Failures: 0, Errors: 0, Skipped: 0, Time elapsed: 0 sec - in
> org.apache.poi.ss.formula.atp.TestIfError
> Running org.apache.poi.ss.formula.atp.TestWorkdayCalculator
> Tests run: 17, Failures: 0, Errors: 0, Skipped: 0, Time elapsed: 0.012 sec
> - in org.apache.poi.ss.formula.atp.TestWorkdayCalculator
> Running org.apache.poi.ss.formula.atp.TestYearFracCalculatorFromSpreadsheet
> Tests run: 1, Failures: 0, Errors: 0, Skipped: 0, Time elapsed: 0.043 sec
> - in org.apache.poi.ss.formula.atp.TestYearFracCalculatorFromSpreadsheet
> Running org.apache.poi.ss.formula.atp.TestYearFracCalculator
> Tests run: 1, Failures: 0, Errors: 0, Skipped: 0, Time elapsed: 0.001 sec
> - in org.apache.poi.ss.formula.atp.TestYearFracCalculator
> Running org.apache.poi.ss.formula.atp.TestDateParser
> Tests run: 5, Failures: 0, Errors: 0, Skipped: 0, Time elapsed: 0.001 sec
> - in org.apache.poi.ss.formula.atp.TestDateParser
> Running org.apache.poi.ss.formula.atp.TestRandBetween
> Tests run: 6, Failures: 0, Errors: 0, Skipped: 0, Time elapsed: 0.014 sec
> - in org.apache.poi.ss.formula.atp.TestRandBetween
> Running org.apache.poi.ss.formula.TestPlainCellCache
> Tests run: 1, Failures: 0, Errors: 0, Skipped: 0, Time elapsed: 1.532 sec
> - in org.apache.poi.ss.formula.TestPlainCellCache
> Running org.apache.poi.ss.formula.constant.TestConstantValueParser
> Tests run: 3, Failures: 0, Errors: 0, Skipped: 0, Time elapsed: 0 sec - in
> org.apache.poi.ss.formula.constant.TestConstantValueParser
> Running org.apache.poi.ss.formula.udf.TestDefaultUDFFinder
> Tests run: 1, Failures: 0, Errors: 0, Skipped: 0, Time elapsed: 0 sec - in
> org.apache.poi.ss.formula.udf.TestDefaultUDFFinder
> Running org.apache.poi.ss.formula.udf.TestAggregatingUDFFinder
> Tests run: 2, Failures: 0, Errors: 0, Skipped: 0, Time elapsed: 0 sec - in
> org.apache.poi.ss.formula.udf.TestAggregatingUDFFinder
> Running org.apache.poi.ss.formula.TestFormulaShifter
> Tests run: 11, Failures: 0, Errors: 0, Skipped: 0, Time elapsed: 0 sec -
> in org.apache.poi.ss.formula.TestFormulaShifter
> Running org.apache.poi.ss.formula.TestMissingWorkbook
> Tests run: 3, Failures: 0, Errors: 0, Skipped: 0, Time elapsed: 0.005 sec
> - in org.apache.poi.ss.formula.TestMissingWorkbook
> Running org.apache.poi.ss.formula.TestWorkbookEvaluator
> Tests run: 22, Failures: 0, Errors: 0, Skipped: 4, Time elapsed: 0.046 sec
> - in org.apache.poi.ss.formula.TestWorkbookEvaluator
> Running org.apache.poi.ss.formula.TestEvaluationCache
> Tests run: 8, Failures: 0, Errors: 0, Skipped: 0, Time elapsed: 11.173 sec
> - in org.apache.poi.ss.formula.TestEvaluationCache
> Running org.apache.poi.ss.formula.ptg.TestArrayPtg
> Tests run: 5, Failures: 0, Errors: 0, Skipped: 0, Time elapsed: 0.004 sec
> - in org.apache.poi.ss.formula.ptg.TestArrayPtg
> Running org.apache.poi.ss.formula.ptg.TestIntersectionPtg
> Tests run: 1, Failures: 0, Errors: 0, Skipped: 0, Time elapsed: 0.002 sec
> - in org.apache.poi.ss.formula.ptg.TestIntersectionPtg
> Running org.apache.poi.ss.formula.ptg.TestExternalNameReference
> Tests run: 3, Failures: 0, Errors: 0, Skipped: 0, Time elapsed: 0.01 sec -
> in org.apache.poi.ss.formula.ptg.TestExternalNameReference
> Running org.apache.poi.ss.formula.ptg.TestExternalFunctionFormulas
> Tests run: 3, Failures: 0, Errors: 0, Skipped: 0, Time elapsed: 0.007 sec
> - in org.apache.poi.ss.formula.ptg.TestExternalFunctionFormulas
> Running org.apache.poi.ss.formula.ptg.TestFuncVarPtg
> Tests run: 1, Failures: 0, Errors: 0, Skipped: 0, Time elapsed: 0.001 sec
> - in org.apache.poi.ss.formula.ptg.TestFuncVarPtg
> Running org.apache.poi.ss.formula.ptg.TestAbstractFunctionPtg
> Tests run: 3, Failures: 0, Errors: 0, Skipped: 0, Time elapsed: 0.002 sec
> - in org.apache.poi.ss.formula.ptg.TestAbstractFunctionPtg
> Running org.apache.poi.ss.formula.ptg.TestErrPtg
> Tests run: 1, Failures: 0, Errors: 0, Skipped: 0, Time elapsed: 0.002 sec
> - in org.apache.poi.ss.formula.ptg.TestErrPtg
> Running org.apache.poi.ss.formula.ptg.TestFuncPtg
> Tests run: 2, Failures: 0, Errors: 0, Skipped: 0, Time elapsed: 0.001 sec
> - in org.apache.poi.ss.formula.ptg.TestFuncPtg
> Running org.apache.poi.ss.formula.ptg.TestRangePtg
> Tests run: 1, Failures: 0, Errors: 0, Skipped: 0, Time elapsed: 0.001 sec
> - in org.apache.poi.ss.formula.ptg.TestRangePtg
> Running org.apache.poi.ss.formula.ptg.TestPercentPtg
> Tests run: 1, Failures: 0, Errors: 0, Skipped: 0, Time elapsed: 0.002 sec
> - in org.apache.poi.ss.formula.ptg.TestPercentPtg
> Running org.apache.poi.ss.formula.ptg.TestAreaPtg
> Tests run: 5, Failures: 0, Errors: 0, Skipped: 0, Time elapsed: 0.003 sec
> - in org.apache.poi.ss.formula.ptg.TestAreaPtg
> Running org.apache.poi.ss.formula.ptg.TestUnionPtg
> Tests run: 1, Failures: 0, Errors: 0, Skipped: 0, Time elapsed: 0.001 sec
> - in org.apache.poi.ss.formula.ptg.TestUnionPtg
> Running org.apache.poi.ss.formula.ptg.TestReferencePtg
> Tests run: 4, Failures: 0, Errors: 0, Skipped: 0, Time elapsed: 0.016 sec
> - in org.apache.poi.ss.formula.ptg.TestReferencePtg
> Running org.apache.poi.ss.formula.ptg.TestAttrPtg
> Tests run: 1, Failures: 0, Errors: 0, Skipped: 0, Time elapsed: 0 sec - in
> org.apache.poi.ss.formula.ptg.TestAttrPtg
> Running org.apache.poi.ss.formula.ptg.TestRef3DPtg
> Tests run: 1, Failures: 0, Errors: 0, Skipped: 0, Time elapsed: 0 sec - in
> org.apache.poi.ss.formula.ptg.TestRef3DPtg
> Running org.apache.poi.ss.formula.ptg.TestAreaErrPtg
> Tests run: 1, Failures: 0, Errors: 0, Skipped: 0, Time elapsed: 0 sec - in
> org.apache.poi.ss.formula.ptg.TestAreaErrPtg
> Running org.apache.poi.ss.formula.ptg.TestArea3DPtg
> Tests run: 1, Failures: 0, Errors: 0, Skipped: 0, Time elapsed: 0 sec - in
> org.apache.poi.ss.formula.ptg.TestArea3DPtg
> Running org.apache.poi.ss.usermodel.TestFractionFormat
> Tests run: 2, Failures: 0, Errors: 0, Skipped: 0, Time elapsed: 0.355 sec
> - in org.apache.poi.ss.usermodel.TestFractionFormat
> Running org.apache.poi.ss.usermodel.charts.TestDataSources
> Tests run: 6, Failures: 0, Errors: 0, Skipped: 0, Time elapsed: 0.011 sec
> - in org.apache.poi.ss.usermodel.charts.TestDataSources
> Running org.apache.poi.ss.usermodel.TestExcelStyleDateFormatter
> Tests run: 4, Failures: 0, Errors: 0, Skipped: 0, Time elapsed: 0.025 sec
> - in org.apache.poi.ss.usermodel.TestExcelStyleDateFormatter
> Running org.apache.poi.ss.usermodel.TestDateUtil
> Tests run: 5, Failures: 0, Errors: 0, Skipped: 0, Time elapsed: 0.003 sec
> - in org.apache.poi.ss.usermodel.TestDateUtil
> Running org.apache.poi.ss.usermodel.TestIndexedColors
> Tests run: 3, Failures: 0, Errors: 0, Skipped: 0, Time elapsed: 0.008 sec
> - in org.apache.poi.ss.usermodel.TestIndexedColors
> Running org.apache.poi.ss.usermodel.TestDataFormatter
> Tests run: 33, Failures: 0, Errors: 0, Skipped: 1, Time elapsed: 0.088 sec
> - in org.apache.poi.ss.usermodel.TestDataFormatter
> Running org.apache.poi.ss.usermodel.TestHSSFBorderStyle
> Tests run: 1, Failures: 0, Errors: 0, Skipped: 0, Time elapsed: 0 sec - in
> org.apache.poi.ss.usermodel.TestHSSFBorderStyle
> Running org.apache.poi.ss.TestSpreadsheetVersion
> Tests run: 2, Failures: 0, Errors: 0, Skipped: 0, Time elapsed: 0 sec - in
> org.apache.poi.ss.TestSpreadsheetVersion
> Running org.apache.poi.ss.util.TestWorkbookUtil
> Tests run: 1, Failures: 0, Errors: 0, Skipped: 0, Time elapsed: 0 sec - in
> org.apache.poi.ss.util.TestWorkbookUtil
> Running org.apache.poi.ss.util.TestCellAddress
> Tests run: 6, Failures: 0, Errors: 0, Skipped: 0, Time elapsed: 0 sec - in
> org.apache.poi.ss.util.TestCellAddress
> Running org.apache.poi.ss.util.TestSheetBuilder
> Tests run: 3, Failures: 0, Errors: 0, Skipped: 0, Time elapsed: 0 sec - in
> org.apache.poi.ss.util.TestSheetBuilder
> Running org.apache.poi.ss.util.TestSheetUtil
> Tests run: 7, Failures: 0, Errors: 0, Skipped: 0, Time elapsed: 0.001 sec
> - in org.apache.poi.ss.util.TestSheetUtil
> Running org.apache.poi.ss.util.TestExpandedDouble
> Tests run: 3, Failures: 0, Errors: 0, Skipped: 0, Time elapsed: 0.003 sec
> - in org.apache.poi.ss.util.TestExpandedDouble
> Running org.apache.poi.ss.util.TestAreaReference
> Tests run: 2, Failures: 0, Errors: 0, Skipped: 0, Time elapsed: 0 sec - in
> org.apache.poi.ss.util.TestAreaReference
> Running org.apache.poi.ss.util.TestPropertyTemplate
> Tests run: 8, Failures: 0, Errors: 0, Skipped: 0, Time elapsed: 0.047 sec
> - in org.apache.poi.ss.util.TestPropertyTemplate
> Running org.apache.poi.ss.util.TestCellRangeAddress
> Tests run: 13, Failures: 0, Errors: 0, Skipped: 0, Time elapsed: 0.011 sec
> - in org.apache.poi.ss.util.TestCellRangeAddress
> Running org.apache.poi.ss.util.TestDateFormatConverter
> Open /tmp/poifiles/LocaleDatesDefault8878321465324468817.xlsx in Excel
> Open /tmp/poifiles/LocaleDatesShort7337868746977383511.xlsx in Excel
> Open /tmp/poifiles/LocaleDatesMedium5627216205847267623.xlsx in Excel
> Open /tmp/poifiles/LocaleDatesLong1206081650098244604.xlsx in Excel
> Open /tmp/poifiles/LocaleDatesFull2133762275248678047.xlsx in Excel
> Open /tmp/poifiles/LocaleDateTimesDefault7666390102689706543.xlsx in Excel
> Open /tmp/poifiles/LocaleDateTimesShort7578742576320464800.xlsx in Excel
> Open /tmp/poifiles/LocaleDateTimesMedium1033769159953399703.xlsx in Excel
> Open /tmp/poifiles/LocaleDateTimesLong7740791621955709072.xlsx in Excel
> Open /tmp/poifiles/LocaleDateTimesFull5081608219207024908.xlsx in Excel
> Open /tmp/poifiles/LocaleTimesDefault8785118150364086771.xlsx in Excel
> Open /tmp/poifiles/LocaleTimesShort7567604107713075022.xlsx in Excel
> Open /tmp/poifiles/LocaleTimesMedium6226354321411576684.xlsx in Excel
> Open /tmp/poifiles/LocaleTimesLong2361604561244930035.xlsx in Excel
> Open /tmp/poifiles/LocaleTimesFull5083510095744250823.xlsx in Excel
> Tests run: 2, Failures: 0, Errors: 0, Skipped: 0, Time elapsed: 2.102 sec
> - in org.apache.poi.ss.util.TestDateFormatConverter
> Running org.apache.poi.ss.util.TestNumberToTextConverter
> Tests run: 2, Failures: 0, Errors: 0, Skipped: 0, Time elapsed: 0.008 sec
> - in org.apache.poi.ss.util.TestNumberToTextConverter
> Running org.apache.poi.ss.util.cellwalk.TestCellWalk
> Tests run: 1, Failures: 0, Errors: 0, Skipped: 0, Time elapsed: 0.001 sec
> - in org.apache.poi.ss.util.cellwalk.TestCellWalk
> Running org.apache.poi.ss.util.TestNumberComparer
> Tests run: 4, Failures: 0, Errors: 0, Skipped: 0, Time elapsed: 0.257 sec
> - in org.apache.poi.ss.util.TestNumberComparer
> Running org.apache.poi.ss.util.TestHSSFCellUtil
> setCellStyleProps start
> setCellStyleProps nearing end
> Tests run: 14, Failures: 0, Errors: 0, Skipped: 0, Time elapsed: 0.016 sec
> - in org.apache.poi.ss.util.TestHSSFCellUtil
> Running org.apache.poi.ss.util.TestRegionUtil
> Tests run: 10, Failures: 0, Errors: 0, Skipped: 0, Time elapsed: 0.025 sec
> - in org.apache.poi.ss.util.TestRegionUtil
> Running org.apache.poi.ss.util.TestCellReference
> Tests run: 25, Failures: 0, Errors: 0, Skipped: 0, Time elapsed: 0.005 sec
> - in org.apache.poi.ss.util.TestCellReference
> Running org.apache.poi.ddf.TestEscherDgRecord
> Tests run: 3, Failures: 0, Errors: 0, Skipped: 0, Time elapsed: 0 sec - in
> org.apache.poi.ddf.TestEscherDgRecord
> Running org.apache.poi.ddf.TestEscherDggRecord
> Tests run: 4, Failures: 0, Errors: 0, Skipped: 0, Time elapsed: 0 sec - in
> org.apache.poi.ddf.TestEscherDggRecord
> Running org.apache.poi.ddf.TestEscherBlipRecord
> Tests run: 4, Failures: 0, Errors: 0, Skipped: 0, Time elapsed: 0.033 sec
> - in org.apache.poi.ddf.TestEscherBlipRecord
> Running org.apache.poi.ddf.TestEscherSpgrRecord
> Tests run: 3, Failures: 0, Errors: 0, Skipped: 0, Time elapsed: 0.001 sec
> - in org.apache.poi.ddf.TestEscherSpgrRecord
> Running org.apache.poi.ddf.TestEscherPropertyFactory
> Tests run: 1, Failures: 0, Errors: 0, Skipped: 0, Time elapsed: 0 sec - in
> org.apache.poi.ddf.TestEscherPropertyFactory
> Running org.apache.poi.ddf.TestEscherBoolProperty
> Tests run: 1, Failures: 0, Errors: 0, Skipped: 0, Time elapsed: 0 sec - in
> org.apache.poi.ddf.TestEscherBoolProperty
> Running org.apache.poi.ddf.TestEscherProperty
> Tests run: 1, Failures: 0, Errors: 0, Skipped: 0, Time elapsed: 0 sec - in
> org.apache.poi.ddf.TestEscherProperty
> Running org.apache.poi.ddf.TestEscherOptRecord
> Tests run: 6, Failures: 0, Errors: 0, Skipped: 0, Time elapsed: 0.001 sec
> - in org.apache.poi.ddf.TestEscherOptRecord
> Running org.apache.poi.ddf.TestUnknownEscherRecord
> Tests run: 3, Failures: 0, Errors: 0, Skipped: 0, Time elapsed: 0.001 sec
> - in org.apache.poi.ddf.TestUnknownEscherRecord
> Running org.apache.poi.ddf.TestEscherClientDataRecord
> Tests run: 3, Failures: 0, Errors: 0, Skipped: 0, Time elapsed: 0.002 sec
> - in org.apache.poi.ddf.TestEscherClientDataRecord
> Running org.apache.poi.ddf.TestEscherSpRecord
> Tests run: 3, Failures: 0, Errors: 0, Skipped: 0, Time elapsed: 0 sec - in
> org.apache.poi.ddf.TestEscherSpRecord
> Running org.apache.poi.ddf.TestEscherClientAnchorRecord
> Tests run: 3, Failures: 0, Errors: 0, Skipped: 0, Time elapsed: 0 sec - in
> org.apache.poi.ddf.TestEscherClientAnchorRecord
> Running org.apache.poi.ddf.TestEscherContainerRecord
> Tests run: 6, Failures: 0, Errors: 0, Skipped: 0, Time elapsed: 0.001 sec
> - in org.apache.poi.ddf.TestEscherContainerRecord
> Running org.apache.poi.ddf.TestEscherBSERecord
> Tests run: 3, Failures: 0, Errors: 0, Skipped: 0, Time elapsed: 0 sec - in
> org.apache.poi.ddf.TestEscherBSERecord
> Running org.apache.poi.ddf.TestEscherDump
> Tests run: 3, Failures: 0, Errors: 0, Skipped: 0, Time elapsed: 0.027 sec
> - in org.apache.poi.ddf.TestEscherDump
> Running org.apache.poi.ddf.TestEscherSplitMenuColorsRecord
> Tests run: 3, Failures: 0, Errors: 0, Skipped: 0, Time elapsed: 0.002 sec
> - in org.apache.poi.ddf.TestEscherSplitMenuColorsRecord
> Running org.apache.poi.ddf.TestEscherChildAnchorRecord
> Tests run: 3, Failures: 0, Errors: 0, Skipped: 0, Time elapsed: 0.002 sec
> - in org.apache.poi.ddf.TestEscherChildAnchorRecord
> Running org.apache.poi.TestPOITestCase
> Tests run: 10, Failures: 0, Errors: 0, Skipped: 3, Time elapsed: 0.006 sec
> - in org.apache.poi.TestPOITestCase
> Running org.apache.poi.sl.draw.geom.TestPresetGeometries
> URL: <
> https://builds.apache.org/job/POI-DSL-Maven/ws/sonar/main/target/classes/org/apache/poi/sl/draw/geom/presetShapeDefinitions.xml
> >
> Tests run: 2, Failures: 0, Errors: 0, Skipped: 0, Time elapsed: 2.776 sec
> - in org.apache.poi.sl.draw.geom.TestPresetGeometries
> Running org.apache.poi.util.TestStaxHelper
> Tests run: 3, Failures: 0, Errors: 0, Skipped: 0, Time elapsed: 0 sec - in
> org.apache.poi.util.TestStaxHelper
> Running org.apache.poi.util.TestIntList
> Tests run: 18, Failures: 0, Errors: 0, Skipped: 0, Time elapsed: 0.043 sec
> - in org.apache.poi.util.TestIntList
> Running org.apache.poi.util.TestHexDump
> 00000000 74 65 73 74 73 74 72 69 6E 67                   teststring
>
> Tests run: 10, Failures: 0, Errors: 0, Skipped: 0, Time elapsed: 0.02 sec
> - in org.apache.poi.util.TestHexDump
> Running org.apache.poi.util.TestByteField
> Tests run: 5, Failures: 0, Errors: 0, Skipped: 0, Time elapsed: 0 sec - in
> org.apache.poi.util.TestByteField
> Running org.apache.poi.util.TestLittleEndian
> Tests run: 14, Failures: 0, Errors: 0, Skipped: 0, Time elapsed: 0.007 sec
> - in org.apache.poi.util.TestLittleEndian
> Running org.apache.poi.util.TestPOILogFactory
> Tests run: 1, Failures: 0, Errors: 0, Skipped: 0, Time elapsed: 0 sec - in
> org.apache.poi.util.TestPOILogFactory
> Running org.apache.poi.util.TestStringUtil
> Tests run: 8, Failures: 0, Errors: 0, Skipped: 0, Time elapsed: 0 sec - in
> org.apache.poi.util.TestStringUtil
> Running org.apache.poi.util.TestTempFile
> Tests run: 4, Failures: 0, Errors: 0, Skipped: 0, Time elapsed: 0 sec - in
> org.apache.poi.util.TestTempFile
> Running org.apache.poi.util.TestArrayUtil
> Tests run: 2, Failures: 0, Errors: 0, Skipped: 0, Time elapsed: 0 sec - in
> org.apache.poi.util.TestArrayUtil
> Running org.apache.poi.util.TestLittleEndianStreams
> Tests run: 2, Failures: 0, Errors: 0, Skipped: 0, Time elapsed: 0.013 sec
> - in org.apache.poi.util.TestLittleEndianStreams
> Running org.apache.poi.util.TestIOUtils
> Tests run: 8, Failures: 0, Errors: 0, Skipped: 0, Time elapsed: 0.002 sec
> - in org.apache.poi.util.TestIOUtils
> Running org.apache.poi.util.TestShortField
> Tests run: 5, Failures: 0, Errors: 0, Skipped: 0, Time elapsed: 0 sec - in
> org.apache.poi.util.TestShortField
> Running org.apache.poi.util.TestLittleEndianCP950Reader
> 65235
> Tests run: 2, Failures: 0, Errors: 0, Skipped: 0, Time elapsed: 0.001 sec
> - in org.apache.poi.util.TestLittleEndianCP950Reader
> Running org.apache.poi.util.TestLongField
> Tests run: 5, Failures: 0, Errors: 0, Skipped: 0, Time elapsed: 0 sec - in
> org.apache.poi.util.TestLongField
> Running org.apache.poi.util.TestIntegerField
> Tests run: 5, Failures: 0, Errors: 0, Skipped: 0, Time elapsed: 0 sec - in
> org.apache.poi.util.TestIntegerField
> Running org.apache.poi.util.TestRLEDecompressingInputStream
> Tests run: 4, Failures: 0, Errors: 0, Skipped: 0, Time elapsed: 0 sec - in
> org.apache.poi.util.TestRLEDecompressingInputStream
> Running org.apache.poi.util.TestBitField
> Tests run: 16, Failures: 0, Errors: 0, Skipped: 0, Time elapsed: 0.003 sec
> - in org.apache.poi.util.TestBitField
> Running org.apache.poi.util.TestLocaleUtil
> Tests run: 3, Failures: 0, Errors: 0, Skipped: 0, Time elapsed: 0.001 sec
> - in org.apache.poi.util.TestLocaleUtil
> Running org.apache.poi.util.TestPOILogger
> Tests run: 1, Failures: 0, Errors: 0, Skipped: 0, Time elapsed: 0 sec - in
> org.apache.poi.util.TestPOILogger
>
> Results :
>
> Tests in error:
>   TestPOIFSProperties.testFail:62->checkFromByteArray:108 » FileNotFound
> no such...
>   TestPOIFSProperties.testOK:82->checkFromByteArray:108 » FileNotFound no
> such e...
>
> Tests run: 6445, Failures: 0, Errors: 2, Skipped: 772
>
> [INFO]
> ------------------------------------------------------------------------
> [INFO] Reactor Summary:
> [INFO]
> [INFO] Apache POI - the Java API for Microsoft Documents . SUCCESS [
> 0.005 s]
> [INFO] Apache POI Main package ........................... FAILURE [03:37
> min]
> [INFO] Apache POI Scratchpad package ..................... SKIPPED
> [INFO] Apache POI - Openxmlformats Schema package ........ SKIPPED
> [INFO] Apache POI - Openxmlformats Encryption Schema package  SKIPPED
> [INFO] Apache POI - Openxmlformats Security-Schema package  SKIPPED
> [INFO] Apache POI OOXML package .......................... SKIPPED
> [INFO] Apache POI ExcelAnt package ....................... SKIPPED
> [INFO] Apache POI Examples package ....................... SKIPPED
> [INFO]
> ------------------------------------------------------------------------
> [INFO] BUILD FAILURE
> [INFO]
> ------------------------------------------------------------------------
> [INFO] Total time: 03:38 min
> [INFO] Finished at: 2017-07-28T20:07:30+00:00
> [INFO] Final Memory: 28M/651M
> [INFO]
> ------------------------------------------------------------------------
> [ERROR] Failed to execute goal
> org.apache.maven.plugins:maven-surefire-plugin:2.19.1:test (default-test)
> on project poi-main: There are test failures.
> [ERROR]
> [ERROR] Please refer to <
> https://builds.apache.org/job/POI-DSL-Maven/ws/sonar/main/target/surefire-reports>
> for the individual test results.
> [ERROR] -> [Help 1]
> [ERROR]
> [ERROR] To see the full stack trace of the errors, re-run Maven with the
> -e switch.
> [ERROR] Re-run Maven using the -X switch to enable full debug logging.
> [ERROR]
> [ERROR] For more information about the errors and possible solutions,
> please read the following articles:
> [ERROR] [Help 1]
> http://cwiki.apache.org/confluence/display/MAVEN/MojoFailureException
> [ERROR]
> [ERROR] After correcting the problems, you can resume the build with the
> command
> [ERROR]   mvn <goals> -rf :poi-main
> Build step 'Invoke top-level Maven targets' marked build as failure
>
> ---------------------------------------------------------------------
> To unsubscribe, e-mail: [hidden email]
> For additional commands, e-mail: [hidden email]
>
>
Reply | Threaded
Open this post in threaded view
|  
Report Content as Inappropriate

Re: Build failed in Jenkins: POI-DSL-Maven #289

kiwiwings
> The two tests in error pass on my local system (Windows 10).
> ...
> Anyone have a clue what is happening?  This is apparently due to some other
> recent change, nothing in my commit would touch this.
So which files differ from your local installation vs. the trunk?

I've done quite some changes to the HPSF classes, but that's already a few weeks ago ...

Andi




signature.asc (495 bytes) Download Attachment
Reply | Threaded
Open this post in threaded view
|  
Report Content as Inappropriate

Re: Build failed in Jenkins: POI-DSL-Maven #289

Greg Woolsey
SVN says I'm fully in sync with HEAD, no local differences.  And it passes
for me, but the Jenkins build failed.

On Fri, Jul 28, 2017 at 3:59 PM Andreas Beeker <[hidden email]> wrote:

> > The two tests in error pass on my local system (Windows 10).
> > ...
> > Anyone have a clue what is happening?  This is apparently due to some
> other
> > recent change, nothing in my commit would touch this.
> So which files differ from your local installation vs. the trunk?
>
> I've done quite some changes to the HPSF classes, but that's already a few
> weeks ago ...
>
> Andi
>
>
>
>
Reply | Threaded
Open this post in threaded view
|  
Report Content as Inappropriate

Re: Build failed in Jenkins: POI-DSL-Maven #289

Dominik Stadler
Hi,

It only seems to happen in the Maven build and only on node "qnode1", not
on other nodes!

I already added some more checks to verify that it works when the file is
read and also when it is adjusted in-memory. Only when the test writes the
data to a byte-array and then reads in the structures again from that, then
the part in question is suddenly missing.

Quite strange... Dominik.

On Sat, Jul 29, 2017 at 1:21 AM, Greg Woolsey <[hidden email]>
wrote:

> SVN says I'm fully in sync with HEAD, no local differences.  And it passes
> for me, but the Jenkins build failed.
>
> On Fri, Jul 28, 2017 at 3:59 PM Andreas Beeker <[hidden email]>
> wrote:
>
> > > The two tests in error pass on my local system (Windows 10).
> > > ...
> > > Anyone have a clue what is happening?  This is apparently due to some
> > other
> > > recent change, nothing in my commit would touch this.
> > So which files differ from your local installation vs. the trunk?
> >
> > I've done quite some changes to the HPSF classes, but that's already a
> few
> > weeks ago ...
> >
> > Andi
> >
> >
> >
> >
>
Reply | Threaded
Open this post in threaded view
|  
Report Content as Inappropriate

Jenkins build is back to normal : POI-DSL-Maven #290

Apache Jenkins Server
In reply to this post by Apache Jenkins Server
See <https://builds.apache.org/job/POI-DSL-Maven/290/display/redirect?page=changes>


---------------------------------------------------------------------
To unsubscribe, e-mail: [hidden email]
For additional commands, e-mail: [hidden email]

Loading...