Build failed in Jenkins: POI-DSL-Maven #279

classic Classic list List threaded Threaded
2 messages Options
Reply | Threaded
Open this post in threaded view
|  
Report Content as Inappropriate

Build failed in Jenkins: POI-DSL-Maven #279

Apache Jenkins Server
See <https://builds.apache.org/job/POI-DSL-Maven/279/display/redirect?page=changes>

Changes:

[kiwiwings] Fonts bugfix

------------------------------------------
[...truncated 148.73 KB...]
Running org.apache.poi.ss.formula.atp.TestWorkdayFunction
Tests run: 12, Failures: 0, Errors: 0, Skipped: 0, Time elapsed: 0.008 sec - in org.apache.poi.ss.formula.atp.TestWorkdayFunction
Running org.apache.poi.ss.formula.atp.TestIfError
Tests run: 1, Failures: 0, Errors: 0, Skipped: 0, Time elapsed: 0 sec - in org.apache.poi.ss.formula.atp.TestIfError
Running org.apache.poi.ss.formula.atp.TestWorkdayCalculator
Tests run: 17, Failures: 0, Errors: 0, Skipped: 0, Time elapsed: 0.01 sec - in org.apache.poi.ss.formula.atp.TestWorkdayCalculator
Running org.apache.poi.ss.formula.atp.TestYearFracCalculatorFromSpreadsheet
Tests run: 1, Failures: 0, Errors: 0, Skipped: 0, Time elapsed: 0.035 sec - in org.apache.poi.ss.formula.atp.TestYearFracCalculatorFromSpreadsheet
Running org.apache.poi.ss.formula.atp.TestYearFracCalculator
Tests run: 1, Failures: 0, Errors: 0, Skipped: 0, Time elapsed: 0 sec - in org.apache.poi.ss.formula.atp.TestYearFracCalculator
Running org.apache.poi.ss.formula.atp.TestDateParser
Tests run: 5, Failures: 0, Errors: 0, Skipped: 0, Time elapsed: 0.001 sec - in org.apache.poi.ss.formula.atp.TestDateParser
Running org.apache.poi.ss.formula.atp.TestRandBetween
Tests run: 6, Failures: 0, Errors: 0, Skipped: 0, Time elapsed: 0.015 sec - in org.apache.poi.ss.formula.atp.TestRandBetween
Running org.apache.poi.ss.formula.TestPlainCellCache
Tests run: 1, Failures: 0, Errors: 0, Skipped: 0, Time elapsed: 1.324 sec - in org.apache.poi.ss.formula.TestPlainCellCache
Running org.apache.poi.ss.formula.constant.TestConstantValueParser
Tests run: 3, Failures: 0, Errors: 0, Skipped: 0, Time elapsed: 0 sec - in org.apache.poi.ss.formula.constant.TestConstantValueParser
Running org.apache.poi.ss.formula.udf.TestDefaultUDFFinder
Tests run: 1, Failures: 0, Errors: 0, Skipped: 0, Time elapsed: 0 sec - in org.apache.poi.ss.formula.udf.TestDefaultUDFFinder
Running org.apache.poi.ss.formula.udf.TestAggregatingUDFFinder
Tests run: 2, Failures: 0, Errors: 0, Skipped: 0, Time elapsed: 0 sec - in org.apache.poi.ss.formula.udf.TestAggregatingUDFFinder
Running org.apache.poi.ss.formula.TestFormulaShifter
Tests run: 11, Failures: 0, Errors: 0, Skipped: 0, Time elapsed: 0.001 sec - in org.apache.poi.ss.formula.TestFormulaShifter
Running org.apache.poi.ss.formula.TestMissingWorkbook
Tests run: 3, Failures: 0, Errors: 0, Skipped: 0, Time elapsed: 0.001 sec - in org.apache.poi.ss.formula.TestMissingWorkbook
Running org.apache.poi.ss.formula.TestWorkbookEvaluator
Tests run: 22, Failures: 0, Errors: 0, Skipped: 4, Time elapsed: 0.035 sec - in org.apache.poi.ss.formula.TestWorkbookEvaluator
Running org.apache.poi.ss.formula.TestEvaluationCache
Tests run: 8, Failures: 0, Errors: 0, Skipped: 0, Time elapsed: 10.044 sec - in org.apache.poi.ss.formula.TestEvaluationCache
Running org.apache.poi.ss.formula.ptg.TestArrayPtg
Tests run: 5, Failures: 0, Errors: 0, Skipped: 0, Time elapsed: 0.001 sec - in org.apache.poi.ss.formula.ptg.TestArrayPtg
Running org.apache.poi.ss.formula.ptg.TestIntersectionPtg
Tests run: 1, Failures: 0, Errors: 0, Skipped: 0, Time elapsed: 0 sec - in org.apache.poi.ss.formula.ptg.TestIntersectionPtg
Running org.apache.poi.ss.formula.ptg.TestExternalNameReference
Tests run: 3, Failures: 0, Errors: 0, Skipped: 0, Time elapsed: 0.007 sec - in org.apache.poi.ss.formula.ptg.TestExternalNameReference
Running org.apache.poi.ss.formula.ptg.TestExternalFunctionFormulas
Tests run: 3, Failures: 0, Errors: 0, Skipped: 0, Time elapsed: 0.004 sec - in org.apache.poi.ss.formula.ptg.TestExternalFunctionFormulas
Running org.apache.poi.ss.formula.ptg.TestFuncVarPtg
Tests run: 1, Failures: 0, Errors: 0, Skipped: 0, Time elapsed: 0 sec - in org.apache.poi.ss.formula.ptg.TestFuncVarPtg
Running org.apache.poi.ss.formula.ptg.TestAbstractFunctionPtg
Tests run: 3, Failures: 0, Errors: 0, Skipped: 0, Time elapsed: 0 sec - in org.apache.poi.ss.formula.ptg.TestAbstractFunctionPtg
Running org.apache.poi.ss.formula.ptg.TestErrPtg
Tests run: 1, Failures: 0, Errors: 0, Skipped: 0, Time elapsed: 0.001 sec - in org.apache.poi.ss.formula.ptg.TestErrPtg
Running org.apache.poi.ss.formula.ptg.TestFuncPtg
Tests run: 2, Failures: 0, Errors: 0, Skipped: 0, Time elapsed: 0 sec - in org.apache.poi.ss.formula.ptg.TestFuncPtg
Running org.apache.poi.ss.formula.ptg.TestRangePtg
Tests run: 1, Failures: 0, Errors: 0, Skipped: 0, Time elapsed: 0 sec - in org.apache.poi.ss.formula.ptg.TestRangePtg
Running org.apache.poi.ss.formula.ptg.TestPercentPtg
Tests run: 1, Failures: 0, Errors: 0, Skipped: 0, Time elapsed: 0 sec - in org.apache.poi.ss.formula.ptg.TestPercentPtg
Running org.apache.poi.ss.formula.ptg.TestAreaPtg
Tests run: 5, Failures: 0, Errors: 0, Skipped: 0, Time elapsed: 0 sec - in org.apache.poi.ss.formula.ptg.TestAreaPtg
Running org.apache.poi.ss.formula.ptg.TestUnionPtg
Tests run: 1, Failures: 0, Errors: 0, Skipped: 0, Time elapsed: 0 sec - in org.apache.poi.ss.formula.ptg.TestUnionPtg
Running org.apache.poi.ss.formula.ptg.TestReferencePtg
Tests run: 4, Failures: 0, Errors: 0, Skipped: 0, Time elapsed: 0.011 sec - in org.apache.poi.ss.formula.ptg.TestReferencePtg
Running org.apache.poi.ss.formula.ptg.TestAttrPtg
Tests run: 1, Failures: 0, Errors: 0, Skipped: 0, Time elapsed: 0 sec - in org.apache.poi.ss.formula.ptg.TestAttrPtg
Running org.apache.poi.ss.formula.ptg.TestRef3DPtg
Tests run: 1, Failures: 0, Errors: 0, Skipped: 0, Time elapsed: 0.001 sec - in org.apache.poi.ss.formula.ptg.TestRef3DPtg
Running org.apache.poi.ss.formula.ptg.TestAreaErrPtg
Tests run: 1, Failures: 0, Errors: 0, Skipped: 0, Time elapsed: 0 sec - in org.apache.poi.ss.formula.ptg.TestAreaErrPtg
Running org.apache.poi.ss.formula.ptg.TestArea3DPtg
Tests run: 1, Failures: 0, Errors: 0, Skipped: 0, Time elapsed: 0 sec - in org.apache.poi.ss.formula.ptg.TestArea3DPtg
Running org.apache.poi.ss.usermodel.TestFractionFormat
Tests run: 2, Failures: 0, Errors: 0, Skipped: 0, Time elapsed: 0.29 sec - in org.apache.poi.ss.usermodel.TestFractionFormat
Running org.apache.poi.ss.usermodel.charts.TestDataSources
Tests run: 6, Failures: 0, Errors: 0, Skipped: 0, Time elapsed: 0.007 sec - in org.apache.poi.ss.usermodel.charts.TestDataSources
Running org.apache.poi.ss.usermodel.TestExcelStyleDateFormatter
Tests run: 4, Failures: 0, Errors: 0, Skipped: 0, Time elapsed: 0.028 sec - in org.apache.poi.ss.usermodel.TestExcelStyleDateFormatter
Running org.apache.poi.ss.usermodel.TestDateUtil
Tests run: 5, Failures: 0, Errors: 0, Skipped: 0, Time elapsed: 0 sec - in org.apache.poi.ss.usermodel.TestDateUtil
Running org.apache.poi.ss.usermodel.TestIndexedColors
Tests run: 3, Failures: 0, Errors: 0, Skipped: 0, Time elapsed: 0 sec - in org.apache.poi.ss.usermodel.TestIndexedColors
Running org.apache.poi.ss.usermodel.TestDataFormatter
Tests run: 33, Failures: 0, Errors: 0, Skipped: 1, Time elapsed: 0.081 sec - in org.apache.poi.ss.usermodel.TestDataFormatter
Running org.apache.poi.ss.usermodel.TestHSSFBorderStyle
Tests run: 1, Failures: 0, Errors: 0, Skipped: 0, Time elapsed: 0 sec - in org.apache.poi.ss.usermodel.TestHSSFBorderStyle
Running org.apache.poi.ss.TestSpreadsheetVersion
Tests run: 2, Failures: 0, Errors: 0, Skipped: 0, Time elapsed: 0 sec - in org.apache.poi.ss.TestSpreadsheetVersion
Running org.apache.poi.ss.util.TestWorkbookUtil
Tests run: 1, Failures: 0, Errors: 0, Skipped: 0, Time elapsed: 0 sec - in org.apache.poi.ss.util.TestWorkbookUtil
Running org.apache.poi.ss.util.TestCellAddress
Tests run: 6, Failures: 0, Errors: 0, Skipped: 0, Time elapsed: 0 sec - in org.apache.poi.ss.util.TestCellAddress
Running org.apache.poi.ss.util.TestSheetBuilder
Tests run: 3, Failures: 0, Errors: 0, Skipped: 0, Time elapsed: 0 sec - in org.apache.poi.ss.util.TestSheetBuilder
Running org.apache.poi.ss.util.TestSheetUtil
Tests run: 7, Failures: 0, Errors: 0, Skipped: 0, Time elapsed: 0.001 sec - in org.apache.poi.ss.util.TestSheetUtil
Running org.apache.poi.ss.util.TestExpandedDouble
Tests run: 3, Failures: 0, Errors: 0, Skipped: 0, Time elapsed: 0.005 sec - in org.apache.poi.ss.util.TestExpandedDouble
Running org.apache.poi.ss.util.TestAreaReference
Tests run: 2, Failures: 0, Errors: 0, Skipped: 0, Time elapsed: 0 sec - in org.apache.poi.ss.util.TestAreaReference
Running org.apache.poi.ss.util.TestPropertyTemplate
Tests run: 8, Failures: 0, Errors: 0, Skipped: 0, Time elapsed: 0.035 sec - in org.apache.poi.ss.util.TestPropertyTemplate
Running org.apache.poi.ss.util.TestCellRangeAddress
Tests run: 13, Failures: 0, Errors: 0, Skipped: 0, Time elapsed: 0.002 sec - in org.apache.poi.ss.util.TestCellRangeAddress
Running org.apache.poi.ss.util.TestDateFormatConverter
Open /tmp/poifiles/LocaleDatesDefault5345369969819102455.xlsx in Excel
Open /tmp/poifiles/LocaleDatesShort3020882018086343709.xlsx in Excel
Open /tmp/poifiles/LocaleDatesMedium9181196160819701870.xlsx in Excel
Open /tmp/poifiles/LocaleDatesLong1121092126700291749.xlsx in Excel
Open /tmp/poifiles/LocaleDatesFull7128984972362631834.xlsx in Excel
Open /tmp/poifiles/LocaleDateTimesDefault6768961697701166021.xlsx in Excel
Open /tmp/poifiles/LocaleDateTimesShort4961806819424043808.xlsx in Excel
Open /tmp/poifiles/LocaleDateTimesMedium8673056756065751377.xlsx in Excel
Open /tmp/poifiles/LocaleDateTimesLong2402945836234782640.xlsx in Excel
Open /tmp/poifiles/LocaleDateTimesFull1547157426767746137.xlsx in Excel
Open /tmp/poifiles/LocaleTimesDefault6279975738043370283.xlsx in Excel
Open /tmp/poifiles/LocaleTimesShort676846965122806975.xlsx in Excel
Open /tmp/poifiles/LocaleTimesMedium7491947905101738434.xlsx in Excel
Open /tmp/poifiles/LocaleTimesLong4213508514120836327.xlsx in Excel
Open /tmp/poifiles/LocaleTimesFull351599840192562570.xlsx in Excel
Tests run: 2, Failures: 0, Errors: 0, Skipped: 0, Time elapsed: 1.636 sec - in org.apache.poi.ss.util.TestDateFormatConverter
Running org.apache.poi.ss.util.TestNumberToTextConverter
Tests run: 2, Failures: 0, Errors: 0, Skipped: 0, Time elapsed: 0.009 sec - in org.apache.poi.ss.util.TestNumberToTextConverter
Running org.apache.poi.ss.util.cellwalk.TestCellWalk
Tests run: 1, Failures: 0, Errors: 0, Skipped: 0, Time elapsed: 0.001 sec - in org.apache.poi.ss.util.cellwalk.TestCellWalk
Running org.apache.poi.ss.util.TestNumberComparer
Tests run: 4, Failures: 0, Errors: 0, Skipped: 0, Time elapsed: 0.205 sec - in org.apache.poi.ss.util.TestNumberComparer
Running org.apache.poi.ss.util.TestHSSFCellUtil
setCellStyleProps start
setCellStyleProps nearing end
Tests run: 14, Failures: 0, Errors: 0, Skipped: 0, Time elapsed: 0.001 sec - in org.apache.poi.ss.util.TestHSSFCellUtil
Running org.apache.poi.ss.util.TestRegionUtil
Tests run: 10, Failures: 0, Errors: 0, Skipped: 0, Time elapsed: 0.017 sec - in org.apache.poi.ss.util.TestRegionUtil
Running org.apache.poi.ss.util.TestCellReference
Tests run: 25, Failures: 0, Errors: 0, Skipped: 0, Time elapsed: 0.004 sec - in org.apache.poi.ss.util.TestCellReference
Running org.apache.poi.ddf.TestEscherDgRecord
Tests run: 3, Failures: 0, Errors: 0, Skipped: 0, Time elapsed: 0.001 sec - in org.apache.poi.ddf.TestEscherDgRecord
Running org.apache.poi.ddf.TestEscherDggRecord
Tests run: 4, Failures: 0, Errors: 0, Skipped: 0, Time elapsed: 0 sec - in org.apache.poi.ddf.TestEscherDggRecord
Running org.apache.poi.ddf.TestEscherBlipRecord
Tests run: 4, Failures: 0, Errors: 0, Skipped: 0, Time elapsed: 0.03 sec - in org.apache.poi.ddf.TestEscherBlipRecord
Running org.apache.poi.ddf.TestEscherSpgrRecord
Tests run: 3, Failures: 0, Errors: 0, Skipped: 0, Time elapsed: 0 sec - in org.apache.poi.ddf.TestEscherSpgrRecord
Running org.apache.poi.ddf.TestEscherPropertyFactory
Tests run: 1, Failures: 0, Errors: 0, Skipped: 0, Time elapsed: 0.001 sec - in org.apache.poi.ddf.TestEscherPropertyFactory
Running org.apache.poi.ddf.TestEscherBoolProperty
Tests run: 1, Failures: 0, Errors: 0, Skipped: 0, Time elapsed: 0 sec - in org.apache.poi.ddf.TestEscherBoolProperty
Running org.apache.poi.ddf.TestEscherProperty
Tests run: 1, Failures: 0, Errors: 0, Skipped: 0, Time elapsed: 0 sec - in org.apache.poi.ddf.TestEscherProperty
Running org.apache.poi.ddf.TestEscherOptRecord
Tests run: 6, Failures: 0, Errors: 0, Skipped: 0, Time elapsed: 0 sec - in org.apache.poi.ddf.TestEscherOptRecord
Running org.apache.poi.ddf.TestUnknownEscherRecord
Tests run: 3, Failures: 0, Errors: 0, Skipped: 0, Time elapsed: 0 sec - in org.apache.poi.ddf.TestUnknownEscherRecord
Running org.apache.poi.ddf.TestEscherClientDataRecord
Tests run: 3, Failures: 0, Errors: 0, Skipped: 0, Time elapsed: 0 sec - in org.apache.poi.ddf.TestEscherClientDataRecord
Running org.apache.poi.ddf.TestEscherSpRecord
Tests run: 3, Failures: 0, Errors: 0, Skipped: 0, Time elapsed: 0 sec - in org.apache.poi.ddf.TestEscherSpRecord
Running org.apache.poi.ddf.TestEscherClientAnchorRecord
Tests run: 3, Failures: 0, Errors: 0, Skipped: 0, Time elapsed: 0 sec - in org.apache.poi.ddf.TestEscherClientAnchorRecord
Running org.apache.poi.ddf.TestEscherContainerRecord
Tests run: 6, Failures: 0, Errors: 0, Skipped: 0, Time elapsed: 0 sec - in org.apache.poi.ddf.TestEscherContainerRecord
Running org.apache.poi.ddf.TestEscherBSERecord
Tests run: 3, Failures: 0, Errors: 0, Skipped: 0, Time elapsed: 0 sec - in org.apache.poi.ddf.TestEscherBSERecord
Running org.apache.poi.ddf.TestEscherDump
Tests run: 3, Failures: 0, Errors: 0, Skipped: 0, Time elapsed: 0.027 sec - in org.apache.poi.ddf.TestEscherDump
Running org.apache.poi.ddf.TestEscherSplitMenuColorsRecord
Tests run: 3, Failures: 0, Errors: 0, Skipped: 0, Time elapsed: 0 sec - in org.apache.poi.ddf.TestEscherSplitMenuColorsRecord
Running org.apache.poi.ddf.TestEscherChildAnchorRecord
Tests run: 3, Failures: 0, Errors: 0, Skipped: 0, Time elapsed: 0 sec - in org.apache.poi.ddf.TestEscherChildAnchorRecord
Running org.apache.poi.TestPOITestCase
Tests run: 10, Failures: 0, Errors: 0, Skipped: 3, Time elapsed: 0 sec - in org.apache.poi.TestPOITestCase
Running org.apache.poi.sl.draw.geom.TestPresetGeometries
URL: <https://builds.apache.org/job/POI-DSL-Maven/ws/sonar/main/target/classes/org/apache/poi/sl/draw/geom/presetShapeDefinitions.xml>
Tests run: 2, Failures: 0, Errors: 0, Skipped: 0, Time elapsed: 2.291 sec - in org.apache.poi.sl.draw.geom.TestPresetGeometries
Running org.apache.poi.util.TestStaxHelper
Tests run: 3, Failures: 0, Errors: 0, Skipped: 0, Time elapsed: 0.004 sec - in org.apache.poi.util.TestStaxHelper
Running org.apache.poi.util.TestIntList
Tests run: 18, Failures: 0, Errors: 0, Skipped: 0, Time elapsed: 0.044 sec - in org.apache.poi.util.TestIntList
Running org.apache.poi.util.TestHexDump
00000000 74 65 73 74 73 74 72 69 6E 67                   teststring

Tests run: 10, Failures: 0, Errors: 0, Skipped: 0, Time elapsed: 0.023 sec - in org.apache.poi.util.TestHexDump
Running org.apache.poi.util.TestByteField
Tests run: 5, Failures: 0, Errors: 0, Skipped: 0, Time elapsed: 0 sec - in org.apache.poi.util.TestByteField
Running org.apache.poi.util.TestLittleEndian
Tests run: 14, Failures: 0, Errors: 0, Skipped: 0, Time elapsed: 0.001 sec - in org.apache.poi.util.TestLittleEndian
Running org.apache.poi.util.TestPOILogFactory
Tests run: 1, Failures: 0, Errors: 0, Skipped: 0, Time elapsed: 0.001 sec - in org.apache.poi.util.TestPOILogFactory
Running org.apache.poi.util.TestStringUtil
Tests run: 8, Failures: 0, Errors: 0, Skipped: 0, Time elapsed: 0 sec - in org.apache.poi.util.TestStringUtil
Running org.apache.poi.util.TestTempFile
Tests run: 4, Failures: 0, Errors: 0, Skipped: 0, Time elapsed: 0.004 sec - in org.apache.poi.util.TestTempFile
Running org.apache.poi.util.TestArrayUtil
Tests run: 2, Failures: 0, Errors: 0, Skipped: 0, Time elapsed: 0.001 sec - in org.apache.poi.util.TestArrayUtil
Running org.apache.poi.util.TestLittleEndianStreams
Tests run: 2, Failures: 0, Errors: 0, Skipped: 0, Time elapsed: 0.022 sec - in org.apache.poi.util.TestLittleEndianStreams
Running org.apache.poi.util.TestIOUtils
Tests run: 8, Failures: 0, Errors: 0, Skipped: 0, Time elapsed: 0 sec - in org.apache.poi.util.TestIOUtils
Running org.apache.poi.util.TestShortField
Tests run: 5, Failures: 0, Errors: 0, Skipped: 0, Time elapsed: 0 sec - in org.apache.poi.util.TestShortField
Running org.apache.poi.util.TestLittleEndianCP950Reader
65235
Tests run: 2, Failures: 0, Errors: 0, Skipped: 0, Time elapsed: 0.001 sec - in org.apache.poi.util.TestLittleEndianCP950Reader
Running org.apache.poi.util.TestLongField
Tests run: 5, Failures: 0, Errors: 0, Skipped: 0, Time elapsed: 0 sec - in org.apache.poi.util.TestLongField
Running org.apache.poi.util.TestIntegerField
Tests run: 5, Failures: 0, Errors: 0, Skipped: 0, Time elapsed: 0 sec - in org.apache.poi.util.TestIntegerField
Running org.apache.poi.util.TestRLEDecompressingInputStream
Tests run: 4, Failures: 0, Errors: 0, Skipped: 0, Time elapsed: 0.001 sec - in org.apache.poi.util.TestRLEDecompressingInputStream
Running org.apache.poi.util.TestBitField
Tests run: 16, Failures: 0, Errors: 0, Skipped: 0, Time elapsed: 0.002 sec - in org.apache.poi.util.TestBitField
Running org.apache.poi.util.TestLocaleUtil
Tests run: 3, Failures: 0, Errors: 0, Skipped: 0, Time elapsed: 0 sec - in org.apache.poi.util.TestLocaleUtil
Running org.apache.poi.util.TestPOILogger
Tests run: 1, Failures: 0, Errors: 0, Skipped: 0, Time elapsed: 0.004 sec - in org.apache.poi.util.TestPOILogger

Results :

Tests in error:
  TestPOIFSProperties.testFail:62 » FileNotFound no such entry: "SummaryInforma...
  TestPOIFSProperties.testOK:91 » FileNotFound no such entry: "SummaryInformati...

Tests run: 6445, Failures: 0, Errors: 2, Skipped: 772

[INFO] ------------------------------------------------------------------------
[INFO] Reactor Summary:
[INFO]
[INFO] Apache POI - the Java API for Microsoft Documents . SUCCESS [  0.005 s]
[INFO] Apache POI Main package ........................... FAILURE [03:34 min]
[INFO] Apache POI Scratchpad package ..................... SKIPPED
[INFO] Apache POI - Openxmlformats Schema package ........ SKIPPED
[INFO] Apache POI - Openxmlformats Encryption Schema package  SKIPPED
[INFO] Apache POI - Openxmlformats Security-Schema package  SKIPPED
[INFO] Apache POI OOXML package .......................... SKIPPED
[INFO] Apache POI ExcelAnt package ....................... SKIPPED
[INFO] Apache POI Examples package ....................... SKIPPED
[INFO] ------------------------------------------------------------------------
[INFO] BUILD FAILURE
[INFO] ------------------------------------------------------------------------
[INFO] Total time: 03:35 min
[INFO] Finished at: 2017-07-24T08:08:04+00:00
[INFO] Final Memory: 30M/764M
[INFO] ------------------------------------------------------------------------
[ERROR] Failed to execute goal org.apache.maven.plugins:maven-surefire-plugin:2.19.1:test (default-test) on project poi-main: There are test failures.
[ERROR]
[ERROR] Please refer to <https://builds.apache.org/job/POI-DSL-Maven/ws/sonar/main/target/surefire-reports> for the individual test results.
[ERROR] -> [Help 1]
[ERROR]
[ERROR] To see the full stack trace of the errors, re-run Maven with the -e switch.
[ERROR] Re-run Maven using the -X switch to enable full debug logging.
[ERROR]
[ERROR] For more information about the errors and possible solutions, please read the following articles:
[ERROR] [Help 1] http://cwiki.apache.org/confluence/display/MAVEN/MojoFailureException
[ERROR]
[ERROR] After correcting the problems, you can resume the build with the command
[ERROR]   mvn <goals> -rf :poi-main
Build step 'Invoke top-level Maven targets' marked build as failure

---------------------------------------------------------------------
To unsubscribe, e-mail: [hidden email]
For additional commands, e-mail: [hidden email]

Reply | Threaded
Open this post in threaded view
|  
Report Content as Inappropriate

Jenkins build is back to normal : POI-DSL-Maven #280

Apache Jenkins Server
See <https://builds.apache.org/job/POI-DSL-Maven/280/display/redirect?page=changes>


---------------------------------------------------------------------
To unsubscribe, e-mail: [hidden email]
For additional commands, e-mail: [hidden email]

Loading...