Build failed in Jenkins: POI-DSL-Maven #274

classic Classic list List threaded Threaded
2 messages Options
Reply | Threaded
Open this post in threaded view
|  
Report Content as Inappropriate

Build failed in Jenkins: POI-DSL-Maven #274

Apache Jenkins Server
See <https://builds.apache.org/job/POI-DSL-Maven/274/display/redirect?page=changes>

Changes:

[fanningpj] javadoc: replace invalid self enclosing elements

------------------------------------------
[...truncated 1.22 MB...]
Tests run: 11, Failures: 0, Errors: 0, Skipped: 0, Time elapsed: 0.277 sec - in org.apache.poi.TestPOIXMLDocument
Running org.apache.poi.xslf.TestXSLFSlideShow
Tests run: 5, Failures: 0, Errors: 0, Skipped: 0, Time elapsed: 0.095 sec - in org.apache.poi.xslf.TestXSLFSlideShow
Running org.apache.poi.xslf.TestXSLFBugs
Tests run: 20, Failures: 0, Errors: 0, Skipped: 1, Time elapsed: 1.367 sec - in org.apache.poi.xslf.TestXSLFBugs
Running org.apache.poi.xslf.usermodel.TestXSLFColor
Tests run: 6, Failures: 0, Errors: 0, Skipped: 0, Time elapsed: 0.044 sec - in org.apache.poi.xslf.usermodel.TestXSLFColor
Running org.apache.poi.xslf.usermodel.TestXSLFTextParagraph
Tests run: 5, Failures: 0, Errors: 0, Skipped: 1, Time elapsed: 0.064 sec - in org.apache.poi.xslf.usermodel.TestXSLFTextParagraph
Running org.apache.poi.xslf.usermodel.TestXSLFTableRow
Tests run: 7, Failures: 0, Errors: 0, Skipped: 0, Time elapsed: 0.159 sec - in org.apache.poi.xslf.usermodel.TestXSLFTableRow
Running org.apache.poi.xslf.usermodel.TestXSLFSheet
Tests run: 1, Failures: 0, Errors: 0, Skipped: 0, Time elapsed: 0.046 sec - in org.apache.poi.xslf.usermodel.TestXSLFSheet
Running org.apache.poi.xslf.usermodel.TestPPTX2PNG
Tests run: 10, Failures: 0, Errors: 0, Skipped: 0, Time elapsed: 6.788 sec - in org.apache.poi.xslf.usermodel.TestPPTX2PNG
Running org.apache.poi.xslf.usermodel.TestXSLFTextBox
Tests run: 2, Failures: 0, Errors: 0, Skipped: 0, Time elapsed: 0.031 sec - in org.apache.poi.xslf.usermodel.TestXSLFTextBox
Running org.apache.poi.xslf.usermodel.TestXSLFTextShape
Tests run: 4, Failures: 0, Errors: 0, Skipped: 0, Time elapsed: 0.086 sec - in org.apache.poi.xslf.usermodel.TestXSLFTextShape
Running org.apache.poi.xslf.usermodel.TestXSLFShape
Tests run: 2, Failures: 0, Errors: 0, Skipped: 0, Time elapsed: 0.036 sec - in org.apache.poi.xslf.usermodel.TestXSLFShape
Running org.apache.poi.xslf.usermodel.TestXMLSlideShow
Tests run: 9, Failures: 0, Errors: 0, Skipped: 0, Time elapsed: 0.215 sec - in org.apache.poi.xslf.usermodel.TestXMLSlideShow
Running org.apache.poi.xslf.usermodel.TestXSLFTable
Tests run: 5, Failures: 0, Errors: 0, Skipped: 0, Time elapsed: 1.691 sec - in org.apache.poi.xslf.usermodel.TestXSLFTable
Running org.apache.poi.xslf.usermodel.TestXSLFGroupShape
Tests run: 2, Failures: 0, Errors: 0, Skipped: 0, Time elapsed: 0.031 sec - in org.apache.poi.xslf.usermodel.TestXSLFGroupShape
Running org.apache.poi.xslf.usermodel.TestXSLFAutoShape
Tests run: 4, Failures: 0, Errors: 0, Skipped: 0, Time elapsed: 0.061 sec - in org.apache.poi.xslf.usermodel.TestXSLFAutoShape
Running org.apache.poi.xslf.usermodel.TestXSLFSlide
Tests run: 4, Failures: 0, Errors: 0, Skipped: 0, Time elapsed: 0.559 sec - in org.apache.poi.xslf.usermodel.TestXSLFSlide
Running org.apache.poi.xslf.usermodel.TestXSLFTableStyles
Tests run: 1, Failures: 0, Errors: 0, Skipped: 0, Time elapsed: 0.013 sec - in org.apache.poi.xslf.usermodel.TestXSLFTableStyles
Running org.apache.poi.xslf.usermodel.TestXSLFChart
Tests run: 1, Failures: 0, Errors: 0, Skipped: 0, Time elapsed: 0.028 sec - in org.apache.poi.xslf.usermodel.TestXSLFChart
Running org.apache.poi.xslf.usermodel.TestXSLFSlideShowFactory
Tests run: 6, Failures: 0, Errors: 0, Skipped: 0, Time elapsed: 0.393 sec - in org.apache.poi.xslf.usermodel.TestXSLFSlideShowFactory
Running org.apache.poi.xslf.usermodel.TestXSLFShapeContainer
Tests run: 1, Failures: 0, Errors: 0, Skipped: 0, Time elapsed: 0.015 sec - in org.apache.poi.xslf.usermodel.TestXSLFShapeContainer
Running org.apache.poi.xslf.usermodel.TestXSLFHyperlink
Tests run: 3, Failures: 0, Errors: 0, Skipped: 0, Time elapsed: 0.083 sec - in org.apache.poi.xslf.usermodel.TestXSLFHyperlink
Running org.apache.poi.xslf.usermodel.TestXSLFNotes
Tests run: 3, Failures: 0, Errors: 0, Skipped: 0, Time elapsed: 0.061 sec - in org.apache.poi.xslf.usermodel.TestXSLFNotes
Running org.apache.poi.xslf.usermodel.TestXSLFSlideShow
Tests run: 6, Failures: 0, Errors: 0, Skipped: 0, Time elapsed: 0.142 sec - in org.apache.poi.xslf.usermodel.TestXSLFSlideShow
Running org.apache.poi.xslf.usermodel.TestXSLFTextRun
Tests run: 1, Failures: 0, Errors: 0, Skipped: 0, Time elapsed: 0.015 sec - in org.apache.poi.xslf.usermodel.TestXSLFTextRun
Running org.apache.poi.xslf.usermodel.TestXSLFFreeformShape
Tests run: 1, Failures: 0, Errors: 0, Skipped: 0, Time elapsed: 0.021 sec - in org.apache.poi.xslf.usermodel.TestXSLFFreeformShape
Running org.apache.poi.xslf.usermodel.TestXSLFConnectorShape
Tests run: 2, Failures: 0, Errors: 0, Skipped: 0, Time elapsed: 0.029 sec - in org.apache.poi.xslf.usermodel.TestXSLFConnectorShape
Running org.apache.poi.xslf.usermodel.TestXSLFSimpleShape
Tests run: 8, Failures: 0, Errors: 0, Skipped: 0, Time elapsed: 2.409 sec - in org.apache.poi.xslf.usermodel.TestXSLFSimpleShape
Running org.apache.poi.xslf.usermodel.TestXSLFTheme
Tests run: 1, Failures: 0, Errors: 0, Skipped: 0, Time elapsed: 0.108 sec - in org.apache.poi.xslf.usermodel.TestXSLFTheme
Running org.apache.poi.xslf.usermodel.TestXSLFPictureShape
Tests run: 6, Failures: 0, Errors: 0, Skipped: 0, Time elapsed: 0.232 sec - in org.apache.poi.xslf.usermodel.TestXSLFPictureShape
Running org.apache.poi.xslf.extractor.TestXSLFPowerPointExtractor
Tests run: 5, Failures: 0, Errors: 0, Skipped: 0, Time elapsed: 0.199 sec - in org.apache.poi.xslf.extractor.TestXSLFPowerPointExtractor
Running org.apache.poi.xslf.geom.TestFormulaParser
Tests run: 1, Failures: 0, Errors: 0, Skipped: 0, Time elapsed: 0 sec - in org.apache.poi.xslf.geom.TestFormulaParser
Running org.apache.poi.dev.TestOOXMLLister
<https://builds.apache.org/job/POI-DSL-Maven/ws/test-data/spreadsheet/Formatting.xlsx>

/_rels/.rels
        application/vnd.openxmlformats-package.relationships+xml
        588 bytes
/docProps/app.xml
        application/vnd.openxmlformats-officedocument.extended-properties+xml
        839 bytes
        0 relations
/docProps/core.xml
        application/vnd.openxmlformats-package.core-properties+xml
        0 relations
/xl/_rels/workbook.xml.rels
        application/vnd.openxmlformats-package.relationships+xml
        980 bytes
/xl/sharedStrings.xml
        application/vnd.openxmlformats-officedocument.spreadsheetml.sharedStrings+xml
        477 bytes
        0 relations
/xl/styles.xml
        application/vnd.openxmlformats-officedocument.spreadsheetml.styles+xml
        2237 bytes
        0 relations
/xl/theme/theme1.xml
        application/vnd.openxmlformats-officedocument.theme+xml
        6995 bytes
        0 relations
/xl/workbook.xml
        application/vnd.openxmlformats-officedocument.spreadsheetml.sheet.main+xml
        624 bytes
        6 relations
          Relationship:
          From: /xl/workbook.xml
          To:   /xl/worksheets/sheet1.xml
          ID:   rId1
          Mode: INTERNAL
          Type: http://schemas.openxmlformats.org/officeDocument/2006/relationships/worksheet
          Relationship:
          From: /xl/workbook.xml
          To:   /xl/worksheets/sheet2.xml
          ID:   rId2
          Mode: INTERNAL
          Type: http://schemas.openxmlformats.org/officeDocument/2006/relationships/worksheet
          Relationship:
          From: /xl/workbook.xml
          To:   /xl/worksheets/sheet3.xml
          ID:   rId3
          Mode: INTERNAL
          Type: http://schemas.openxmlformats.org/officeDocument/2006/relationships/worksheet
          Relationship:
          From: /xl/workbook.xml
          To:   /xl/theme/theme1.xml
          ID:   rId4
          Mode: INTERNAL
          Type: http://schemas.openxmlformats.org/officeDocument/2006/relationships/theme
          Relationship:
          From: /xl/workbook.xml
          To:   /xl/styles.xml
          ID:   rId5
          Mode: INTERNAL
          Type: http://schemas.openxmlformats.org/officeDocument/2006/relationships/styles
          Relationship:
          From: /xl/workbook.xml
          To:   /xl/sharedStrings.xml
          ID:   rId6
          Mode: INTERNAL
          Type: http://schemas.openxmlformats.org/officeDocument/2006/relationships/sharedStrings
/xl/worksheets/sheet1.xml
        application/vnd.openxmlformats-officedocument.spreadsheetml.worksheet+xml
        1814 bytes
        0 relations
/xl/worksheets/sheet2.xml
        application/vnd.openxmlformats-officedocument.spreadsheetml.worksheet+xml
        439 bytes
        0 relations
/xl/worksheets/sheet3.xml
        application/vnd.openxmlformats-officedocument.spreadsheetml.worksheet+xml
        439 bytes
        0 relations

Relationship:
        From: /
        To:   /xl/workbook.xml
        ID:   rId1
        Mode: INTERNAL
        Type: http://schemas.openxmlformats.org/officeDocument/2006/relationships/officeDocument
Relationship:
        From: /
        To:   /docProps/core.xml
        ID:   rId2
        Mode: INTERNAL
        Type: http://schemas.openxmlformats.org/package/2006/relationships/metadata/core-properties
Relationship:
        From: /
        To:   /docProps/app.xml
        ID:   rId3
        Mode: INTERNAL
        Type: http://schemas.openxmlformats.org/officeDocument/2006/relationships/extended-properties
Tests run: 2, Failures: 0, Errors: 0, Skipped: 0, Time elapsed: 0.01 sec - in org.apache.poi.dev.TestOOXMLLister
Running org.apache.poi.dev.TestOOXMLPrettyPrint
Reading zip-file <https://builds.apache.org/job/POI-DSL-Maven/ws/test-data/spreadsheet/Formatting.xlsx> and writing pretty-printed XML to /tmp/poifiles/Formatting6242115809711081552-pretty.xlsx
............
Done.
Tests run: 1, Failures: 0, Errors: 0, Skipped: 0, Time elapsed: 0.015 sec - in org.apache.poi.dev.TestOOXMLPrettyPrint
Running org.apache.poi.dev.TestRecordGenerator
Tests run: 3, Failures: 0, Errors: 0, Skipped: 3, Time elapsed: 0 sec - in org.apache.poi.dev.TestRecordGenerator
Running org.apache.poi.ss.formula.TestStructuredReferences
Tests run: 2, Failures: 0, Errors: 0, Skipped: 0, Time elapsed: 0.009 sec - in org.apache.poi.ss.formula.TestStructuredReferences
Running org.apache.poi.ss.formula.TestFormulaParser
Tests run: 9, Failures: 0, Errors: 0, Skipped: 0, Time elapsed: 0.033 sec - in org.apache.poi.ss.formula.TestFormulaParser
Running org.apache.poi.ss.formula.eval.TestXSSFCircularReferences
Tests run: 4, Failures: 0, Errors: 0, Skipped: 0, Time elapsed: 0.01 sec - in org.apache.poi.ss.formula.eval.TestXSSFCircularReferences
Running org.apache.poi.ss.formula.functions.TestProper
Took: 1325ms
Tests run: 4, Failures: 0, Errors: 0, Skipped: 0, Time elapsed: 1.325 sec - in org.apache.poi.ss.formula.functions.TestProper
Running org.apache.poi.ss.formula.functions.TestSumifsXSSF
Tests run: 1, Failures: 0, Errors: 0, Skipped: 0, Time elapsed: 0.008 sec - in org.apache.poi.ss.formula.functions.TestSumifsXSSF
Running org.apache.poi.ss.util.TestXSSFCellUtil
setCellStyleProps start
setCellStyleProps nearing end
Tests run: 14, Failures: 0, Errors: 0, Skipped: 0, Time elapsed: 0.049 sec - in org.apache.poi.ss.util.TestXSSFCellUtil
Running org.apache.poi.ss.util.TestSXSSFCellUtil
setCellStyleProps start
setCellStyleProps nearing end
Tests run: 14, Failures: 0, Errors: 0, Skipped: 0, Time elapsed: 0.068 sec - in org.apache.poi.ss.util.TestSXSSFCellUtil
Running org.apache.poi.ss.util.TestXSSFPropertyTemplate
Tests run: 2, Failures: 0, Errors: 0, Skipped: 0, Time elapsed: 0.049 sec - in org.apache.poi.ss.util.TestXSSFPropertyTemplate
Running org.apache.poi.ss.format.TestCellFormatPart
Tests run: 6, Failures: 0, Errors: 0, Skipped: 0, Time elapsed: 0.229 sec - in org.apache.poi.ss.format.TestCellFormatPart
Running org.apache.poi.ss.TestWorkbookFactory
Tests run: 8, Failures: 0, Errors: 0, Skipped: 0, Time elapsed: 0.222 sec - in org.apache.poi.ss.TestWorkbookFactory
Running org.apache.poi.ss.usermodel.TestEmbedOLEPackage
Tests run: 2, Failures: 0, Errors: 0, Skipped: 0, Time elapsed: 0.038 sec - in org.apache.poi.ss.usermodel.TestEmbedOLEPackage
Running org.apache.poi.ss.usermodel.TestXSSFBorderStyle
Tests run: 1, Failures: 0, Errors: 0, Skipped: 0, Time elapsed: 0.006 sec - in org.apache.poi.ss.usermodel.TestXSSFBorderStyle
Running org.apache.poi.ss.usermodel.ConditionalFormattingEvalTest
Tests run: 1, Failures: 0, Errors: 0, Skipped: 0, Time elapsed: 0.113 sec - in org.apache.poi.ss.usermodel.ConditionalFormattingEvalTest
Running org.apache.poi.ss.extractor.TestEmbeddedExtractor
Tests run: 3, Failures: 0, Errors: 0, Skipped: 0, Time elapsed: 0.217 sec - in org.apache.poi.ss.extractor.TestEmbeddedExtractor
Running org.apache.poi.TestEmbeded
Tests run: 3, Failures: 0, Errors: 0, Skipped: 0, Time elapsed: 0.038 sec - in org.apache.poi.TestEmbeded
Running org.apache.poi.extractor.TestExtractorFactory
Tests run: 11, Failures: 0, Errors: 0, Skipped: 0, Time elapsed: 0.529 sec - in org.apache.poi.extractor.TestExtractorFactory
Running org.apache.poi.TestPOIXMLProperties
Tests run: 6, Failures: 0, Errors: 0, Skipped: 0, Time elapsed: 0.07 sec - in org.apache.poi.TestPOIXMLProperties

Results :

Tests in error:
  TestXSSFBugs.bug49020:233 » POIXML java.lang.reflect.InvocationTargetException
  TestXSSFVMLDrawing.testEvilUnclosedBRFixing:173 » Xml The element type "br" mu...

Tests run: 2241, Failures: 0, Errors: 2, Skipped: 155

[INFO] ------------------------------------------------------------------------
[INFO] Reactor Summary:
[INFO]
[INFO] Apache POI - the Java API for Microsoft Documents . SUCCESS [  0.003 s]
[INFO] Apache POI Main package ........................... SUCCESS [01:46 min]
[INFO] Apache POI Scratchpad package ..................... SUCCESS [ 23.231 s]
[INFO] Apache POI - Openxmlformats Schema package ........ SUCCESS [01:04 min]
[INFO] Apache POI - Openxmlformats Encryption Schema package  SUCCESS [  0.612 s]
[INFO] Apache POI - Openxmlformats Security-Schema package  SUCCESS [  6.085 s]
[INFO] Apache POI OOXML package .......................... FAILURE [01:46 min]
[INFO] Apache POI ExcelAnt package ....................... SKIPPED
[INFO] Apache POI Examples package ....................... SKIPPED
[INFO] ------------------------------------------------------------------------
[INFO] BUILD FAILURE
[INFO] ------------------------------------------------------------------------
[INFO] Total time: 05:08 min
[INFO] Finished at: 2017-07-17T11:09:18+00:00
[INFO] Final Memory: 44M/810M
[INFO] ------------------------------------------------------------------------
[ERROR] Failed to execute goal org.apache.maven.plugins:maven-surefire-plugin:2.19.1:test (default-test) on project poi-ooxml: There are test failures.
[ERROR]
[ERROR] Please refer to <https://builds.apache.org/job/POI-DSL-Maven/ws/sonar/ooxml/target/surefire-reports> for the individual test results.
[ERROR] -> [Help 1]
[ERROR]
[ERROR] To see the full stack trace of the errors, re-run Maven with the -e switch.
[ERROR] Re-run Maven using the -X switch to enable full debug logging.
[ERROR]
[ERROR] For more information about the errors and possible solutions, please read the following articles:
[ERROR] [Help 1] http://cwiki.apache.org/confluence/display/MAVEN/MojoFailureException
[ERROR]
[ERROR] After correcting the problems, you can resume the build with the command
[ERROR]   mvn <goals> -rf :poi-ooxml
Build step 'Invoke top-level Maven targets' marked build as failure

---------------------------------------------------------------------
To unsubscribe, e-mail: [hidden email]
For additional commands, e-mail: [hidden email]

Reply | Threaded
Open this post in threaded view
|  
Report Content as Inappropriate

Jenkins build is back to normal : POI-DSL-Maven #275

Apache Jenkins Server
See <https://builds.apache.org/job/POI-DSL-Maven/275/display/redirect?page=changes>


---------------------------------------------------------------------
To unsubscribe, e-mail: [hidden email]
For additional commands, e-mail: [hidden email]

Loading...