Build failed in Jenkins: POI-DSL-Maven #1171

classic Classic list List threaded Threaded
2 messages Options
Reply | Threaded
Open this post in threaded view
|

Build failed in Jenkins: POI-DSL-Maven #1171

Apache Jenkins Server
See <https://builds.apache.org/job/POI-DSL-Maven/1171/display/redirect?page=changes>

Changes:

[kiwiwings] #64411 - Provide JigSaw modules
- add jdk.unsupported module to main jar for CleanerUtil


------------------------------------------
[...truncated 920.42 KB...]
[INFO] Tests run: 4, Failures: 0, Errors: 0, Skipped: 0, Time elapsed: 0.001 s - in org.apache.poi.hssf.record.TestRecordFactoryInputStream
[INFO] Running org.apache.poi.hssf.record.TestRecordInputStream
[INFO] Tests run: 4, Failures: 0, Errors: 0, Skipped: 0, Time elapsed: 0.002 s - in org.apache.poi.hssf.record.TestRecordInputStream
[INFO] Running org.apache.poi.hssf.record.TestSCLRecord
[INFO] Tests run: 2, Failures: 0, Errors: 0, Skipped: 0, Time elapsed: 0.001 s - in org.apache.poi.hssf.record.TestSCLRecord
[INFO] Running org.apache.poi.hssf.record.TestSSTDeserializer
[INFO] Tests run: 4, Failures: 0, Errors: 0, Skipped: 0, Time elapsed: 0.001 s - in org.apache.poi.hssf.record.TestSSTDeserializer
[INFO] Running org.apache.poi.hssf.record.TestSSTRecord
[INFO] Tests run: 9, Failures: 0, Errors: 0, Skipped: 0, Time elapsed: 0.055 s - in org.apache.poi.hssf.record.TestSSTRecord
[INFO] Running org.apache.poi.hssf.record.TestSSTRecordSizeCalculator
[INFO] Tests run: 6, Failures: 0, Errors: 0, Skipped: 0, Time elapsed: 0.001 s - in org.apache.poi.hssf.record.TestSSTRecordSizeCalculator
[INFO] Running org.apache.poi.hssf.record.TestSharedFormulaRecord
[INFO] Tests run: 5, Failures: 0, Errors: 0, Skipped: 0, Time elapsed: 0.025 s - in org.apache.poi.hssf.record.TestSharedFormulaRecord
[INFO] Running org.apache.poi.hssf.record.TestStringRecord
[INFO] Tests run: 3, Failures: 0, Errors: 0, Skipped: 0, Time elapsed: 0.001 s - in org.apache.poi.hssf.record.TestStringRecord
[INFO] Running org.apache.poi.hssf.record.TestStyleRecord
[INFO] Tests run: 1, Failures: 0, Errors: 0, Skipped: 0, Time elapsed: 0.002 s - in org.apache.poi.hssf.record.TestStyleRecord
[INFO] Running org.apache.poi.hssf.record.TestSubRecord
[INFO] Tests run: 3, Failures: 0, Errors: 0, Skipped: 0, Time elapsed: 0.001 s - in org.apache.poi.hssf.record.TestSubRecord
[INFO] Running org.apache.poi.hssf.record.TestSupBookRecord
[INFO] Tests run: 7, Failures: 0, Errors: 0, Skipped: 0, Time elapsed: 0.001 s - in org.apache.poi.hssf.record.TestSupBookRecord
[INFO] Running org.apache.poi.hssf.record.TestTableRecord
[INFO] Tests run: 2, Failures: 0, Errors: 0, Skipped: 0, Time elapsed: 0 s - in org.apache.poi.hssf.record.TestTableRecord
[INFO] Running org.apache.poi.hssf.record.TestTextObjectBaseRecord
[INFO] Tests run: 2, Failures: 0, Errors: 0, Skipped: 0, Time elapsed: 0.001 s - in org.apache.poi.hssf.record.TestTextObjectBaseRecord
[INFO] Running org.apache.poi.hssf.record.TestTextObjectRecord
[INFO] Tests run: 6, Failures: 0, Errors: 0, Skipped: 0, Time elapsed: 0.001 s - in org.apache.poi.hssf.record.TestTextObjectRecord
[INFO] Running org.apache.poi.hssf.record.TestUnicodeNameRecord
[INFO] Tests run: 1, Failures: 0, Errors: 0, Skipped: 0, Time elapsed: 0.001 s - in org.apache.poi.hssf.record.TestUnicodeNameRecord
[INFO] Running org.apache.poi.hssf.record.common.TestUnicodeString
[INFO] Tests run: 11, Failures: 0, Errors: 0, Skipped: 0, Time elapsed: 0.004 s - in org.apache.poi.hssf.record.common.TestUnicodeString
[INFO] Running org.apache.poi.hssf.record.TestWriteAccessRecord
[INFO] Tests run: 2, Failures: 0, Errors: 0, Skipped: 0, Time elapsed: 0.002 s - in org.apache.poi.hssf.record.TestWriteAccessRecord
[INFO] Running org.apache.poi.hssf.record.TestDConRefRecord
[INFO] Tests run: 8, Failures: 0, Errors: 0, Skipped: 0, Time elapsed: 0.001 s - in org.apache.poi.hssf.record.TestDConRefRecord
[INFO] Running org.apache.poi.hssf.util.TestAreaReference
'A,Sheet'!$A$1
[INFO] Tests run: 6, Failures: 0, Errors: 0, Skipped: 0, Time elapsed: 0.001 s - in org.apache.poi.hssf.util.TestAreaReference
[INFO] Running org.apache.poi.hssf.util.TestCellReference
[INFO] Tests run: 12, Failures: 0, Errors: 0, Skipped: 0, Time elapsed: 0.002 s - in org.apache.poi.hssf.util.TestCellReference
[INFO] Running org.apache.poi.hssf.util.TestHSSFColor
[INFO] Tests run: 3, Failures: 0, Errors: 0, Skipped: 0, Time elapsed: 0.002 s - in org.apache.poi.hssf.util.TestHSSFColor
[INFO] Running org.apache.poi.hssf.util.TestRKUtil
[INFO] Tests run: 1, Failures: 0, Errors: 0, Skipped: 0, Time elapsed: 0.001 s - in org.apache.poi.hssf.util.TestRKUtil
[INFO] Running org.apache.poi.hssf.extractor.TestExcelExtractor
[INFO] Tests run: 17, Failures: 0, Errors: 0, Skipped: 0, Time elapsed: 0.247 s - in org.apache.poi.hssf.extractor.TestExcelExtractor
[INFO] Running org.apache.poi.hssf.eventmodel.TestEventRecordFactory
[WARNING] Tests run: 5, Failures: 0, Errors: 0, Skipped: 2, Time elapsed: 0.002 s - in org.apache.poi.hssf.eventmodel.TestEventRecordFactory
[INFO] Running org.apache.poi.ss.formula.TestCellCacheEntry
[INFO] Tests run: 1, Failures: 0, Errors: 0, Skipped: 0, Time elapsed: 0.001 s - in org.apache.poi.ss.formula.TestCellCacheEntry
[INFO] Running org.apache.poi.ss.formula.TestEvaluationCache
[INFO] Tests run: 8, Failures: 0, Errors: 0, Skipped: 0, Time elapsed: 4.649 s - in org.apache.poi.ss.formula.TestEvaluationCache
[INFO] Running org.apache.poi.ss.formula.TestWorkbookEvaluator
[WARNING] Tests run: 22, Failures: 0, Errors: 0, Skipped: 4, Time elapsed: 0.018 s - in org.apache.poi.ss.formula.TestWorkbookEvaluator
[INFO] Running org.apache.poi.ss.formula.eval.forked.BaseTestForkedEvaluator
[INFO] Tests run: 2, Failures: 0, Errors: 0, Skipped: 0, Time elapsed: 0.012 s - in org.apache.poi.ss.formula.eval.forked.BaseTestForkedEvaluator
[INFO] Running org.apache.poi.ss.util.TestAreaReference
[INFO] Tests run: 3, Failures: 0, Errors: 0, Skipped: 0, Time elapsed: 0.002 s - in org.apache.poi.ss.util.TestAreaReference
[INFO] Running org.apache.poi.ss.util.TestDateFormatConverter
[INFO] Tests run: 4, Failures: 0, Errors: 0, Skipped: 0, Time elapsed: 0.503 s - in org.apache.poi.ss.util.TestDateFormatConverter
[INFO] Running org.apache.poi.ss.util.TestExpandedDouble
[INFO] Tests run: 3, Failures: 0, Errors: 0, Skipped: 0, Time elapsed: 0.001 s - in org.apache.poi.ss.util.TestExpandedDouble
[INFO] Running org.apache.poi.ss.util.TestNumberComparer
[INFO] Tests run: 4, Failures: 0, Errors: 0, Skipped: 0, Time elapsed: 0.013 s - in org.apache.poi.ss.util.TestNumberComparer
[INFO] Running org.apache.poi.ss.util.TestNumberToTextConverter
[INFO] Tests run: 2, Failures: 0, Errors: 0, Skipped: 0, Time elapsed: 0.001 s - in org.apache.poi.ss.util.TestNumberToTextConverter
[INFO] Running org.apache.poi.ss.util.TestSheetBuilder
[INFO] Tests run: 3, Failures: 0, Errors: 0, Skipped: 0, Time elapsed: 0 s - in org.apache.poi.ss.util.TestSheetBuilder
[INFO] Running org.apache.poi.ss.util.TestSheetUtil
[INFO] Tests run: 7, Failures: 0, Errors: 0, Skipped: 0, Time elapsed: 0.002 s - in org.apache.poi.ss.util.TestSheetUtil
[INFO] Running org.apache.poi.ss.util.TestWorkbookUtil
[INFO] Tests run: 1, Failures: 0, Errors: 0, Skipped: 0, Time elapsed: 0.001 s - in org.apache.poi.ss.util.TestWorkbookUtil
[INFO] Running org.apache.poi.hssf.dev.TestFormulaViewer
[INFO] Tests run: 393, Failures: 0, Errors: 0, Skipped: 0, Time elapsed: 2.007 s - in org.apache.poi.hssf.dev.TestFormulaViewer
[INFO] Running org.apache.poi.hssf.dev.TestBiffViewer
[WARNING] Tests run: 786, Failures: 0, Errors: 0, Skipped: 393, Time elapsed: 91.883 s - in org.apache.poi.hssf.dev.TestBiffViewer
[INFO] Running org.apache.poi.hssf.dev.TestBiffDrawingToXml
[INFO] Tests run: 393, Failures: 0, Errors: 0, Skipped: 0, Time elapsed: 6.74 s - in org.apache.poi.hssf.dev.TestBiffDrawingToXml
[INFO] Running org.apache.poi.hssf.dev.TestEFBiffViewer
[INFO] Tests run: 393, Failures: 0, Errors: 0, Skipped: 0, Time elapsed: 77.711 s - in org.apache.poi.hssf.dev.TestEFBiffViewer
[INFO] Running org.apache.poi.hssf.dev.TestRecordLister
[INFO] Tests run: 393, Failures: 0, Errors: 0, Skipped: 0, Time elapsed: 8.637 s - in org.apache.poi.hssf.dev.TestRecordLister
[INFO] Running org.apache.poi.hssf.dev.TestReSave
[WARNING] Tests run: 786, Failures: 0, Errors: 0, Skipped: 393, Time elapsed: 106.172 s - in org.apache.poi.hssf.dev.TestReSave
[INFO] Running org.apache.poi.hssf.extractor.TestOldExcelExtractor
[INFO] Tests run: 22, Failures: 0, Errors: 0, Skipped: 0, Time elapsed: 0.123 s - in org.apache.poi.hssf.extractor.TestOldExcelExtractor
[INFO] Running org.apache.poi.hssf.extractor.TestExcelExtractor
[INFO] Tests run: 17, Failures: 0, Errors: 0, Skipped: 0, Time elapsed: 0.189 s - in org.apache.poi.hssf.extractor.TestExcelExtractor
[INFO] Running org.apache.poi.hssf.usermodel.TestHSSFName
[INFO] Tests run: 31, Failures: 0, Errors: 0, Skipped: 0, Time elapsed: 0.018 s - in org.apache.poi.hssf.usermodel.TestHSSFName
[INFO] Running org.apache.poi.hssf.usermodel.TestHSSFHeaderFooter
[INFO] Tests run: 8, Failures: 0, Errors: 0, Skipped: 0, Time elapsed: 0.005 s - in org.apache.poi.hssf.usermodel.TestHSSFHeaderFooter
[INFO] Running org.apache.poi.hssf.usermodel.TestHSSFRichTextString
[INFO] Tests run: 5, Failures: 0, Errors: 0, Skipped: 0, Time elapsed: 0.001 s - in org.apache.poi.hssf.usermodel.TestHSSFRichTextString
[INFO] Running org.apache.poi.hssf.usermodel.TestPatriarch
[INFO] Tests run: 1, Failures: 0, Errors: 0, Skipped: 0, Time elapsed: 0.001 s - in org.apache.poi.hssf.usermodel.TestPatriarch
[INFO] Running org.apache.poi.hssf.usermodel.TestEscherGraphics2d
[INFO] Tests run: 7, Failures: 0, Errors: 0, Skipped: 0, Time elapsed: 0.003 s - in org.apache.poi.hssf.usermodel.TestEscherGraphics2d
[INFO] Running org.apache.poi.hssf.usermodel.TestHSSFColumnShifting
[INFO] Tests run: 2, Failures: 0, Errors: 0, Skipped: 0, Time elapsed: 0.001 s - in org.apache.poi.hssf.usermodel.TestHSSFColumnShifting
[INFO] Running org.apache.poi.hssf.usermodel.TestHSSFCell
[INFO] Tests run: 65, Failures: 0, Errors: 0, Skipped: 0, Time elapsed: 0.041 s - in org.apache.poi.hssf.usermodel.TestHSSFCell
[INFO] Running org.apache.poi.hssf.usermodel.TestSanityChecker
[INFO] Tests run: 1, Failures: 0, Errors: 0, Skipped: 0, Time elapsed: 0.001 s - in org.apache.poi.hssf.usermodel.TestSanityChecker
[INFO] Running org.apache.poi.hssf.usermodel.TestCloneSheet
[INFO] Tests run: 7, Failures: 0, Errors: 0, Skipped: 0, Time elapsed: 0.001 s - in org.apache.poi.hssf.usermodel.TestCloneSheet
[INFO] Running org.apache.poi.hssf.usermodel.TestPOIFSProperties
[INFO] Tests run: 2, Failures: 0, Errors: 0, Skipped: 0, Time elapsed: 0.005 s - in org.apache.poi.hssf.usermodel.TestPOIFSProperties
[INFO] Running org.apache.poi.hssf.usermodel.TestHSSFFormulaEvaluator
[INFO] Tests run: 29, Failures: 0, Errors: 0, Skipped: 0, Time elapsed: 0.118 s - in org.apache.poi.hssf.usermodel.TestHSSFFormulaEvaluator
[INFO] Running org.apache.poi.hssf.usermodel.TestHSSFPicture
[INFO] Tests run: 10, Failures: 0, Errors: 0, Skipped: 0, Time elapsed: 0.367 s - in org.apache.poi.hssf.usermodel.TestHSSFPicture
[INFO] Running org.apache.poi.hssf.usermodel.TestEscherGraphics
[INFO] Tests run: 7, Failures: 0, Errors: 0, Skipped: 0, Time elapsed: 0.007 s - in org.apache.poi.hssf.usermodel.TestEscherGraphics
[INFO] Running org.apache.poi.hssf.usermodel.TestCellStyle
[INFO] Tests run: 12, Failures: 0, Errors: 0, Skipped: 0, Time elapsed: 4.136 s - in org.apache.poi.hssf.usermodel.TestCellStyle
[INFO] Running org.apache.poi.hssf.usermodel.TestCryptoAPI
[INFO] Tests run: 1, Failures: 0, Errors: 0, Skipped: 0, Time elapsed: 0.029 s - in org.apache.poi.hssf.usermodel.TestCryptoAPI
[INFO] Running org.apache.poi.hssf.usermodel.TestHSSFDataFormatter
[INFO] Tests run: 5, Failures: 0, Errors: 0, Skipped: 0, Time elapsed: 0.018 s - in org.apache.poi.hssf.usermodel.TestHSSFDataFormatter
[INFO] Running org.apache.poi.hssf.usermodel.TestHSSFPatriarch
[INFO] Tests run: 2, Failures: 0, Errors: 0, Skipped: 0, Time elapsed: 0.002 s - in org.apache.poi.hssf.usermodel.TestHSSFPatriarch
[INFO] Running org.apache.poi.hssf.usermodel.TestHSSFDataFormat
[INFO] Tests run: 7, Failures: 0, Errors: 0, Skipped: 0, Time elapsed: 0.011 s - in org.apache.poi.hssf.usermodel.TestHSSFDataFormat
[INFO] Running org.apache.poi.hssf.usermodel.TestHSSFConditionalFormatting
[INFO] Tests run: 23, Failures: 0, Errors: 0, Skipped: 0, Time elapsed: 0.048 s - in org.apache.poi.hssf.usermodel.TestHSSFConditionalFormatting
[INFO] Running org.apache.poi.hssf.usermodel.TestRowStyle
[INFO] Tests run: 3, Failures: 0, Errors: 0, Skipped: 0, Time elapsed: 0.003 s - in org.apache.poi.hssf.usermodel.TestRowStyle
[INFO] Running org.apache.poi.hssf.usermodel.TestFontDetails
[INFO] Tests run: 3, Failures: 0, Errors: 0, Skipped: 0, Time elapsed: 0.001 s - in org.apache.poi.hssf.usermodel.TestFontDetails
[INFO] Running org.apache.poi.hssf.usermodel.TestHSSFSheetAutosizeColumn
[INFO] Tests run: 7, Failures: 0, Errors: 0, Skipped: 0, Time elapsed: 0.044 s - in org.apache.poi.hssf.usermodel.TestHSSFSheetAutosizeColumn
[INFO] Running org.apache.poi.hssf.usermodel.TestMatrixFormulasFromBinarySpreadsheet
[INFO] Tests run: 34, Failures: 0, Errors: 0, Skipped: 0, Time elapsed: 0.062 s - in org.apache.poi.hssf.usermodel.TestMatrixFormulasFromBinarySpreadsheet
[INFO] Running org.apache.poi.hssf.usermodel.TestHSSFSheetShiftRows
[WARNING] Tests run: 18, Failures: 0, Errors: 0, Skipped: 2, Time elapsed: 1.71 s - in org.apache.poi.hssf.usermodel.TestHSSFSheetShiftRows
[INFO] Running org.apache.poi.hssf.usermodel.TestFormulaEvaluatorBugs
[INFO] Tests run: 9, Failures: 0, Errors: 0, Skipped: 0, Time elapsed: 0.083 s - in org.apache.poi.hssf.usermodel.TestFormulaEvaluatorBugs
[INFO] Running org.apache.poi.hssf.usermodel.TestHSSFPalette
[INFO] Tests run: 7, Failures: 0, Errors: 0, Skipped: 0, Time elapsed: 0.005 s - in org.apache.poi.hssf.usermodel.TestHSSFPalette
[INFO] Running org.apache.poi.hssf.usermodel.TestUnicodeWorkbook
[INFO] Tests run: 1, Failures: 0, Errors: 0, Skipped: 0, Time elapsed: 0.001 s - in org.apache.poi.hssf.usermodel.TestUnicodeWorkbook
[INFO] Running org.apache.poi.hssf.usermodel.TestReadWriteChart
[INFO] Tests run: 1, Failures: 0, Errors: 0, Skipped: 0, Time elapsed: 0 s - in org.apache.poi.hssf.usermodel.TestReadWriteChart
[INFO] Running org.apache.poi.hssf.usermodel.TestFormulas
[INFO] Tests run: 33, Failures: 0, Errors: 0, Skipped: 0, Time elapsed: 1.416 s - in org.apache.poi.hssf.usermodel.TestFormulas
[INFO] Running org.apache.poi.hssf.usermodel.TestWorkbook
[INFO] Tests run: 18, Failures: 0, Errors: 0, Skipped: 0, Time elapsed: 0.076 s - in org.apache.poi.hssf.usermodel.TestWorkbook
[INFO] Running org.apache.poi.hssf.usermodel.TestExternalReferenceChange
[INFO] Tests run: 1, Failures: 0, Errors: 0, Skipped: 0, Time elapsed: 0.002 s - in org.apache.poi.hssf.usermodel.TestExternalReferenceChange
[INFO] Running org.apache.poi.hssf.usermodel.TestSheetHiding
[INFO] Tests run: 6, Failures: 0, Errors: 0, Skipped: 0, Time elapsed: 0.007 s - in org.apache.poi.hssf.usermodel.TestSheetHiding
[INFO] Running org.apache.poi.hssf.usermodel.TestHSSFSheetShiftColumns
[WARNING] Tests run: 10, Failures: 0, Errors: 0, Skipped: 6, Time elapsed: 0.004 s - in org.apache.poi.hssf.usermodel.TestHSSFSheetShiftColumns
[INFO] Running org.apache.poi.hssf.usermodel.TestHSSFClientAnchor
[INFO] Tests run: 9, Failures: 0, Errors: 0, Skipped: 0, Time elapsed: 0.016 s - in org.apache.poi.hssf.usermodel.TestHSSFClientAnchor
[INFO] Running org.apache.poi.hssf.usermodel.TestText
[INFO] Tests run: 4, Failures: 0, Errors: 0, Skipped: 0, Time elapsed: 0.001 s - in org.apache.poi.hssf.usermodel.TestText
[INFO] Running org.apache.poi.hssf.usermodel.TestHSSFChart
[INFO] Tests run: 7, Failures: 0, Errors: 0, Skipped: 0, Time elapsed: 0.058 s - in org.apache.poi.hssf.usermodel.TestHSSFChart
[INFO] Running org.apache.poi.hssf.usermodel.TestHSSFSheet
[INFO] Tests run: 84, Failures: 0, Errors: 0, Skipped: 0, Time elapsed: 0.456 s - in org.apache.poi.hssf.usermodel.TestHSSFSheet
[INFO] Running org.apache.poi.hssf.usermodel.TestPolygon
[INFO] Tests run: 6, Failures: 0, Errors: 0, Skipped: 0, Time elapsed: 0.012 s - in org.apache.poi.hssf.usermodel.TestPolygon
[INFO] Running org.apache.poi.hssf.usermodel.TestBug42464
[INFO] Tests run: 2, Failures: 0, Errors: 0, Skipped: 0, Time elapsed: 0.142 s - in org.apache.poi.hssf.usermodel.TestBug42464
[INFO] Running org.apache.poi.hssf.usermodel.TestFormulaEvaluatorDocs
[INFO] Tests run: 1, Failures: 0, Errors: 0, Skipped: 0, Time elapsed: 0.002 s - in org.apache.poi.hssf.usermodel.TestFormulaEvaluatorDocs
[INFO] Running org.apache.poi.hssf.usermodel.TestOLE2Embeding
[INFO] Tests run: 3, Failures: 0, Errors: 0, Skipped: 0, Time elapsed: 0.008 s - in org.apache.poi.hssf.usermodel.TestOLE2Embeding
[INFO] Running org.apache.poi.hssf.usermodel.TestShapeGroup
[INFO] Tests run: 6, Failures: 0, Errors: 0, Skipped: 0, Time elapsed: 0.015 s - in org.apache.poi.hssf.usermodel.TestShapeGroup
[INFO] Running org.apache.poi.hssf.usermodel.TestHSSFWorkbook
[WARNING] Tests run: 58, Failures: 0, Errors: 0, Skipped: 1, Time elapsed: 0.133 s - in org.apache.poi.hssf.usermodel.TestHSSFWorkbook
[INFO] Running org.apache.poi.hssf.usermodel.TestHSSFTextbox
[INFO] Tests run: 2, Failures: 0, Errors: 0, Skipped: 0, Time elapsed: 0.002 s - in org.apache.poi.hssf.usermodel.TestHSSFTextbox
[INFO] Running org.apache.poi.hssf.usermodel.TestHSSFRow
[INFO] Tests run: 16, Failures: 0, Errors: 0, Skipped: 0, Time elapsed: 0.003 s - in org.apache.poi.hssf.usermodel.TestHSSFRow
[INFO] Running org.apache.poi.hssf.usermodel.TestHSSFDateUtil
[INFO] Tests run: 1, Failures: 0, Errors: 0, Skipped: 0, Time elapsed: 0.002 s - in org.apache.poi.hssf.usermodel.TestHSSFDateUtil
[INFO] Running org.apache.poi.hssf.usermodel.TestHSSFEvaluationSheet
[INFO] Tests run: 2, Failures: 0, Errors: 0, Skipped: 0, Time elapsed: 0.011 s - in org.apache.poi.hssf.usermodel.TestHSSFEvaluationSheet
[INFO] Running org.apache.poi.hssf.usermodel.TestHSSFHyperlink
[INFO] Tests run: 8, Failures: 0, Errors: 0, Skipped: 0, Time elapsed: 0.011 s - in org.apache.poi.hssf.usermodel.TestHSSFHyperlink
[INFO] Running org.apache.poi.hssf.usermodel.TestEmbeddedObjects
[INFO] Tests run: 3, Failures: 0, Errors: 0, Skipped: 0, Time elapsed: 0.009 s - in org.apache.poi.hssf.usermodel.TestEmbeddedObjects
[INFO] Running org.apache.poi.hssf.usermodel.TestBugs
[WARNING] Tests run: 190, Failures: 0, Errors: 0, Skipped: 4, Time elapsed: 23.921 s - in org.apache.poi.hssf.usermodel.TestBugs
[INFO] Running org.apache.poi.hssf.usermodel.TestHSSFSheetUpdateArrayFormulas
[WARNING] Tests run: 18, Failures: 0, Errors: 0, Skipped: 1, Time elapsed: 0.005 s - in org.apache.poi.hssf.usermodel.TestHSSFSheetUpdateArrayFormulas
[INFO] Running org.apache.poi.hssf.usermodel.TestDataValidation
[INFO] Tests run: 10, Failures: 0, Errors: 0, Skipped: 0, Time elapsed: 0.018 s - in org.apache.poi.hssf.usermodel.TestDataValidation
[INFO] Running org.apache.poi.hssf.usermodel.TestNonStandardWorkbookStreamNames
[INFO] Tests run: 4, Failures: 0, Errors: 0, Skipped: 0, Time elapsed: 0.045 s - in org.apache.poi.hssf.usermodel.TestNonStandardWorkbookStreamNames
[INFO] Running org.apache.poi.hssf.usermodel.TestHSSFPictureData
[INFO] Tests run: 3, Failures: 0, Errors: 0, Skipped: 0, Time elapsed: 0.322 s - in org.apache.poi.hssf.usermodel.TestHSSFPictureData
[INFO] Running org.apache.poi.hssf.usermodel.TestHSSFExternalFunctions
[INFO] Tests run: 2, Failures: 0, Errors: 0, Skipped: 0, Time elapsed: 0.007 s - in org.apache.poi.hssf.usermodel.TestHSSFExternalFunctions
[INFO] Running org.apache.poi.hssf.usermodel.TestHSSFRangeCopier
[INFO] Tests run: 8, Failures: 0, Errors: 0, Skipped: 0, Time elapsed: 0.023 s - in org.apache.poi.hssf.usermodel.TestHSSFRangeCopier
[INFO] Running org.apache.poi.hssf.usermodel.TestHSSFComment
[INFO] Tests run: 21, Failures: 0, Errors: 0, Skipped: 0, Time elapsed: 2.386 s - in org.apache.poi.hssf.usermodel.TestHSSFComment
[INFO] Running org.apache.poi.hssf.usermodel.TestHSSFFont
[INFO] Tests run: 4, Failures: 0, Errors: 0, Skipped: 0, Time elapsed: 0.001 s - in org.apache.poi.hssf.usermodel.TestHSSFFont
[INFO] Running org.apache.poi.hssf.usermodel.TestHSSFOptimiser
[INFO] Tests run: 10, Failures: 0, Errors: 0, Skipped: 0, Time elapsed: 0.006 s - in org.apache.poi.hssf.usermodel.TestHSSFOptimiser
[INFO]
[INFO] Results:
[INFO]
[ERROR] Errors:
[ERROR]   TestIOUtils.setUp:55 » IO No such file or directory
[INFO]
[ERROR] Tests run: 9248, Failures: 0, Errors: 1, Skipped: 823
[INFO]
[INFO] ------------------------------------------------------------------------
[INFO] Reactor Summary for Apache POI - the Java API for Microsoft Documents 5.0.0-SNAPSHOT:
[INFO]
[INFO] Apache POI - the Java API for Microsoft Documents .. SUCCESS [ 11.566 s]
[INFO] Apache POI Main package ............................ FAILURE [07:58 min]
[INFO] Apache POI Scratchpad package ...................... SKIPPED
[INFO] Apache POI - Openxmlformats Schema package ......... SKIPPED
[INFO] Apache POI - Openxmlformats Encryption Schema package SKIPPED
[INFO] Apache POI - Openxmlformats Security-Schema package  SKIPPED
[INFO] Apache POI OOXML package ........................... SKIPPED
[INFO] Apache POI ExcelAnt package ........................ SKIPPED
[INFO] Apache POI Examples package ........................ SKIPPED
[INFO] Apache POI integration test ........................ SKIPPED
[INFO] ------------------------------------------------------------------------
[INFO] BUILD FAILURE
[INFO] ------------------------------------------------------------------------
[INFO] Total time:  08:10 min
[INFO] Finished at: 2020-08-07T20:15:44Z
[INFO] ------------------------------------------------------------------------
[ERROR] Failed to execute goal org.apache.maven.plugins:maven-surefire-plugin:3.0.0-M4:test (default-test) on project poi-main: There are test failures.
[ERROR]
[ERROR] Please refer to <https://builds.apache.org/job/POI-DSL-Maven/ws/sonar/main/target/surefire-reports> for the individual test results.
[ERROR] Please refer to dump files (if any exist) [date].dump, [date]-jvmRun[N].dump and [date].dumpstream.
[ERROR] -> [Help 1]
[ERROR]
[ERROR] To see the full stack trace of the errors, re-run Maven with the -e switch.
[ERROR] Re-run Maven using the -X switch to enable full debug logging.
[ERROR]
[ERROR] For more information about the errors and possible solutions, please read the following articles:
[ERROR] [Help 1] http://cwiki.apache.org/confluence/display/MAVEN/MojoFailureException
[ERROR]
[ERROR] After correcting the problems, you can resume the build with the command
[ERROR]   mvn <args> -rf :poi-main
Build step 'Invoke top-level Maven targets' marked build as failure
Recording test results

---------------------------------------------------------------------
To unsubscribe, e-mail: [hidden email]
For additional commands, e-mail: [hidden email]

Reply | Threaded
Open this post in threaded view
|

Jenkins build is back to normal : POI-DSL-Maven #1172

Apache Jenkins Server
See <https://builds.apache.org/job/POI-DSL-Maven/1172/display/redirect>


---------------------------------------------------------------------
To unsubscribe, e-mail: [hidden email]
For additional commands, e-mail: [hidden email]