Build failed in Jenkins: POI-DSL-Maven #1164

classic Classic list List threaded Threaded
2 messages Options
Reply | Threaded
Open this post in threaded view
|

Build failed in Jenkins: POI-DSL-Maven #1164

Apache Jenkins Server
See <https://builds.apache.org/job/POI-DSL-Maven/1164/display/redirect?page=changes>

Changes:

[kiwiwings] remove obsolete bouncycastle jars

[kiwiwings] a few jigsaw related fixes


------------------------------------------
[...truncated 970.98 KB...]
[INFO] Tests run: 4, Failures: 0, Errors: 0, Skipped: 0, Time elapsed: 0.053 s - in org.apache.poi.xslf.usermodel.TestXSLFTextRun
[INFO] Running org.apache.poi.xslf.usermodel.TestXSLFSlideShow
[INFO] Tests run: 6, Failures: 0, Errors: 0, Skipped: 0, Time elapsed: 0.209 s - in org.apache.poi.xslf.usermodel.TestXSLFSlideShow
[INFO] Running org.apache.poi.xslf.usermodel.TestXSLFAutoShape
[INFO] Tests run: 4, Failures: 0, Errors: 0, Skipped: 0, Time elapsed: 0.088 s - in org.apache.poi.xslf.usermodel.TestXSLFAutoShape
[INFO] Running org.apache.poi.xslf.usermodel.TestXSLFColor
[INFO] Tests run: 6, Failures: 0, Errors: 0, Skipped: 0, Time elapsed: 0.077 s - in org.apache.poi.xslf.usermodel.TestXSLFColor
[INFO] Running org.apache.poi.xslf.usermodel.TestXSLFSheet
[INFO] Tests run: 1, Failures: 0, Errors: 0, Skipped: 0, Time elapsed: 0.058 s - in org.apache.poi.xslf.usermodel.TestXSLFSheet
[INFO] Running org.apache.poi.xslf.usermodel.TestXSLFSimpleShape
Usage: PPTX2PNG [options] <.ppt/.pptx/.emf/.wmf file or 'stdin'>
Error: Outdir doesn't exist
Options:
    -scale <float>    scale factor
    -fixSide <side>   specify side (long,short,width,height) to fix - use <scale> as amount of pixels
    -slide <integer>  1-based index of a slide to render
    -format <type>    png,gif,jpg,svg (,null for testing)
    -outdir <dir>     output directory, defaults to origin of the ppt/pptx file
    -outfile <file>   output filename, defaults to '${basename}-${slideno}.${format}'
    -outpat <pattern> output filename pattern, defaults to '${basename}-${slideno}.${format}'
                      patterns: basename, slideno, format, ext
    -dump <file>      dump the annotated records to a file
    -quiet            do not write to console (for normal processing)
    -ignoreParse      ignore parsing error and continue with the records read until the error
    -extractEmbedded  extract embedded parts
    -inputType <type> default input file type (OLE2,WMF,EMF), default is OLE2 = Powerpoint
                      some files (usually wmf) don't have a header, i.e. an identifiable file magic
    -textAsShapes     text elements are saved as shapes in SVG, necessary for variable spacing
                      often found in math formulas
[INFO] Tests run: 7, Failures: 0, Errors: 0, Skipped: 0, Time elapsed: 0.442 s - in org.apache.poi.xslf.usermodel.TestXSLFSimpleShape
[INFO] Running org.apache.poi.xslf.usermodel.TestXSLFConnectorShape
[INFO] Tests run: 2, Failures: 0, Errors: 0, Skipped: 0, Time elapsed: 0.052 s - in org.apache.poi.xslf.usermodel.TestXSLFConnectorShape
[INFO] Running org.apache.poi.xslf.usermodel.TestXSLFPictureShape
<https://builds.apache.org/job/POI-DSL-Maven/ws/sonar/ooxml/target/tmp/poifiles/svgtest4596248787839021604.pptx>
[INFO] Tests run: 7, Failures: 0, Errors: 0, Skipped: 0, Time elapsed: 1.47 s - in org.apache.poi.xslf.usermodel.TestXSLFPictureShape
[INFO] Running org.apache.poi.xslf.usermodel.TestXSLFTable
[INFO] Tests run: 6, Failures: 0, Errors: 0, Skipped: 0, Time elapsed: 2.959 s - in org.apache.poi.xslf.usermodel.TestXSLFTable
[INFO] Running org.apache.poi.xslf.usermodel.TestXSLFTheme
[INFO] Tests run: 1, Failures: 0, Errors: 0, Skipped: 0, Time elapsed: 0.175 s - in org.apache.poi.xslf.usermodel.TestXSLFTheme
[INFO] Running org.apache.poi.xslf.usermodel.TestXSLFTextParagraph
[WARNING] Tests run: 5, Failures: 0, Errors: 0, Skipped: 1, Time elapsed: 0.085 s - in org.apache.poi.xslf.usermodel.TestXSLFTextParagraph
[INFO] Running org.apache.poi.xslf.usermodel.TestXSLFShapeContainer
[INFO] Tests run: 1, Failures: 0, Errors: 0, Skipped: 0, Time elapsed: 0.024 s - in org.apache.poi.xslf.usermodel.TestXSLFShapeContainer
[INFO] Running org.apache.poi.xslf.usermodel.TestXSLFSlide
[INFO] Tests run: 5, Failures: 0, Errors: 0, Skipped: 0, Time elapsed: 0.747 s - in org.apache.poi.xslf.usermodel.TestXSLFSlide
[INFO] Running org.apache.poi.xslf.usermodel.TestXSLFChart
[INFO] Tests run: 5, Failures: 0, Errors: 0, Skipped: 0, Time elapsed: 0.207 s - in org.apache.poi.xslf.usermodel.TestXSLFChart
[INFO] Running org.apache.poi.xslf.usermodel.TestXSLFTableRow
[INFO] Tests run: 8, Failures: 0, Errors: 0, Skipped: 0, Time elapsed: 0.207 s - in org.apache.poi.xslf.usermodel.TestXSLFTableRow
[INFO] Running org.apache.poi.xslf.usermodel.TestXSLFBackground
[INFO] Tests run: 4, Failures: 0, Errors: 0, Skipped: 0, Time elapsed: 0.217 s - in org.apache.poi.xslf.usermodel.TestXSLFBackground
[INFO] Running org.apache.poi.xslf.usermodel.TestXSLFHyperlink
[INFO] Tests run: 3, Failures: 0, Errors: 0, Skipped: 0, Time elapsed: 0.112 s - in org.apache.poi.xslf.usermodel.TestXSLFHyperlink
[INFO] Running org.apache.poi.xslf.usermodel.TestXSLFFreeformShape
[INFO] Tests run: 2, Failures: 0, Errors: 0, Skipped: 0, Time elapsed: 0.085 s - in org.apache.poi.xslf.usermodel.TestXSLFFreeformShape
[INFO] Running org.apache.poi.xslf.usermodel.TestXSLFNotes
[INFO] Tests run: 3, Failures: 0, Errors: 0, Skipped: 0, Time elapsed: 0.108 s - in org.apache.poi.xslf.usermodel.TestXSLFNotes
[INFO] Running org.apache.poi.xslf.usermodel.TestXSLFGroupShape
[INFO] Tests run: 2, Failures: 0, Errors: 0, Skipped: 0, Time elapsed: 0.039 s - in org.apache.poi.xslf.usermodel.TestXSLFGroupShape
[INFO] Running org.apache.poi.xslf.usermodel.TestXMLSlideShow
[INFO] Tests run: 12, Failures: 0, Errors: 0, Skipped: 0, Time elapsed: 0.445 s - in org.apache.poi.xslf.usermodel.TestXMLSlideShow
[INFO] Running org.apache.poi.xslf.usermodel.TestXSLFTextShape
[INFO] Tests run: 4, Failures: 0, Errors: 0, Skipped: 0, Time elapsed: 0.13 s - in org.apache.poi.xslf.usermodel.TestXSLFTextShape
[INFO] Running org.apache.poi.xslf.TestXSLFSlideShow
[INFO] Tests run: 5, Failures: 0, Errors: 0, Skipped: 0, Time elapsed: 0.093 s - in org.apache.poi.xslf.TestXSLFSlideShow
[INFO] Running org.apache.poi.xslf.TestXSLFBugs
[WARNING] Tests run: 31, Failures: 0, Errors: 0, Skipped: 2, Time elapsed: 2.466 s - in org.apache.poi.xslf.TestXSLFBugs
[INFO] Running org.apache.poi.xslf.extractor.TestXSLFPowerPointExtractor
[INFO] Tests run: 8, Failures: 0, Errors: 0, Skipped: 0, Time elapsed: 0.576 s - in org.apache.poi.xslf.extractor.TestXSLFPowerPointExtractor
[INFO] Running org.apache.poi.xslf.TestNecessaryOOXMLClasses
[INFO] Tests run: 1, Failures: 0, Errors: 0, Skipped: 0, Time elapsed: 0.003 s - in org.apache.poi.xslf.TestNecessaryOOXMLClasses
[INFO] Running org.apache.poi.extractor.ooxml.TestExtractorFactory
[INFO] Tests run: 14, Failures: 0, Errors: 0, Skipped: 0, Time elapsed: 0.67 s - in org.apache.poi.extractor.ooxml.TestExtractorFactory
[INFO] Running org.apache.poi.poifs.crypt.tests.TestSecureTempZip
[INFO] Tests run: 2, Failures: 0, Errors: 0, Skipped: 0, Time elapsed: 0.204 s - in org.apache.poi.poifs.crypt.tests.TestSecureTempZip
[INFO] Running org.apache.poi.poifs.crypt.tests.TestAgileEncryptionParameters
[INFO] Tests run: 60, Failures: 0, Errors: 0, Skipped: 0, Time elapsed: 10.115 s - in org.apache.poi.poifs.crypt.tests.TestAgileEncryptionParameters
[INFO] Running org.apache.poi.poifs.crypt.tests.TestDecryptor
[INFO] Tests run: 7, Failures: 0, Errors: 0, Skipped: 0, Time elapsed: 0.338 s - in org.apache.poi.poifs.crypt.tests.TestDecryptor
[INFO] Running org.apache.poi.poifs.crypt.tests.TestEncryptionInfo
[INFO] Tests run: 2, Failures: 0, Errors: 0, Skipped: 0, Time elapsed: 0.017 s - in org.apache.poi.poifs.crypt.tests.TestEncryptionInfo
[INFO] Running org.apache.poi.poifs.crypt.tests.TestEncryptor
[WARNING] Tests run: 8, Failures: 0, Errors: 0, Skipped: 1, Time elapsed: 13.665 s - in org.apache.poi.poifs.crypt.tests.TestEncryptor
[INFO] Running org.apache.poi.poifs.crypt.tests.TestHxxFEncryption
[INFO] Tests run: 20, Failures: 0, Errors: 0, Skipped: 0, Time elapsed: 1.023 s - in org.apache.poi.poifs.crypt.tests.TestHxxFEncryption
[INFO] Running org.apache.poi.poifs.crypt.dsig.TestSignatureInfo
SLF4J: Failed to load class "org.slf4j.impl.StaticLoggerBinder".
SLF4J: Defaulting to no-operation (NOP) logger implementation
SLF4J: See http://www.slf4j.org/codes.html#StaticLoggerBinder for further details.
[ERROR] Tests run: 14, Failures: 0, Errors: 1, Skipped: 1, Time elapsed: 7.519 s <<< FAILURE! - in org.apache.poi.poifs.crypt.dsig.TestSignatureInfo
[ERROR] org.apache.poi.poifs.crypt.dsig.TestSignatureInfo.testSignEnvelopingDocument  Time elapsed: 4.525 s  <<< ERROR!
java.lang.RuntimeException: error while creating a time-stamp: timestamp response status != 0: 2
        at org.apache.poi.poifs.crypt.dsig.TestSignatureInfo.testSignEnvelopingDocument(TestSignatureInfo.java:545)
Caused by: java.lang.RuntimeException: timestamp response status != 0: 2
        at org.apache.poi.poifs.crypt.dsig.TestSignatureInfo.testSignEnvelopingDocument(TestSignatureInfo.java:545)

[INFO] Running org.apache.poi.poifs.crypt.dsig.TestSignatureConfig
[WARNING] Tests run: 2, Failures: 0, Errors: 0, Skipped: 1, Time elapsed: 0.001 s - in org.apache.poi.poifs.crypt.dsig.TestSignatureConfig
[INFO] Running org.apache.poi.util.tests.TestTempFileThreaded
thread: 9, iter: 0: <https://builds.apache.org/job/POI-DSL-Maven/ws/sonar/ooxml/target/tmp/poifiles/TestTempFileThreaded/348/TestTempFile-9-0-7221335372284484789.xlsx>
thread: 7, iter: 0: <https://builds.apache.org/job/POI-DSL-Maven/ws/sonar/ooxml/target/tmp/poifiles/TestTempFileThreaded/346/TestTempFile-7-0-1611555212325006316.xlsx>
thread: 3, iter: 0: <https://builds.apache.org/job/POI-DSL-Maven/ws/sonar/ooxml/target/tmp/poifiles/TestTempFileThreaded/342/TestTempFile-3-0-1779278789748013820.xlsx>
thread: 1, iter: 0: <https://builds.apache.org/job/POI-DSL-Maven/ws/sonar/ooxml/target/tmp/poifiles/TestTempFileThreaded/340/TestTempFile-1-0-6281405039961057147.xlsx>
thread: 8, iter: 0: <https://builds.apache.org/job/POI-DSL-Maven/ws/sonar/ooxml/target/tmp/poifiles/TestTempFileThreaded/347/TestTempFile-8-0-3294977290503214594.xlsx>
thread: 6, iter: 0: <https://builds.apache.org/job/POI-DSL-Maven/ws/sonar/ooxml/target/tmp/poifiles/TestTempFileThreaded/345/TestTempFile-6-0-3329837395900111651.xlsx>
thread: 5, iter: 0: <https://builds.apache.org/job/POI-DSL-Maven/ws/sonar/ooxml/target/tmp/poifiles/TestTempFileThreaded/344/TestTempFile-5-0-5697798074932804212.xlsx>
thread: 0, iter: 0: <https://builds.apache.org/job/POI-DSL-Maven/ws/sonar/ooxml/target/tmp/poifiles/TestTempFileThreaded/339/TestTempFile-0-0-4176144544109153971.xlsx>
thread: 2, iter: 0: <https://builds.apache.org/job/POI-DSL-Maven/ws/sonar/ooxml/target/tmp/poifiles/TestTempFileThreaded/341/TestTempFile-2-0-4751173480706314632.xlsx>
thread: 4, iter: 0: <https://builds.apache.org/job/POI-DSL-Maven/ws/sonar/ooxml/target/tmp/poifiles/TestTempFileThreaded/343/TestTempFile-4-0-4708389740749283695.xlsx>
thread: 4, iter: 30: <https://builds.apache.org/job/POI-DSL-Maven/ws/sonar/ooxml/target/tmp/poifiles/TestTempFileThreaded/343/TestTempFile-4-30-5416248704793424466.xlsx>
thread: 3, iter: 30: <https://builds.apache.org/job/POI-DSL-Maven/ws/sonar/ooxml/target/tmp/poifiles/TestTempFileThreaded/342/TestTempFile-3-30-2332128497578734653.xlsx>
thread: 5, iter: 30: <https://builds.apache.org/job/POI-DSL-Maven/ws/sonar/ooxml/target/tmp/poifiles/TestTempFileThreaded/344/TestTempFile-5-30-2333545819337053431.xlsx>
thread: 2, iter: 30: <https://builds.apache.org/job/POI-DSL-Maven/ws/sonar/ooxml/target/tmp/poifiles/TestTempFileThreaded/341/TestTempFile-2-30-6819704256598439723.xlsx>
thread: 1, iter: 30: <https://builds.apache.org/job/POI-DSL-Maven/ws/sonar/ooxml/target/tmp/poifiles/TestTempFileThreaded/340/TestTempFile-1-30-6101599953817694406.xlsx>
thread: 9, iter: 30: <https://builds.apache.org/job/POI-DSL-Maven/ws/sonar/ooxml/target/tmp/poifiles/TestTempFileThreaded/348/TestTempFile-9-30-4099728482307685932.xlsx>
thread: 7, iter: 30: <https://builds.apache.org/job/POI-DSL-Maven/ws/sonar/ooxml/target/tmp/poifiles/TestTempFileThreaded/346/TestTempFile-7-30-1013870164657634038.xlsx>
thread: 8, iter: 30: <https://builds.apache.org/job/POI-DSL-Maven/ws/sonar/ooxml/target/tmp/poifiles/TestTempFileThreaded/347/TestTempFile-8-30-7321747781619612430.xlsx>
thread: 0, iter: 30: <https://builds.apache.org/job/POI-DSL-Maven/ws/sonar/ooxml/target/tmp/poifiles/TestTempFileThreaded/339/TestTempFile-0-30-839646048752045079.xlsx>
thread: 6, iter: 30: <https://builds.apache.org/job/POI-DSL-Maven/ws/sonar/ooxml/target/tmp/poifiles/TestTempFileThreaded/345/TestTempFile-6-30-8300262365517665342.xlsx>
thread: 4, iter: 60: <https://builds.apache.org/job/POI-DSL-Maven/ws/sonar/ooxml/target/tmp/poifiles/TestTempFileThreaded/343/TestTempFile-4-60-8277497513228999877.xlsx>
thread: 1, iter: 60: <https://builds.apache.org/job/POI-DSL-Maven/ws/sonar/ooxml/target/tmp/poifiles/TestTempFileThreaded/340/TestTempFile-1-60-3791316692277352844.xlsx>
thread: 9, iter: 60: <https://builds.apache.org/job/POI-DSL-Maven/ws/sonar/ooxml/target/tmp/poifiles/TestTempFileThreaded/348/TestTempFile-9-60-3972599845169323123.xlsx>
thread: 3, iter: 60: <https://builds.apache.org/job/POI-DSL-Maven/ws/sonar/ooxml/target/tmp/poifiles/TestTempFileThreaded/342/TestTempFile-3-60-4328535991372520857.xlsx>
thread: 5, iter: 60: <https://builds.apache.org/job/POI-DSL-Maven/ws/sonar/ooxml/target/tmp/poifiles/TestTempFileThreaded/344/TestTempFile-5-60-3007175205836560575.xlsx>
thread: 7, iter: 60: <https://builds.apache.org/job/POI-DSL-Maven/ws/sonar/ooxml/target/tmp/poifiles/TestTempFileThreaded/346/TestTempFile-7-60-2240308475663739146.xlsx>
thread: 2, iter: 60: <https://builds.apache.org/job/POI-DSL-Maven/ws/sonar/ooxml/target/tmp/poifiles/TestTempFileThreaded/341/TestTempFile-2-60-5511522248626097950.xlsx>
thread: 0, iter: 60: <https://builds.apache.org/job/POI-DSL-Maven/ws/sonar/ooxml/target/tmp/poifiles/TestTempFileThreaded/339/TestTempFile-0-60-319041096767049881.xlsx>
thread: 8, iter: 60: <https://builds.apache.org/job/POI-DSL-Maven/ws/sonar/ooxml/target/tmp/poifiles/TestTempFileThreaded/347/TestTempFile-8-60-3314350491014131211.xlsx>
thread: 6, iter: 60: <https://builds.apache.org/job/POI-DSL-Maven/ws/sonar/ooxml/target/tmp/poifiles/TestTempFileThreaded/345/TestTempFile-6-60-1436599012661440539.xlsx>
thread: 1, iter: 90: <https://builds.apache.org/job/POI-DSL-Maven/ws/sonar/ooxml/target/tmp/poifiles/TestTempFileThreaded/340/TestTempFile-1-90-4775846637876852944.xlsx>
thread: 9, iter: 90: <https://builds.apache.org/job/POI-DSL-Maven/ws/sonar/ooxml/target/tmp/poifiles/TestTempFileThreaded/348/TestTempFile-9-90-1272846749197743470.xlsx>
thread: 3, iter: 90: <https://builds.apache.org/job/POI-DSL-Maven/ws/sonar/ooxml/target/tmp/poifiles/TestTempFileThreaded/342/TestTempFile-3-90-279821993150903641.xlsx>
thread: 7, iter: 90: <https://builds.apache.org/job/POI-DSL-Maven/ws/sonar/ooxml/target/tmp/poifiles/TestTempFileThreaded/346/TestTempFile-7-90-4431504162763610488.xlsx>
thread: 4, iter: 90: <https://builds.apache.org/job/POI-DSL-Maven/ws/sonar/ooxml/target/tmp/poifiles/TestTempFileThreaded/343/TestTempFile-4-90-103898325607211244.xlsx>
thread: 5, iter: 90: <https://builds.apache.org/job/POI-DSL-Maven/ws/sonar/ooxml/target/tmp/poifiles/TestTempFileThreaded/344/TestTempFile-5-90-9202521205604423391.xlsx>
thread: 2, iter: 90: <https://builds.apache.org/job/POI-DSL-Maven/ws/sonar/ooxml/target/tmp/poifiles/TestTempFileThreaded/341/TestTempFile-2-90-9099804155000740455.xlsx>
thread: 8, iter: 90: <https://builds.apache.org/job/POI-DSL-Maven/ws/sonar/ooxml/target/tmp/poifiles/TestTempFileThreaded/347/TestTempFile-8-90-2592717720397048139.xlsx>
thread: 0, iter: 90: <https://builds.apache.org/job/POI-DSL-Maven/ws/sonar/ooxml/target/tmp/poifiles/TestTempFileThreaded/339/TestTempFile-0-90-8941451984488818302.xlsx>
thread: 6, iter: 90: <https://builds.apache.org/job/POI-DSL-Maven/ws/sonar/ooxml/target/tmp/poifiles/TestTempFileThreaded/345/TestTempFile-6-90-1206772606485939465.xlsx>
thread: 9, iter: 120: <https://builds.apache.org/job/POI-DSL-Maven/ws/sonar/ooxml/target/tmp/poifiles/TestTempFileThreaded/348/TestTempFile-9-120-3418228151353779810.xlsx>
thread: 1, iter: 120: <https://builds.apache.org/job/POI-DSL-Maven/ws/sonar/ooxml/target/tmp/poifiles/TestTempFileThreaded/340/TestTempFile-1-120-1904434566644867841.xlsx>
thread: 7, iter: 120: <https://builds.apache.org/job/POI-DSL-Maven/ws/sonar/ooxml/target/tmp/poifiles/TestTempFileThreaded/346/TestTempFile-7-120-7726516834997392656.xlsx>
thread: 3, iter: 120: <https://builds.apache.org/job/POI-DSL-Maven/ws/sonar/ooxml/target/tmp/poifiles/TestTempFileThreaded/342/TestTempFile-3-120-8726606272618651852.xlsx>
thread: 4, iter: 120: <https://builds.apache.org/job/POI-DSL-Maven/ws/sonar/ooxml/target/tmp/poifiles/TestTempFileThreaded/343/TestTempFile-4-120-654634365045343563.xlsx>
thread: 5, iter: 120: <https://builds.apache.org/job/POI-DSL-Maven/ws/sonar/ooxml/target/tmp/poifiles/TestTempFileThreaded/344/TestTempFile-5-120-5786209018080565699.xlsx>
thread: 2, iter: 120: <https://builds.apache.org/job/POI-DSL-Maven/ws/sonar/ooxml/target/tmp/poifiles/TestTempFileThreaded/341/TestTempFile-2-120-5726422177454684509.xlsx>
thread: 8, iter: 120: <https://builds.apache.org/job/POI-DSL-Maven/ws/sonar/ooxml/target/tmp/poifiles/TestTempFileThreaded/347/TestTempFile-8-120-3306474504772390422.xlsx>
thread: 0, iter: 120: <https://builds.apache.org/job/POI-DSL-Maven/ws/sonar/ooxml/target/tmp/poifiles/TestTempFileThreaded/339/TestTempFile-0-120-2869765069691433115.xlsx>
thread: 6, iter: 120: <https://builds.apache.org/job/POI-DSL-Maven/ws/sonar/ooxml/target/tmp/poifiles/TestTempFileThreaded/345/TestTempFile-6-120-2330843077693721233.xlsx>
thread: 9, iter: 150: <https://builds.apache.org/job/POI-DSL-Maven/ws/sonar/ooxml/target/tmp/poifiles/TestTempFileThreaded/348/TestTempFile-9-150-1500098722261296933.xlsx>
thread: 7, iter: 150: <https://builds.apache.org/job/POI-DSL-Maven/ws/sonar/ooxml/target/tmp/poifiles/TestTempFileThreaded/346/TestTempFile-7-150-1302022146734638787.xlsx>
thread: 1, iter: 150: <https://builds.apache.org/job/POI-DSL-Maven/ws/sonar/ooxml/target/tmp/poifiles/TestTempFileThreaded/340/TestTempFile-1-150-1373121528669933841.xlsx>
thread: 3, iter: 150: <https://builds.apache.org/job/POI-DSL-Maven/ws/sonar/ooxml/target/tmp/poifiles/TestTempFileThreaded/342/TestTempFile-3-150-8400768738192154031.xlsx>
thread: 4, iter: 150: <https://builds.apache.org/job/POI-DSL-Maven/ws/sonar/ooxml/target/tmp/poifiles/TestTempFileThreaded/343/TestTempFile-4-150-5128272217634616771.xlsx>
thread: 5, iter: 150: <https://builds.apache.org/job/POI-DSL-Maven/ws/sonar/ooxml/target/tmp/poifiles/TestTempFileThreaded/344/TestTempFile-5-150-5095162084735081413.xlsx>
thread: 2, iter: 150: <https://builds.apache.org/job/POI-DSL-Maven/ws/sonar/ooxml/target/tmp/poifiles/TestTempFileThreaded/341/TestTempFile-2-150-794681645763231292.xlsx>
thread: 8, iter: 150: <https://builds.apache.org/job/POI-DSL-Maven/ws/sonar/ooxml/target/tmp/poifiles/TestTempFileThreaded/347/TestTempFile-8-150-557664093896742734.xlsx>
thread: 0, iter: 150: <https://builds.apache.org/job/POI-DSL-Maven/ws/sonar/ooxml/target/tmp/poifiles/TestTempFileThreaded/339/TestTempFile-0-150-8090529853777746021.xlsx>
thread: 6, iter: 150: <https://builds.apache.org/job/POI-DSL-Maven/ws/sonar/ooxml/target/tmp/poifiles/TestTempFileThreaded/345/TestTempFile-6-150-3263229633534385902.xlsx>
thread: 9, iter: 180: <https://builds.apache.org/job/POI-DSL-Maven/ws/sonar/ooxml/target/tmp/poifiles/TestTempFileThreaded/348/TestTempFile-9-180-3761524009937625632.xlsx>
thread: 7, iter: 180: <https://builds.apache.org/job/POI-DSL-Maven/ws/sonar/ooxml/target/tmp/poifiles/TestTempFileThreaded/346/TestTempFile-7-180-4780975074974702966.xlsx>
thread: 1, iter: 180: <https://builds.apache.org/job/POI-DSL-Maven/ws/sonar/ooxml/target/tmp/poifiles/TestTempFileThreaded/340/TestTempFile-1-180-2395257472130534423.xlsx>
thread: 3, iter: 180: <https://builds.apache.org/job/POI-DSL-Maven/ws/sonar/ooxml/target/tmp/poifiles/TestTempFileThreaded/342/TestTempFile-3-180-6029701760729437238.xlsx>
thread: 4, iter: 180: <https://builds.apache.org/job/POI-DSL-Maven/ws/sonar/ooxml/target/tmp/poifiles/TestTempFileThreaded/343/TestTempFile-4-180-7071075078291490815.xlsx>
thread: 2, iter: 180: <https://builds.apache.org/job/POI-DSL-Maven/ws/sonar/ooxml/target/tmp/poifiles/TestTempFileThreaded/341/TestTempFile-2-180-5924402615421962380.xlsx>
thread: 5, iter: 180: <https://builds.apache.org/job/POI-DSL-Maven/ws/sonar/ooxml/target/tmp/poifiles/TestTempFileThreaded/344/TestTempFile-5-180-2748752074734396336.xlsx>
thread: 8, iter: 180: <https://builds.apache.org/job/POI-DSL-Maven/ws/sonar/ooxml/target/tmp/poifiles/TestTempFileThreaded/347/TestTempFile-8-180-3916231265016480718.xlsx>
thread: 0, iter: 180: <https://builds.apache.org/job/POI-DSL-Maven/ws/sonar/ooxml/target/tmp/poifiles/TestTempFileThreaded/339/TestTempFile-0-180-5390679869521754017.xlsx>
thread: 6, iter: 180: <https://builds.apache.org/job/POI-DSL-Maven/ws/sonar/ooxml/target/tmp/poifiles/TestTempFileThreaded/345/TestTempFile-6-180-1593268786130414098.xlsx>
[INFO] Tests run: 1, Failures: 0, Errors: 0, Skipped: 0, Time elapsed: 4.927 s - in org.apache.poi.util.tests.TestTempFileThreaded
[INFO] Running org.apache.poi.util.tests.TestIdentifierManager
[INFO] Tests run: 5, Failures: 0, Errors: 0, Skipped: 0, Time elapsed: 0.002 s - in org.apache.poi.util.tests.TestIdentifierManager
[INFO] Running org.apache.poi.ss.tests.TestWorkbookFactory
[INFO] Tests run: 12, Failures: 0, Errors: 0, Skipped: 0, Time elapsed: 1.214 s - in org.apache.poi.ss.tests.TestWorkbookFactory
[INFO] Running org.apache.poi.ss.tests.usermodel.TestXSSFRangeCopier
[INFO] Tests run: 9, Failures: 0, Errors: 0, Skipped: 0, Time elapsed: 0.079 s - in org.apache.poi.ss.tests.usermodel.TestXSSFRangeCopier
[INFO] Running org.apache.poi.ss.tests.usermodel.ConditionalFormattingEvalTest
[INFO] Tests run: 5, Failures: 0, Errors: 0, Skipped: 0, Time elapsed: 0.978 s - in org.apache.poi.ss.tests.usermodel.ConditionalFormattingEvalTest
[INFO] Running org.apache.poi.ss.tests.usermodel.TestXSSFBorderStyle
[INFO] Tests run: 1, Failures: 0, Errors: 0, Skipped: 0, Time elapsed: 0.061 s - in org.apache.poi.ss.tests.usermodel.TestXSSFBorderStyle
[INFO] Running org.apache.poi.ss.tests.usermodel.TestEmbedOLEPackage
[INFO] Tests run: 3, Failures: 0, Errors: 0, Skipped: 0, Time elapsed: 0.09 s - in org.apache.poi.ss.tests.usermodel.TestEmbedOLEPackage
[INFO] Running org.apache.poi.ss.tests.format.TestCellFormatPart
[INFO] Tests run: 7, Failures: 0, Errors: 0, Skipped: 0, Time elapsed: 0.593 s - in org.apache.poi.ss.tests.format.TestCellFormatPart
[INFO] Running org.apache.poi.ss.tests.formula.TestStructuredReferences
[INFO] Tests run: 2, Failures: 0, Errors: 0, Skipped: 0, Time elapsed: 0.012 s - in org.apache.poi.ss.tests.formula.TestStructuredReferences
[INFO] Running org.apache.poi.ss.tests.formula.functions.TestSumifsXSSF
[INFO] Tests run: 1, Failures: 0, Errors: 0, Skipped: 0, Time elapsed: 0.019 s - in org.apache.poi.ss.tests.formula.functions.TestSumifsXSSF
[INFO] Running org.apache.poi.ss.tests.formula.functions.TestProper
[INFO] Tests run: 4, Failures: 0, Errors: 0, Skipped: 0, Time elapsed: 1.472 s - in org.apache.poi.ss.tests.formula.functions.TestProper
[INFO] Running org.apache.poi.ss.tests.formula.functions.CountifsTests
[INFO] Tests run: 3, Failures: 0, Errors: 0, Skipped: 0, Time elapsed: 0.038 s - in org.apache.poi.ss.tests.formula.functions.CountifsTests
[INFO] Running org.apache.poi.ss.tests.formula.functions.TestVlookup
[INFO] Tests run: 6, Failures: 0, Errors: 0, Skipped: 0, Time elapsed: 35.892 s - in org.apache.poi.ss.tests.formula.functions.TestVlookup
[INFO] Running org.apache.poi.ss.tests.formula.TestFormulaParser
[INFO] Tests run: 9, Failures: 0, Errors: 0, Skipped: 0, Time elapsed: 0.028 s - in org.apache.poi.ss.tests.formula.TestFormulaParser
[INFO] Running org.apache.poi.ss.tests.formula.eval.TestXSSFCircularReferences
[INFO] Tests run: 4, Failures: 0, Errors: 0, Skipped: 0, Time elapsed: 0.005 s - in org.apache.poi.ss.tests.formula.eval.TestXSSFCircularReferences
[INFO] Running org.apache.poi.ss.tests.extractor.TestEmbeddedExtractor
[INFO] Tests run: 3, Failures: 0, Errors: 0, Skipped: 0, Time elapsed: 0.166 s - in org.apache.poi.ss.tests.extractor.TestEmbeddedExtractor
[INFO] Running org.apache.poi.ss.tests.util.TestXSSFPropertyTemplate
[INFO] Tests run: 2, Failures: 0, Errors: 0, Skipped: 0, Time elapsed: 0.024 s - in org.apache.poi.ss.tests.util.TestXSSFPropertyTemplate
[INFO] Running org.apache.poi.ss.tests.util.TestSXSSFCellUtil
[INFO] Tests run: 14, Failures: 0, Errors: 0, Skipped: 0, Time elapsed: 0.044 s - in org.apache.poi.ss.tests.util.TestSXSSFCellUtil
[INFO] Running org.apache.poi.ss.tests.util.TestXSSFCellUtil
[INFO] Tests run: 14, Failures: 0, Errors: 0, Skipped: 0, Time elapsed: 0.038 s - in org.apache.poi.ss.tests.util.TestXSSFCellUtil
[INFO]
[INFO] Results:
[INFO]
[ERROR] Errors:
[ERROR]   TestSignatureInfo.testSignEnvelopingDocument:545 » Runtime error while creatin...
[INFO]
[ERROR] Tests run: 2715, Failures: 0, Errors: 1, Skipped: 147
[INFO]
[INFO] ------------------------------------------------------------------------
[INFO] Reactor Summary for Apache POI - the Java API for Microsoft Documents 5.0.0-SNAPSHOT:
[INFO]
[INFO] Apache POI - the Java API for Microsoft Documents .. SUCCESS [  1.215 s]
[INFO] Apache POI Main package ............................ SUCCESS [05:06 min]
[INFO] Apache POI Scratchpad package ...................... SUCCESS [ 34.646 s]
[INFO] Apache POI - Openxmlformats Schema package ......... SUCCESS [01:27 min]
[INFO] Apache POI - Openxmlformats Encryption Schema package SUCCESS [  2.330 s]
[INFO] Apache POI - Openxmlformats Security-Schema package  SUCCESS [  7.761 s]
[INFO] Apache POI OOXML package ........................... FAILURE [03:37 min]
[INFO] Apache POI ExcelAnt package ........................ SKIPPED
[INFO] Apache POI Examples package ........................ SKIPPED
[INFO] Apache POI integration test ........................ SKIPPED
[INFO] ------------------------------------------------------------------------
[INFO] BUILD FAILURE
[INFO] ------------------------------------------------------------------------
[INFO] Total time:  10:58 min
[INFO] Finished at: 2020-07-24T00:16:51Z
[INFO] ------------------------------------------------------------------------
[ERROR] Failed to execute goal org.apache.maven.plugins:maven-surefire-plugin:3.0.0-M4:test (default-test) on project poi-ooxml: There are test failures.
[ERROR]
[ERROR] Please refer to <https://builds.apache.org/job/POI-DSL-Maven/ws/sonar/ooxml/target/surefire-reports> for the individual test results.
[ERROR] Please refer to dump files (if any exist) [date].dump, [date]-jvmRun[N].dump and [date].dumpstream.
[ERROR] -> [Help 1]
[ERROR]
[ERROR] To see the full stack trace of the errors, re-run Maven with the -e switch.
[ERROR] Re-run Maven using the -X switch to enable full debug logging.
[ERROR]
[ERROR] For more information about the errors and possible solutions, please read the following articles:
[ERROR] [Help 1] http://cwiki.apache.org/confluence/display/MAVEN/MojoFailureException
[ERROR]
[ERROR] After correcting the problems, you can resume the build with the command
[ERROR]   mvn <args> -rf :poi-ooxml
Build step 'Invoke top-level Maven targets' marked build as failure
Recording test results

---------------------------------------------------------------------
To unsubscribe, e-mail: [hidden email]
For additional commands, e-mail: [hidden email]

Reply | Threaded
Open this post in threaded view
|

Jenkins build is back to normal : POI-DSL-Maven #1165

Apache Jenkins Server
See <https://builds.apache.org/job/POI-DSL-Maven/1165/display/redirect?page=changes>


---------------------------------------------------------------------
To unsubscribe, e-mail: [hidden email]
For additional commands, e-mail: [hidden email]