Build failed in Jenkins: POI-DSL-Maven #1040

classic Classic list List threaded Threaded
4 messages Options
Reply | Threaded
Open this post in threaded view
|

Build failed in Jenkins: POI-DSL-Maven #1040

Apache Jenkins Server
See <https://builds.apache.org/job/POI-DSL-Maven/1040/display/redirect?page=changes>

Changes:

[kiwiwings] prepare for 4.1.3

[kiwiwings] release prepare for 4.1.2 - updating build.xml and changes.xml

[kiwiwings] reset changes to 4.1.1 / add 64130

[tallison] Bug 64130 -- handle empty worksheet names in OldSheetRecord more robustly.


------------------------------------------
[...truncated 1.70 MB...]
Progress (1): 1.4 kB                    Downloaded from central: https://repo.maven.apache.org/maven2/org/apache/maven/maven-profile/2.0/maven-profile-2.0.pom (1.4 kB at 114 kB/s)
Downloading from central: https://repo.maven.apache.org/maven2/org/apache/maven/maven-artifact/2.0/maven-artifact-2.0.pom
Progress (1): 723 B                   Downloaded from central: https://repo.maven.apache.org/maven2/org/apache/maven/maven-artifact/2.0/maven-artifact-2.0.pom (723 B at 56 kB/s)
Downloading from central: https://repo.maven.apache.org/maven2/org/apache/maven/maven-repository-metadata/2.0/maven-repository-metadata-2.0.pom
Progress (1): 1.2 kB                    Downloaded from central: https://repo.maven.apache.org/maven2/org/apache/maven/maven-repository-metadata/2.0/maven-repository-metadata-2.0.pom (1.2 kB at 112 kB/s)
Downloading from central: https://repo.maven.apache.org/maven2/org/apache/maven/maven-error-diagnostics/2.0/maven-error-diagnostics-2.0.pom
Progress (1): 812 B                   Downloaded from central: https://repo.maven.apache.org/maven2/org/apache/maven/maven-error-diagnostics/2.0/maven-error-diagnostics-2.0.pom (812 B at 74 kB/s)
Downloading from central: https://repo.maven.apache.org/maven2/org/apache/maven/maven-project/2.0/maven-project-2.0.pom
Progress (1): 1.6 kB                    Downloaded from central: https://repo.maven.apache.org/maven2/org/apache/maven/maven-project/2.0/maven-project-2.0.pom (1.6 kB at 136 kB/s)
Downloading from central: https://repo.maven.apache.org/maven2/org/apache/maven/maven-artifact-manager/2.0/maven-artifact-manager-2.0.pom
Progress (1): 1.3 kB                    Downloaded from central: https://repo.maven.apache.org/maven2/org/apache/maven/maven-artifact-manager/2.0/maven-artifact-manager-2.0.pom (1.3 kB at 112 kB/s)
Downloading from central: https://repo.maven.apache.org/maven2/org/apache/maven/maven-plugin-registry/2.0/maven-plugin-registry-2.0.pom
Progress (1): 1.3 kB                    Downloaded from central: https://repo.maven.apache.org/maven2/org/apache/maven/maven-plugin-registry/2.0/maven-plugin-registry-2.0.pom (1.3 kB at 107 kB/s)
Downloading from central: https://repo.maven.apache.org/maven2/org/apache/maven/maven-plugin-api/2.0/maven-plugin-api-2.0.pom
Progress (1): 601 B                   Downloaded from central: https://repo.maven.apache.org/maven2/org/apache/maven/maven-plugin-api/2.0/maven-plugin-api-2.0.pom (601 B at 55 kB/s)
Downloading from central: https://repo.maven.apache.org/maven2/org/apache/maven/maven-plugin-descriptor/2.0/maven-plugin-descriptor-2.0.pom
Progress (1): 1.5 kB                    Downloaded from central: https://repo.maven.apache.org/maven2/org/apache/maven/maven-plugin-descriptor/2.0/maven-plugin-descriptor-2.0.pom (1.5 kB at 133 kB/s)
Downloading from central: https://repo.maven.apache.org/maven2/org/apache/maven/maven-monitor/2.0/maven-monitor-2.0.pom
Progress (1): 400 B                   Downloaded from central: https://repo.maven.apache.org/maven2/org/apache/maven/maven-monitor/2.0/maven-monitor-2.0.pom (400 B at 33 kB/s)
Downloading from central: https://repo.maven.apache.org/maven2/commons-io/commons-io/1.4/commons-io-1.4.pom
Progress (1): 2.2/13 kBProgress (1): 5.0/13 kBProgress (1): 7.8/13 kBProgress (1): 11/13 kB Progress (1): 13 kB                      Downloaded from central: https://repo.maven.apache.org/maven2/commons-io/commons-io/1.4/commons-io-1.4.pom (13 kB at 1.0 MB/s)
Downloading from central: https://repo.maven.apache.org/maven2/org/apache/commons/commons-parent/7/commons-parent-7.pom
Progress (1): 2.2/17 kBProgress (1): 5.0/17 kBProgress (1): 7.8/17 kBProgress (1): 11/17 kB Progress (1): 13/17 kBProgress (1): 16/17 kBProgress (1): 17 kB                      Downloaded from central: https://repo.maven.apache.org/maven2/org/apache/commons/commons-parent/7/commons-parent-7.pom (17 kB at 1.2 MB/s)
Downloading from central: https://repo.maven.apache.org/maven2/org/apache/httpcomponents/httpclient/4.0-beta2/httpclient-4.0-beta2.pom
Progress (1): 2.2/5.1 kBProgress (1): 5.0/5.1 kBProgress (1): 5.1 kB                        Downloaded from central: https://repo.maven.apache.org/maven2/org/apache/httpcomponents/httpclient/4.0-beta2/httpclient-4.0-beta2.pom (5.1 kB at 389 kB/s)
Downloading from central: https://repo.maven.apache.org/maven2/org/apache/httpcomponents/httpcomponents-client/4.0-beta2/httpcomponents-client-4.0-beta2.pom
Progress (1): 2.2/7.9 kBProgress (1): 5.0/7.9 kBProgress (1): 7.8/7.9 kBProgress (1): 7.9 kB                        Downloaded from central: https://repo.maven.apache.org/maven2/org/apache/httpcomponents/httpcomponents-client/4.0-beta2/httpcomponents-client-4.0-beta2.pom (7.9 kB at 656 kB/s)
Downloading from central: https://repo.maven.apache.org/maven2/org/apache/httpcomponents/project/4.0/project-4.0.pom
Progress (1): 2.2/13 kBProgress (1): 5.0/13 kBProgress (1): 7.8/13 kBProgress (1): 11/13 kB Progress (1): 13 kB                      Downloaded from central: https://repo.maven.apache.org/maven2/org/apache/httpcomponents/project/4.0/project-4.0.pom (13 kB at 1.0 MB/s)
Downloading from central: https://repo.maven.apache.org/maven2/org/apache/httpcomponents/httpcore/4.0-beta3/httpcore-4.0-beta3.pom
Progress (1): 2.2/4.7 kBProgress (1): 4.7 kB                        Downloaded from central: https://repo.maven.apache.org/maven2/org/apache/httpcomponents/httpcore/4.0-beta3/httpcore-4.0-beta3.pom (4.7 kB at 364 kB/s)
Downloading from central: https://repo.maven.apache.org/maven2/org/apache/httpcomponents/httpcomponents-core/4.0-beta3/httpcomponents-core-4.0-beta3.pom
Progress (1): 2.8/6.9 kBProgress (1): 5.5/6.9 kBProgress (1): 6.9 kB                        Downloaded from central: https://repo.maven.apache.org/maven2/org/apache/httpcomponents/httpcomponents-core/4.0-beta3/httpcomponents-core-4.0-beta3.pom (6.9 kB at 533 kB/s)
Downloading from central: https://repo.maven.apache.org/maven2/commons-logging/commons-logging/1.1.1/commons-logging-1.1.1.pom
Progress (1): 2.2/18 kBProgress (1): 5.0/18 kBProgress (1): 7.8/18 kBProgress (1): 11/18 kB Progress (1): 13/18 kBProgress (1): 16/18 kBProgress (1): 18 kB                      Downloaded from central: https://repo.maven.apache.org/maven2/commons-logging/commons-logging/1.1.1/commons-logging-1.1.1.pom (18 kB at 1.4 MB/s)
Downloading from central: https://repo.maven.apache.org/maven2/org/apache/commons/commons-parent/5/commons-parent-5.pom
Progress (1): 2.2/16 kBProgress (1): 5.0/16 kBProgress (1): 7.8/16 kBProgress (1): 11/16 kB Progress (1): 13/16 kBProgress (1): 16/16 kBProgress (1): 16 kB                      Downloaded from central: https://repo.maven.apache.org/maven2/org/apache/commons/commons-parent/5/commons-parent-5.pom (16 kB at 1.2 MB/s)
Downloading from central: https://repo.maven.apache.org/maven2/commons-codec/commons-codec/1.3/commons-codec-1.3.pom
Progress (1): 2.2/6.1 kBProgress (1): 5.0/6.1 kBProgress (1): 6.1 kB                        Downloaded from central: https://repo.maven.apache.org/maven2/commons-codec/commons-codec/1.3/commons-codec-1.3.pom (6.1 kB at 555 kB/s)
Downloading from central: https://repo.maven.apache.org/maven2/org/codehaus/plexus/plexus-archiver/1.2/plexus-archiver-1.2.pom
Progress (1): 2.0 kB                    Downloaded from central: https://repo.maven.apache.org/maven2/org/codehaus/plexus/plexus-archiver/1.2/plexus-archiver-1.2.pom (2.0 kB at 170 kB/s)
Downloading from central: https://repo.maven.apache.org/maven2/org/codehaus/plexus/plexus-io/1.0.1/plexus-io-1.0.1.pom
Progress (1): 1.2 kB                    Downloaded from central: https://repo.maven.apache.org/maven2/org/codehaus/plexus/plexus-io/1.0.1/plexus-io-1.0.1.pom (1.2 kB at 103 kB/s)
Downloading from central: https://repo.maven.apache.org/maven2/org/apache/maven/maven-core/2.0/maven-core-2.0.jar
Downloading from central: https://repo.maven.apache.org/maven2/org/apache/maven/maven-settings/2.0/maven-settings-2.0.jar
Downloading from central: https://repo.maven.apache.org/maven2/org/apache/maven/reporting/maven-reporting-api/2.0/maven-reporting-api-2.0.jar
Downloading from central: https://repo.maven.apache.org/maven2/org/apache/maven/maven-plugin-parameter-documenter/2.0/maven-plugin-parameter-documenter-2.0.jar
Downloading from central: https://repo.maven.apache.org/maven2/doxia/doxia-sink-api/1.0-alpha-4/doxia-sink-api-1.0-alpha-4.jar
Progress (1): 2.2/6.6 kBProgress (2): 2.2/6.6 kB | 2.2/43 kBProgress (2): 5.0/6.6 kB | 2.2/43 kBProgress (2): 5.0/6.6 kB | 5.0/43 kBProgress (2): 6.6 kB | 5.0/43 kB    Progress (2): 6.6 kB | 7.7/43 kBProgress (3): 6.6 kB | 7.7/43 kB | 2.2/4.3 kBProgress (3): 6.6 kB | 10/43 kB | 2.2/4.3 kB Progress (4): 6.6 kB | 10/43 kB | 2.2/4.3 kB | 2.2/18 kBProgress (4): 6.6 kB | 13/43 kB | 2.2/4.3 kB | 2.2/18 kBProgress (4): 6.6 kB | 13/43 kB | 4.3 kB | 2.2/18 kB    Progress (4): 6.6 kB | 13/43 kB | 4.3 kB | 5.0/18 kBProgress (4): 6.6 kB | 16/43 kB | 4.3 kB | 5.0/18 kBProgress (4): 6.6 kB | 16/43 kB | 4.3 kB | 7.7/18 kBProgress (4): 6.6 kB | 19/43 kB | 4.3 kB | 7.7/18 kBProgress (4): 6.6 kB | 19/43 kB | 4.3 kB | 10/18 kB Progress (4): 6.6 kB | 21/43 kB | 4.3 kB | 10/18 kBProgress (4): 6.6 kB | 21/43 kB | 4.3 kB | 13/18 kBProgress (4): 6.6 kB | 24/43 kB | 4.3 kB | 13/18 kBProgress (4): 6.6 kB | 24/43 kB | 4.3 kB | 16/18 kBProgress (4): 6.6 kB | 27/43 kB | 4.3 kB | 16/18 kBProgress (4): 6.6 kB | 27/43 kB | 4.3 kB | 18 kB   Progress (4): 6.6 kB | 30/43 kB | 4.3 kB | 18 kBProgress (4): 6.6 kB | 32/43 kB | 4.3 kB | 18 kBProgress (4): 6.6 kB | 36/43 kB | 4.3 kB | 18 kBProgress (4): 6.6 kB | 40/43 kB | 4.3 kB | 18 kBProgress (4): 6.6 kB | 43 kB | 4.3 kB | 18 kB                                                Downloaded from central: https://repo.maven.apache.org/maven2/org/apache/maven/reporting/maven-reporting-api/2.0/maven-reporting-api-2.0.jar (6.6 kB at 438 kB/s)
Downloading from central: https://repo.maven.apache.org/maven2/org/apache/maven/maven-profile/2.0/maven-profile-2.0.jar
Downloaded from central: https://repo.maven.apache.org/maven2/doxia/doxia-sink-api/1.0-alpha-4/doxia-sink-api-1.0-alpha-4.jar (4.3 kB at 268 kB/s)
Downloading from central: https://repo.maven.apache.org/maven2/org/apache/maven/maven-model/2.0/maven-model-2.0.jar
Downloaded from central: https://repo.maven.apache.org/maven2/org/apache/maven/maven-plugin-parameter-documenter/2.0/maven-plugin-parameter-documenter-2.0.jar (18 kB at 979 kB/s)
Downloading from central: https://repo.maven.apache.org/maven2/org/codehaus/plexus/plexus-container-default/1.0-alpha-8/plexus-container-default-1.0-alpha-8.jar
Downloaded from central: https://repo.maven.apache.org/maven2/org/apache/maven/maven-settings/2.0/maven-settings-2.0.jar (43 kB at 2.3 MB/s)
Downloading from central: https://repo.maven.apache.org/maven2/org/apache/maven/maven-repository-metadata/2.0/maven-repository-metadata-2.0.jar
Progress (1): 2.2/30 kBProgress (1): 5.0/30 kBProgress (1): 7.7/30 kBProgress (2): 7.7/30 kB | 2.2/78 kBProgress (2): 10/30 kB | 2.2/78 kB Progress (2): 10/30 kB | 5.0/78 kBProgress (2): 13/30 kB | 5.0/78 kBProgress (2): 13/30 kB | 7.7/78 kBProgress (2): 16/30 kB | 7.7/78 kBProgress (2): 16/30 kB | 10/78 kB Progress (2): 19/30 kB | 10/78 kBProgress (2): 19/30 kB | 13/78 kBProgress (2): 21/30 kB | 13/78 kBProgress (2): 21/30 kB | 16/78 kBProgress (2): 24/30 kB | 16/78 kBProgress (2): 24/30 kB | 19/78 kBProgress (2): 27/30 kB | 19/78 kBProgress (2): 27/30 kB | 21/78 kBProgress (2): 30/30 kB | 21/78 kBProgress (2): 30/30 kB | 24/78 kBProgress (2): 30 kB | 24/78 kB   Progress (2): 30 kB | 27/78 kBProgress (2): 30 kB | 30/78 kBProgress (3): 30 kB | 30/78 kB | 2.2/195 kBProgress (3): 30 kB | 32/78 kB | 2.2/195 kBProgress (3): 30 kB | 32/78 kB | 5.0/195 kBProgress (3): 30 kB | 32/78 kB | 7.7/195 kBProgress (3): 30 kB | 36/78 kB | 7.7/195 kBProgress (4): 30 kB | 36/78 kB | 7.7/195 kB | 4.1/21 kBProgress (4): 30 kB | 36/78 kB | 10/195 kB | 4.1/21 kB Progress (4): 30 kB | 40/78 kB | 10/195 kB | 4.1/21 kBProgress (4): 30 kB | 40/78 kB | 13/195 kB | 4.1/21 kBProgress (4): 30 kB | 40/78 kB | 13/195 kB | 7.7/21 kBProgress (4): 30 kB | 40/78 kB | 16/195 kB | 7.7/21 kBProgress (4): 30 kB | 45/78 kB | 16/195 kB | 7.7/21 kBProgress (4): 30 kB | 45/78 kB | 19/195 kB | 7.7/21 kBProgress (4): 30 kB | 45/78 kB | 19/195 kB | 12/21 kB Progress (4): 30 kB | 45/78 kB | 21/195 kB | 12/21 kBProgress (4): 30 kB | 49/78 kB | 21/195 kB | 12/21 kBProgress (4): 30 kB | 49/78 kB | 24/195 kB | 12/21 kBProgress (4): 30 kB | 49/78 kB | 24/195 kB | 16/21 kBProgress (4): 30 kB | 49/78 kB | 27/195 kB | 16/21 kBProgress (4): 30 kB | 49/78 kB | 27/195 kB | 20/21 kBProgress (4): 30 kB | 53/78 kB | 27/195 kB | 20/21 kBProgress (4): 30 kB | 53/78 kB | 30/195 kB | 20/21 kBProgress (4): 30 kB | 57/78 kB | 30/195 kB | 20/21 kBProgress (4): 30 kB | 57/78 kB | 32/195 kB | 20/21 kBProgress (4): 30 kB | 57/78 kB | 32/195 kB | 21 kB   Progress (4): 30 kB | 61/78 kB | 32/195 kB | 21 kBProgress (4): 30 kB | 65/78 kB | 32/195 kB | 21 kB                                                  Downloaded from central: https://repo.maven.apache.org/maven2/org/apache/maven/maven-profile/2.0/maven-profile-2.0.jar (30 kB at 1.0 MB/s)
Downloading from central: https://repo.maven.apache.org/maven2/org/apache/maven/maven-error-diagnostics/2.0/maven-error-diagnostics-2.0.jar
Progress (3): 65/78 kB | 36/195 kB | 21 kBProgress (3): 69/78 kB | 36/195 kB | 21 kBProgress (3): 69/78 kB | 40/195 kB | 21 kBProgress (3): 73/78 kB | 40/195 kB | 21 kBProgress (3): 73/78 kB | 45/195 kB | 21 kBProgress (3): 77/78 kB | 45/195 kB | 21 kBProgress (3): 77/78 kB | 49/195 kB | 21 kBProgress (3): 78 kB | 49/195 kB | 21 kB   Progress (3): 78 kB | 53/195 kB | 21 kBProgress (3): 78 kB | 57/195 kB | 21 kBProgress (3): 78 kB | 61/195 kB | 21 kBProgress (3): 78 kB | 65/195 kB | 21 kBProgress (3): 78 kB | 69/195 kB | 21 kBProgress (3): 78 kB | 73/195 kB | 21 kBProgress (3): 78 kB | 77/195 kB | 21 kBProgress (3): 78 kB | 81/195 kB | 21 kBProgress (3): 78 kB | 85/195 kB | 21 kBProgress (3): 78 kB | 90/195 kB | 21 kB                                       Downloaded from central: https://repo.maven.apache.org/maven2/org/apache/maven/maven-repository-metadata/2.0/maven-repository-metadata-2.0.jar (21 kB at 574 kB/s)
Downloading from central: https://repo.maven.apache.org/maven2/org/apache/maven/maven-plugin-registry/2.0/maven-plugin-registry-2.0.jar
Progress (2): 78 kB | 94/195 kBProgress (3): 78 kB | 94/195 kB | 2.2/136 kBProgress (3): 78 kB | 98/195 kB | 2.2/136 kBProgress (4): 78 kB | 98/195 kB | 2.2/136 kB | 4.1/10 kBProgress (4): 78 kB | 98/195 kB | 5.0/136 kB | 4.1/10 kBProgress (4): 78 kB | 98/195 kB | 5.0/136 kB | 8.2/10 kBProgress (4): 78 kB | 98/195 kB | 5.0/136 kB | 10 kB    Progress (4): 78 kB | 102/195 kB | 5.0/136 kB | 10 kB                                                     Downloaded from central: https://repo.maven.apache.org/maven2/org/apache/maven/maven-model/2.0/maven-model-2.0.jar (78 kB at 2.1 MB/s)
Progress (3): 102/195 kB | 7.7/136 kB | 10 kB                                             Downloading from central: https://repo.maven.apache.org/maven2/org/apache/maven/maven-plugin-descriptor/2.0/maven-plugin-descriptor-2.0.jar
Progress (3): 106/195 kB | 7.7/136 kB | 10 kBProgress (3): 106/195 kB | 10/136 kB | 10 kB Progress (3): 110/195 kB | 10/136 kB | 10 kBProgress (3): 114/195 kB | 10/136 kB | 10 kBProgress (3): 114/195 kB | 13/136 kB | 10 kBProgress (3): 114/195 kB | 16/136 kB | 10 kBProgress (3): 114/195 kB | 19/136 kB | 10 kBProgress (3): 118/195 kB | 19/136 kB | 10 kBProgress (3): 118/195 kB | 21/136 kB | 10 kBProgress (3): 122/195 kB | 21/136 kB | 10 kBProgress (3): 126/195 kB | 21/136 kB | 10 kBProgress (3): 126/195 kB | 24/136 kB | 10 kBProgress (3): 131/195 kB | 24/136 kB | 10 kBProgress (3): 131/195 kB | 27/136 kB | 10 kBProgress (3): 131/195 kB | 30/136 kB | 10 kBProgress (3): 131/195 kB | 32/136 kB | 10 kBProgress (3): 135/195 kB | 32/136 kB | 10 kBProgress (3): 139/195 kB | 32/136 kB | 10 kBProgress (3): 143/195 kB | 32/136 kB | 10 kBProgress (4): 143/195 kB | 32/136 kB | 10 kB | 2.2/25 kBProgress (4): 143/195 kB | 36/136 kB | 10 kB | 2.2/25 kBProgress (4): 147/195 kB | 36/136 kB | 10 kB | 2.2/25 kBProgress (4): 147/195 kB | 36/136 kB | 10 kB | 5.0/25 kBProgress (4): 147/195 kB | 40/136 kB | 10 kB | 5.0/25 kBProgress (4): 147/195 kB | 40/136 kB | 10 kB | 7.7/25 kBProgress (4): 147/195 kB | 45/136 kB | 10 kB | 7.7/25 kBProgress (4): 147/195 kB | 45/136 kB | 10 kB | 10/25 kB Progress (4): 147/195 kB | 49/136 kB | 10 kB | 10/25 kBProgress (4): 151/195 kB | 49/136 kB | 10 kB | 10/25 kB                                                       Downloaded from central: https://repo.maven.apache.org/maven2/org/apache/maven/maven-error-diagnostics/2.0/maven-error-diagnostics-2.0.jar (10 kB at 238 kB/s)
Downloading from central: https://repo.maven.apache.org/maven2/org/apache/maven/maven-artifact-manager/2.0/maven-artifact-manager-2.0.jar
Progress (3): 151/195 kB | 49/136 kB | 13/25 kBProgress (3): 151/195 kB | 53/136 kB | 13/25 kBProgress (3): 155/195 kB | 53/136 kB | 13/25 kBProgress (4): 155/195 kB | 53/136 kB | 13/25 kB | 4.1/33 kBProgress (4): 155/195 kB | 57/136 kB | 13/25 kB | 4.1/33 kBProgress (4): 155/195 kB | 57/136 kB | 16/25 kB | 4.1/33 kBProgress (4): 155/195 kB | 61/136 kB | 16/25 kB | 4.1/33 kBProgress (4): 155/195 kB | 61/136 kB | 16/25 kB | 7.7/33 kBProgress (4): 159/195 kB | 61/136 kB | 16/25 kB | 7.7/33 kBProgress (4): 159/195 kB | 61/136 kB | 16/25 kB | 12/33 kB Progress (4): 159/195 kB | 65/136 kB | 16/25 kB | 12/33 kBProgress (4): 159/195 kB | 65/136 kB | 19/25 kB | 12/33 kBProgress (4): 159/195 kB | 65/136 kB | 19/25 kB | 16/33 kBProgress (4): 163/195 kB | 65/136 kB | 19/25 kB | 16/33 kBProgress (4): 163/195 kB | 65/136 kB | 21/25 kB | 16/33 kBProgress (4): 163/195 kB | 69/136 kB | 21/25 kB | 16/33 kBProgress (4): 163/195 kB | 69/136 kB | 24/25 kB | 16/33 kBProgress (4): 163/195 kB | 69/136 kB | 24/25 kB | 20/33 kBProgress (4): 163/195 kB | 73/136 kB | 24/25 kB | 20/33 kBProgress (4): 163/195 kB | 73/136 kB | 24/25 kB | 24/33 kBProgress (4): 167/195 kB | 73/136 kB | 24/25 kB | 24/33 kBProgress (4): 167/195 kB | 73/136 kB | 25 kB | 24/33 kB   Progress (4): 171/195 kB | 73/136 kB | 25 kB | 24/33 kBProgress (4): 171/195 kB | 73/136 kB | 25 kB | 28/33 kBProgress (4): 171/195 kB | 77/136 kB | 25 kB | 28/33 kBProgress (4): 171/195 kB | 77/136 kB | 25 kB | 32/33 kBProgress (4): 176/195 kB | 77/136 kB | 25 kB | 32/33 kBProgress (4): 176/195 kB | 77/136 kB | 25 kB | 33 kB   Progress (4): 176/195 kB | 81/136 kB | 25 kB | 33 kBProgress (4): 180/195 kB | 81/136 kB | 25 kB | 33 kBProgress (5): 180/195 kB | 81/136 kB | 25 kB | 33 kB | 4.1/51 kBProgress (5): 180/195 kB | 85/136 kB | 25 kB | 33 kB | 4.1/51 kBProgress (5): 180/195 kB | 85/136 kB | 25 kB | 33 kB | 7.7/51 kBProgress (5): 184/195 kB | 85/136 kB | 25 kB | 33 kB | 7.7/51 kBProgress (5): 184/195 kB | 85/136 kB | 25 kB | 33 kB | 12/51 kB Progress (5): 184/195 kB | 90/136 kB | 25 kB | 33 kB | 12/51 kBProgress (5): 184/195 kB | 90/136 kB | 25 kB | 33 kB | 16/51 kBProgress (5): 188/195 kB | 90/136 kB | 25 kB | 33 kB | 16/51 kBProgress (5): 188/195 kB | 94/136 kB | 25 kB | 33 kB | 16/51 kBProgress (5): 192/195 kB | 94/136 kB | 25 kB | 33 kB | 16/51 kBProgress (5): 192/195 kB | 98/136 kB | 25 kB | 33 kB | 16/51 kBProgress (5): 192/195 kB | 98/136 kB | 25 kB | 33 kB | 20/51 kBProgress (5): 195 kB | 98/136 kB | 25 kB | 33 kB | 20/51 kB    Progress (5): 195 kB | 98/136 kB | 25 kB | 33 kB | 24/51 kBProgress (5): 195 kB | 98/136 kB | 25 kB | 33 kB | 28/51 kBProgress (5): 195 kB | 102/136 kB | 25 kB | 33 kB | 28/51 kBProgress (5): 195 kB | 102/136 kB | 25 kB | 33 kB | 32/51 kBProgress (5): 195 kB | 106/136 kB | 25 kB | 33 kB | 32/51 kBProgress (5): 195 kB | 110/136 kB | 25 kB | 33 kB | 32/51 kBProgress (5): 195 kB | 114/136 kB | 25 kB | 33 kB | 32/51 kBProgress (5): 195 kB | 114/136 kB | 25 kB | 33 kB | 36/51 kBProgress (5): 195 kB | 114/136 kB | 25 kB | 33 kB | 40/51 kBProgress (5): 195 kB | 114/136 kB | 25 kB | 33 kB | 45/51 kB                                                            Downloaded from central: https://repo.maven.apache.org/maven2/org/apache/maven/maven-plugin-descriptor/2.0/maven-plugin-descriptor-2.0.jar (33 kB at 602 kB/s)
Downloading from central: https://repo.maven.apache.org/maven2/org/apache/maven/maven-monitor/2.0/maven-monitor-2.0.jar
Progress (4): 195 kB | 118/136 kB | 25 kB | 45/51 kB                                                    Downloaded from central: https://repo.maven.apache.org/maven2/org/apache/maven/maven-plugin-registry/2.0/maven-plugin-registry-2.0.jar (25 kB at 450 kB/s)
Progress (3): 195 kB | 118/136 kB | 49/51 kB                                            Downloading from central: https://repo.maven.apache.org/maven2/org/codehaus/plexus/plexus-utils/1.0.4/plexus-utils-1.0.4.jar
Progress (3): 195 kB | 122/136 kB | 49/51 kBProgress (3): 195 kB | 122/136 kB | 51 kB   Progress (3): 195 kB | 126/136 kB | 51 kBProgress (3): 195 kB | 131/136 kB | 51 kBProgress (3): 195 kB | 135/136 kB | 51 kBProgress (3): 195 kB | 136 kB | 51 kB                                         Downloaded from central: https://repo.maven.apache.org/maven2/org/codehaus/plexus/plexus-container-default/1.0-alpha-8/plexus-container-default-1.0-alpha-8.jar (195 kB at 3.3 MB/s)
Downloading from central: https://repo.maven.apache.org/maven2/org/apache/maven/maven-plugin-api/2.0/maven-plugin-api-2.0.jar
Progress (3): 136 kB | 51 kB | 2.2/7.6 kBProgress (3): 136 kB | 51 kB | 5.0/7.6 kBProgress (3): 136 kB | 51 kB | 7.6 kB                                         Downloaded from central: https://repo.maven.apache.org/maven2/org/apache/maven/maven-artifact-manager/2.0/maven-artifact-manager-2.0.jar (51 kB at 804 kB/s)
Progress (3): 136 kB | 7.6 kB | 4.1/164 kB                                          Downloading from central: https://repo.maven.apache.org/maven2/org/apache/maven/maven-artifact/2.0/maven-artifact-2.0.jar
Progress (3): 136 kB | 7.6 kB | 7.7/164 kB                                          Downloaded from central: https://repo.maven.apache.org/maven2/org/apache/maven/maven-core/2.0/maven-core-2.0.jar (136 kB at 2.1 MB/s)
Downloading from central: https://repo.maven.apache.org/maven2/org/apache/maven/maven-project/2.0/maven-project-2.0.jar
Progress (2): 7.6 kB | 12/164 kBProgress (3): 7.6 kB | 12/164 kB | 4.1/10 kBProgress (3): 7.6 kB | 16/164 kB | 4.1/10 kBProgress (3): 7.6 kB | 16/164 kB | 7.7/10 kBProgress (3): 7.6 kB | 16/164 kB | 10 kB    Progress (3): 7.6 kB | 20/164 kB | 10 kBProgress (3): 7.6 kB | 24/164 kB | 10 kBProgress (3): 7.6 kB | 28/164 kB | 10 kBProgress (3): 7.6 kB | 32/164 kB | 10 kBProgress (3): 7.6 kB | 36/164 kB | 10 kBProgress (3): 7.6 kB | 40/164 kB | 10 kB                                        Downloaded from central: https://repo.maven.apache.org/maven2/org/apache/maven/maven-monitor/2.0/maven-monitor-2.0.jar (7.6 kB at 112 kB/s)
Downloading from central: https://repo.maven.apache.org/maven2/commons-io/commons-io/1.4/commons-io-1.4.jar
Progress (2): 45/164 kB | 10 kBProgress (2): 49/164 kB | 10 kBProgress (2): 53/164 kB | 10 kBProgress (2): 57/164 kB | 10 kBProgress (2): 61/164 kB | 10 kBProgress (2): 65/164 kB | 10 kBProgress (2): 69/164 kB | 10 kBProgress (2): 73/164 kB | 10 kBProgress (3): 73/164 kB | 10 kB | 4.1/79 kBProgress (4): 73/164 kB | 10 kB | 4.1/79 kB | 2.2/105 kBProgress (4): 73/164 kB | 10 kB | 7.7/79 kB | 2.2/105 kBProgress (4): 73/164 kB | 10 kB | 7.7/79 kB | 5.0/105 kBProgress (4): 77/164 kB | 10 kB | 7.7/79 kB | 5.0/105 kB                                                        Downloaded from central: https://repo.maven.apache.org/maven2/org/apache/maven/maven-plugin-api/2.0/maven-plugin-api-2.0.jar (10 kB at 141 kB/s)
Downloading from central: https://repo.maven.apache.org/maven2/org/apache/httpcomponents/httpclient/4.0-beta2/httpclient-4.0-beta2.jar
Progress (3): 77/164 kB | 12/79 kB | 5.0/105 kBProgress (3): 81/164 kB | 12/79 kB | 5.0/105 kBProgress (3): 81/164 kB | 12/79 kB | 7.7/105 kBProgress (3): 81/164 kB | 16/79 kB | 7.7/105 kBProgress (3): 81/164 kB | 16/79 kB | 10/105 kB Progress (3): 85/164 kB | 16/79 kB | 10/105 kBProgress (4): 85/164 kB | 16/79 kB | 10/105 kB | 2.2/109 kBProgress (4): 85/164 kB | 16/79 kB | 13/105 kB | 2.2/109 kBProgress (4): 85/164 kB | 20/79 kB | 13/105 kB | 2.2/109 kBProgress (4): 90/164 kB | 20/79 kB | 13/105 kB | 2.2/109 kBProgress (4): 90/164 kB | 24/79 kB | 13/105 kB | 2.2/109 kBProgress (4): 90/164 kB | 24/79 kB | 16/105 kB | 2.2/109 kBProgress (4): 90/164 kB | 24/79 kB | 16/105 kB | 5.0/109 kBProgress (4): 90/164 kB | 24/79 kB | 19/105 kB | 5.0/109 kBProgress (4): 90/164 kB | 28/79 kB | 19/105 kB | 5.0/109 kBProgress (4): 90/164 kB | 28/79 kB | 21/105 kB | 5.0/109 kBProgress (4): 94/164 kB | 28/79 kB | 21/105 kB | 5.0/109 kBProgress (4): 94/164 kB | 32/79 kB | 21/105 kB | 5.0/109 kBProgress (4): 94/164 kB | 32/79 kB | 21/105 kB | 7.7/109 kBProgress (4): 98/164 kB | 32/79 kB | 21/105 kB | 7.7/109 kBProgress (4): 98/164 kB | 32/79 kB | 21/105 kB | 10/109 kB Progress (4): 98/164 kB | 32/79 kB | 24/105 kB | 10/109 kBProgress (4): 98/164 kB | 36/79 kB | 24/105 kB | 10/109 kBProgress (4): 98/164 kB | 36/79 kB | 24/105 kB | 13/109 kBProgress (4): 102/164 kB | 36/79 kB | 24/105 kB | 13/109 kBProgress (4): 102/164 kB | 40/79 kB | 24/105 kB | 13/109 kBProgress (4): 102/164 kB | 40/79 kB | 27/105 kB | 13/109 kBProgress (4): 102/164 kB | 45/79 kB | 27/105 kB | 13/109 kBProgress (4): 106/164 kB | 45/79 kB | 27/105 kB | 13/109 kBProgress (4): 106/164 kB | 45/79 kB | 27/105 kB | 16/109 kBProgress (4): 110/164 kB | 45/79 kB | 27/105 kB | 16/109 kBProgress (4): 110/164 kB | 45/79 kB | 30/105 kB | 16/109 kBProgress (4): 110/164 kB | 45/79 kB | 30/105 kB | 19/109 kBProgress (4): 110/164 kB | 49/79 kB | 30/105 kB | 19/109 kBProgress (4): 110/164 kB | 49/79 kB | 32/105 kB | 19/109 kBProgress (4): 114/164 kB | 49/79 kB | 32/105 kB | 19/109 kBProgress (4): 114/164 kB | 49/79 kB | 32/105 kB | 21/109 kBProgress (4): 114/164 kB | 53/79 kB | 32/105 kB | 21/109 kBProgress (4): 114/164 kB | 57/79 kB | 32/105 kB | 21/109 kBProgress (4): 114/164 kB | 57/79 kB | 32/105 kB | 24/109 kBProgress (4): 114/164 kB | 61/79 kB | 32/105 kB | 24/109 kBProgress (4): 118/164 kB | 61/79 kB | 32/105 kB | 24/109 kBProgress (4): 118/164 kB | 61/79 kB | 32/105 kB | 27/109 kBProgress (4): 118/164 kB | 65/79 kB | 32/105 kB | 27/109 kBProgress (4): 118/164 kB | 65/79 kB | 36/105 kB | 27/109 kBProgress (4): 118/164 kB | 65/79 kB | 36/105 kB | 30/109 kBProgress (5): 118/164 kB | 65/79 kB | 36/105 kB | 30/109 kB | 4.1/276 kBProgress (5): 122/164 kB | 65/79 kB | 36/105 kB | 30/109 kB | 4.1/276 kBProgress (5): 122/164 kB | 65/79 kB | 36/105 kB | 30/109 kB | 7.7/276 kBProgress (5): 122/164 kB | 65/79 kB | 36/105 kB | 32/109 kB | 7.7/276 kBProgress (5): 122/164 kB | 69/79 kB | 36/105 kB | 32/109 kB | 7.7/276 kBProgress (5): 122/164 kB | 69/79 kB | 40/105 kB | 32/109 kB | 7.7/276 kBProgress (5): 122/164 kB | 73/79 kB | 40/105 kB | 32/109 kB | 7.7/276 kBProgress (5): 122/164 kB | 73/79 kB | 40/105 kB | 32/109 kB | 12/276 kB Progress (5): 126/164 kB | 73/79 kB | 40/105 kB | 32/109 kB | 12/276 kBProgress (5): 126/164 kB | 73/79 kB | 40/105 kB | 32/109 kB | 16/276 kBProgress (5): 126/164 kB | 77/79 kB | 40/105 kB | 32/109 kB | 16/276 kBProgress (5): 126/164 kB | 77/79 kB | 40/105 kB | 36/109 kB | 16/276 kBProgress (5): 126/164 kB | 77/79 kB | 45/105 kB | 36/109 kB | 16/276 kBProgress (5): 126/164 kB | 77/79 kB | 45/105 kB | 40/109 kB | 16/276 kBProgress (5): 126/164 kB | 79 kB | 45/105 kB | 40/109 kB | 16/276 kB   Progress (5): 126/164 kB | 79 kB | 45/105 kB | 40/109 kB | 20/276 kBProgress (5): 131/164 kB | 79 kB | 45/105 kB | 40/109 kB | 20/276 kBProgress (5): 131/164 kB | 79 kB | 45/105 kB | 40/109 kB | 24/276 kBProgress (5): 131/164 kB | 79 kB | 45/105 kB | 45/109 kB | 24/276 kBProgress (5): 131/164 kB | 79 kB | 49/105 kB | 45/109 kB | 24/276 kBProgress (5): 131/164 kB | 79 kB | 49/105 kB | 49/109 kB | 24/276 kBProgress (5): 135/164 kB | 79 kB | 49/105 kB | 49/109 kB | 24/276 kBProgress (5): 135/164 kB | 79 kB | 49/105 kB | 49/109 kB | 28/276 kBProgress (5): 139/164 kB | 79 kB | 49/105 kB | 49/109 kB | 28/276 kBProgress (5): 139/164 kB | 79 kB | 49/105 kB | 49/109 kB | 32/276 kBProgress (5): 139/164 kB | 79 kB | 53/105 kB | 49/109 kB | 32/276 kBProgress (5): 143/164 kB | 79 kB | 53/105 kB | 49/109 kB | 32/276 kBProgress (5): 143/164 kB | 79 kB | 53/105 kB | 53/109 kB | 32/276 kBProgress (5): 147/164 kB | 79 kB | 53/105 kB | 53/109 kB | 32/276 kBProgress (5): 147/164 kB | 79 kB | 57/105 kB | 53/109 kB | 32/276 kBProgress (5): 147/164 kB | 79 kB | 57/105 kB | 57/109 kB | 32/276 kBProgress (5): 147/164 kB | 79 kB | 57/105 kB | 57/109 kB | 36/276 kBProgress (5): 147/164 kB | 79 kB | 61/105 kB | 57/109 kB | 36/276 kBProgress (5): 147/164 kB | 79 kB | 61/105 kB | 57/109 kB | 40/276 kBProgress (5): 151/164 kB | 79 kB | 61/105 kB | 57/109 kB | 40/276 kBProgress (5): 151/164 kB | 79 kB | 61/105 kB | 61/109 kB | 40/276 kBProgress (5): 155/164 kB | 79 kB | 61/105 kB | 61/109 kB | 40/276 kBProgress (5): 155/164 kB | 79 kB | 61/105 kB | 61/109 kB | 45/276 kBProgress (5): 155/164 kB | 79 kB | 65/105 kB | 61/109 kB | 45/276 kB                                                                    Downloaded from central: https://repo.maven.apache.org/maven2/org/apache/maven/maven-artifact/2.0/maven-artifact-2.0.jar (79 kB at 875 kB/s)
Progress (4): 155/164 kB | 65/105 kB | 61/109 kB | 49/276 kBProgress (4): 159/164 kB | 65/105 kB | 61/109 kB | 49/276 kBProgress (4): 159/164 kB | 65/105 kB | 65/109 kB | 49/276 kBProgress (4): 163/164 kB | 65/105 kB | 65/109 kB | 49/276 kBProgress (4): 163/164 kB | 69/105 kB | 65/109 kB | 49/276 kB                                                            Downloading from central: https://repo.maven.apache.org/maven2/org/apache/httpcomponents/httpcore/4.0-beta3/httpcore-4.0-beta3.jar
Progress (4): 163/164 kB | 69/105 kB | 65/109 kB | 53/276 kBProgress (4): 163/164 kB | 69/105 kB | 69/109 kB | 53/276 kBProgress (4): 163/164 kB | 73/105 kB | 69/109 kB | 53/276 kBProgress (4): 164 kB | 73/105 kB | 69/109 kB | 53/276 kB    Progress (4): 164 kB | 77/105 kB | 69/109 kB | 53/276 kBProgress (4): 164 kB | 77/105 kB | 73/109 kB | 53/276 kBProgress (4): 164 kB | 77/105 kB | 73/109 kB | 57/276 kBProgress (4): 164 kB | 77/105 kB | 77/109 kB | 57/276 kBProgress (4): 164 kB | 81/105 kB | 77/109 kB | 57/276 kBProgress (4): 164 kB | 81/105 kB | 81/109 kB | 57/276 kBProgress (4): 164 kB | 81/105 kB | 81/109 kB | 61/276 kBProgress (4): 164 kB | 81/105 kB | 81/109 kB | 65/276 kBProgress (4): 164 kB | 85/105 kB | 81/109 kB | 65/276 kBProgress (4): 164 kB | 85/105 kB | 85/109 kB | 65/276 kBProgress (4): 164 kB | 90/105 kB | 85/109 kB | 65/276 kBProgress (4): 164 kB | 90/105 kB | 90/109 kB | 65/276 kBProgress (4): 164 kB | 94/105 kB | 90/109 kB | 65/276 kBProgress (4): 164 kB | 94/105 kB | 94/109 kB | 65/276 kBProgress (4): 164 kB | 98/105 kB | 94/109 kB | 65/276 kBProgress (4): 164 kB | 98/105 kB | 98/109 kB | 65/276 kBProgress (4): 164 kB | 98/105 kB | 98/109 kB | 69/276 kBProgress (4): 164 kB | 102/105 kB | 98/109 kB | 69/276 kBProgress (4): 164 kB | 102/105 kB | 98/109 kB | 73/276 kBProgress (4): 164 kB | 102/105 kB | 102/109 kB | 73/276 kBProgress (4): 164 kB | 105 kB | 102/109 kB | 73/276 kB    Progress (4): 164 kB | 105 kB | 106/109 kB | 73/276 kBProgress (4): 164 kB | 105 kB | 106/109 kB | 77/276 kBProgress (4): 164 kB | 105 kB | 109 kB | 77/276 kB    Progress (4): 164 kB | 105 kB | 109 kB | 81/276 kBProgress (4): 164 kB | 105 kB | 109 kB | 85/276 kBProgress (4): 164 kB | 105 kB | 109 kB | 90/276 kB                                                  Downloaded from central: https://repo.maven.apache.org/maven2/org/codehaus/plexus/plexus-utils/1.0.4/plexus-utils-1.0.4.jar (164 kB at 1.7 MB/s)
Progress (3): 105 kB | 109 kB | 94/276 kB                                         Downloading from central: https://repo.maven.apache.org/maven2/commons-logging/commons-logging/1.1.1/commons-logging-1.1.1.jar
Progress (3): 105 kB | 109 kB | 98/276 kBProgress (3): 105 kB | 109 kB | 102/276 kBProgress (3): 105 kB | 109 kB | 106/276 kBProgress (3): 105 kB | 109 kB | 110/276 kBProgress (3): 105 kB | 109 kB | 114/276 kBProgress (4): 105 kB | 109 kB | 114/276 kB | 4.1/172 kB                                                       Downloaded from central: https://repo.maven.apache.org/maven2/commons-io/commons-io/1.4/commons-io-1.4.jar (109 kB at 1.1 MB/s)
Progress (3): 105 kB | 114/276 kB | 7.7/172 kB                                              Downloaded from central: https://repo.maven.apache.org/maven2/org/apache/maven/maven-project/2.0/maven-project-2.0.jar (105 kB at 1.0 MB/s)
Progress (2): 118/276 kB | 7.7/172 kBProgress (2): 118/276 kB | 12/172 kB                                     Downloading from central: https://repo.maven.apache.org/maven2/commons-codec/commons-codec/1.3/commons-codec-1.3.jar
Progress (2): 118/276 kB | 16/172 kBProgress (2): 122/276 kB | 16/172 kB                                    Downloading from central: https://repo.maven.apache.org/maven2/org/codehaus/plexus/plexus-archiver/1.2/plexus-archiver-1.2.jar
Progress (2): 126/276 kB | 16/172 kBProgress (2): 131/276 kB | 16/172 kBProgress (2): 131/276 kB | 20/172 kBProgress (2): 131/276 kB | 24/172 kBProgress (2): 131/276 kB | 28/172 kBProgress (3): 131/276 kB | 28/172 kB | 4.1/61 kBProgress (3): 131/276 kB | 32/172 kB | 4.1/61 kBProgress (3): 131/276 kB | 32/172 kB | 7.7/61 kBProgress (3): 135/276 kB | 32/172 kB | 7.7/61 kBProgress (3): 135/276 kB | 32/172 kB | 12/61 kB Progress (3): 139/276 kB | 32/172 kB | 12/61 kBProgress (3): 139/276 kB | 32/172 kB | 16/61 kBProgress (3): 143/276 kB | 32/172 kB | 16/61 kBProgress (3): 143/276 kB | 36/172 kB | 16/61 kBProgress (3): 147/276 kB | 36/172 kB | 16/61 kBProgress (3): 147/276 kB | 40/172 kB | 16/61 kBProgress (3): 147/276 kB | 40/172 kB | 20/61 kBProgress (3): 147/276 kB | 45/172 kB | 20/61 kBProgress (3): 147/276 kB | 45/172 kB | 24/61 kBProgress (3): 147/276 kB | 49/172 kB | 24/61 kBProgress (3): 147/276 kB | 49/172 kB | 28/61 kBProgress (3): 147/276 kB | 49/172 kB | 32/61 kBProgress (3): 151/276 kB | 49/172 kB | 32/61 kBProgress (3): 155/276 kB | 49/172 kB | 32/61 kBProgress (3): 159/276 kB | 49/172 kB | 32/61 kBProgress (3): 159/276 kB | 53/172 kB | 32/61 kBProgress (3): 159/276 kB | 53/172 kB | 36/61 kBProgress (3): 159/276 kB | 57/172 kB | 36/61 kBProgress (3): 163/276 kB | 57/172 kB | 36/61 kBProgress (3): 163/276 kB | 61/172 kB | 36/61 kBProgress (3): 163/276 kB | 61/172 kB | 40/61 kBProgress (3): 163/276 kB | 65/172 kB | 40/61 kBProgress (4): 163/276 kB | 65/172 kB | 40/61 kB | 4.1/47 kBProgress (4): 163/276 kB | 65/172 kB | 45/61 kB | 4.1/47 kBProgress (4): 163/276 kB | 65/172 kB | 45/61 kB | 7.7/47 kBProgress (4): 163/276 kB | 65/172 kB | 49/61 kB | 7.7/47 kBProgress (4): 167/276 kB | 65/172 kB | 49/61 kB | 7.7/47 kBProgress (4): 167/276 kB | 65/172 kB | 49/61 kB | 12/47 kB Progress (5): 167/276 kB | 65/172 kB | 49/61 kB | 12/47 kB | 4.1/182 kBProgress (5): 171/276 kB | 65/172 kB | 49/61 kB | 12/47 kB | 4.1/182 kBProgress (5): 171/276 kB | 69/172 kB | 49/61 kB | 12/47 kB | 4.1/182 kBProgress (5): 176/276 kB | 69/172 kB | 49/61 kB | 12/47 kB | 4.1/182 kBProgress (5): 176/276 kB | 69/172 kB | 53/61 kB | 12/47 kB | 4.1/182 kBProgress (5): 176/276 kB | 69/172 kB | 53/61 kB | 12/47 kB | 7.7/182 kBProgress (5): 176/276 kB | 69/172 kB | 53/61 kB | 16/47 kB | 7.7/182 kBProgress (5): 176/276 kB | 69/172 kB | 53/61 kB | 16/47 kB | 12/182 kB Progress (5): 176/276 kB | 69/172 kB | 57/61 kB | 16/47 kB | 12/182 kBProgress (5): 180/276 kB | 69/172 kB | 57/61 kB | 16/47 kB | 12/182 kBProgress (5): 180/276 kB | 73/172 kB | 57/61 kB | 16/47 kB | 12/182 kBProgress (5): 180/276 kB | 73/172 kB | 57/61 kB | 20/47 kB | 12/182 kBProgress (5): 180/276 kB | 73/172 kB | 61 kB | 20/47 kB | 12/182 kB   Progress (5): 180/276 kB | 73/172 kB | 61 kB | 20/47 kB | 16/182 kBProgress (5): 180/276 kB | 73/172 kB | 61 kB | 24/47 kB | 16/182 kBProgress (5): 180/276 kB | 77/172 kB | 61 kB | 24/47 kB | 16/182 kBProgress (5): 180/276 kB | 77/172 kB | 61 kB | 28/47 kB | 16/182 kBProgress (5): 180/276 kB | 77/172 kB | 61 kB | 28/47 kB | 20/182 kBProgress (5): 184/276 kB | 77/172 kB | 61 kB | 28/47 kB | 20/182 kBProgress (5): 184/276 kB | 77/172 kB | 61 kB | 28/47 kB | 24/182 kBProgress (5): 184/276 kB | 77/172 kB | 61 kB | 32/47 kB | 24/182 kBProgress (5): 184/276 kB | 81/172 kB | 61 kB | 32/47 kB | 24/182 kBProgress (5): 184/276 kB | 81/172 kB | 61 kB | 32/47 kB | 28/182 kBProgress (5): 188/276 kB | 81/172 kB | 61 kB | 32/47 kB | 28/182 kBProgress (5): 188/276 kB | 81/172 kB | 61 kB | 36/47 kB | 28/182 kBProgress (5): 188/276 kB | 81/172 kB | 61 kB | 36/47 kB | 32/182 kBProgress (5): 188/276 kB | 81/172 kB | 61 kB | 40/47 kB | 32/182 kBProgress (5): 192/276 kB | 81/172 kB | 61 kB | 40/47 kB | 32/182 kBProgress (5): 192/276 kB | 81/172 kB | 61 kB | 45/47 kB | 32/182 kBProgress (5): 192/276 kB | 85/172 kB | 61 kB | 45/47 kB | 32/182 kBProgress (5): 192/276 kB | 85/172 kB | 61 kB | 45/47 kB | 36/182 kBProgress (5): 192/276 kB | 85/172 kB | 61 kB | 47 kB | 36/182 kB   Progress (5): 196/276 kB | 85/172 kB | 61 kB | 47 kB | 36/182 kBProgress (5): 196/276 kB | 85/172 kB | 61 kB | 47 kB | 40/182 kBProgress (5): 196/276 kB | 90/172 kB | 61 kB | 47 kB | 40/182 kBProgress (5): 196/276 kB | 90/172 kB | 61 kB | 47 kB | 45/182 kBProgress (5): 196/276 kB | 94/172 kB | 61 kB | 47 kB | 45/182 kBProgress (5): 196/276 kB | 94/172 kB | 61 kB | 47 kB | 49/182 kBProgress (5): 200/276 kB | 94/172 kB | 61 kB | 47 kB | 49/182 kBProgress (5): 200/276 kB | 98/172 kB | 61 kB | 47 kB | 49/182 kBProgress (5): 204/276 kB | 98/172 kB | 61 kB | 47 kB | 49/182 kB                                                                Downloaded from central: https://repo.maven.apache.org/maven2/commons-logging/commons-logging/1.1.1/commons-logging-1.1.1.jar (61 kB at 506 kB/s)
Downloading from central: https://repo.maven.apache.org/maven2/org/codehaus/plexus/plexus-io/1.0.1/plexus-io-1.0.1.jar
Progress (4): 204/276 kB | 98/172 kB | 47 kB | 53/182 kBProgress (4): 208/276 kB | 98/172 kB | 47 kB | 53/182 kBProgress (4): 208/276 kB | 98/172 kB | 47 kB | 57/182 kBProgress (4): 208/276 kB | 102/172 kB | 47 kB | 57/182 kBProgress (4): 208/276 kB | 102/172 kB | 47 kB | 61/182 kBProgress (4): 212/276 kB | 102/172 kB | 47 kB | 61/182 kBProgress (4): 212/276 kB | 102/172 kB | 47 kB | 65/182 kBProgress (4): 212/276 kB | 106/172 kB | 47 kB | 65/182 kBProgress (4): 212/276 kB | 110/172 kB | 47 kB | 65/182 kBProgress (4): 217/276 kB | 110/172 kB | 47 kB | 65/182 kBProgress (4): 217/276 kB | 110/172 kB | 47 kB | 69/182 kBProgress (4): 217/276 kB | 114/172 kB | 47 kB | 69/182 kBProgress (4): 217/276 kB | 114/172 kB | 47 kB | 73/182 kBProgress (4): 221/276 kB | 114/172 kB | 47 kB | 73/182 kBProgress (4): 221/276 kB | 114/172 kB | 47 kB | 77/182 kBProgress (4): 225/276 kB | 114/172 kB | 47 kB | 77/182 kBProgress (4): 225/276 kB | 114/172 kB | 47 kB | 81/182 kB                                                         Downloaded from central: https://repo.maven.apache.org/maven2/commons-codec/commons-codec/1.3/commons-codec-1.3.jar (47 kB at 380 kB/s)
Progress (3): 229/276 kB | 114/172 kB | 81/182 kBProgress (3): 229/276 kB | 118/172 kB | 81/182 kBProgress (3): 229/276 kB | 118/172 kB | 85/182 kBProgress (3): 229/276 kB | 122/172 kB | 85/182 kBProgress (3): 229/276 kB | 122/172 kB | 90/182 kBProgress (3): 233/276 kB | 122/172 kB | 90/182 kBProgress (3): 233/276 kB | 126/172 kB | 90/182 kBProgress (3): 237/276 kB | 126/172 kB | 90/182 kBProgress (3): 237/276 kB | 126/172 kB | 94/182 kBProgress (3): 241/276 kB | 126/172 kB | 94/182 kBProgress (3): 241/276 kB | 131/172 kB | 94/182 kBProgress (3): 245/276 kB | 131/172 kB | 94/182 kBProgress (3): 245/276 kB | 131/172 kB | 98/182 kBProgress (3): 249/276 kB | 131/172 kB | 98/182 kBProgress (3): 253/276 kB | 131/172 kB | 98/182 kBProgress (3): 253/276 kB | 131/172 kB | 102/182 kBProgress (3): 253/276 kB | 135/172 kB | 102/182 kBProgress (3): 258/276 kB | 135/172 kB | 102/182 kBProgress (4): 258/276 kB | 135/172 kB | 102/182 kB | 4.1/51 kBProgress (4): 258/276 kB | 139/172 kB | 102/182 kB | 4.1/51 kBProgress (4): 258/276 kB | 139/172 kB | 106/182 kB | 4.1/51 kBProgress (4): 258/276 kB | 143/172 kB | 106/182 kB | 4.1/51 kBProgress (4): 258/276 kB | 143/172 kB | 106/182 kB | 8.2/51 kBProgress (4): 262/276 kB | 143/172 kB | 106/182 kB | 8.2/51 kBProgress (4): 262/276 kB | 143/172 kB | 106/182 kB | 12/51 kB Progress (4): 262/276 kB | 147/172 kB | 106/182 kB | 12/51 kBProgress (4): 262/276 kB | 147/172 kB | 110/182 kB | 12/51 kBProgress (4): 266/276 kB | 147/172 kB | 110/182 kB | 12/51 kBProgress (4): 266/276 kB | 147/172 kB | 110/182 kB | 16/51 kBProgress (4): 270/276 kB | 147/172 kB | 110/182 kB | 16/51 kBProgress (4): 270/276 kB | 147/172 kB | 114/182 kB | 16/51 kBProgress (4): 274/276 kB | 147/172 kB | 114/182 kB | 16/51 kBProgress (4): 274/276 kB | 151/172 kB | 114/182 kB | 16/51 kBProgress (4): 274/276 kB | 151/172 kB | 114/182 kB | 20/51 kBProgress (4): 276 kB | 151/172 kB | 114/182 kB | 20/51 kB    Progress (4): 276 kB | 151/172 kB | 118/182 kB | 20/51 kBProgress (4): 276 kB | 151/172 kB | 118/182 kB | 25/51 kBProgress (4): 276 kB | 155/172 kB | 118/182 kB | 25/51 kBProgress (4): 276 kB | 155/172 kB | 118/182 kB | 29/51 kBProgress (4): 276 kB | 155/172 kB | 122/182 kB | 29/51 kBProgress (4): 276 kB | 155/172 kB | 122/182 kB | 33/51 kBProgress (4): 276 kB | 159/172 kB | 122/182 kB | 33/51 kBProgress (4): 276 kB | 159/172 kB | 126/182 kB | 33/51 kBProgress (4): 276 kB | 163/172 kB | 126/182 kB | 33/51 kBProgress (4): 276 kB | 163/172 kB | 126/182 kB | 37/51 kBProgress (4): 276 kB | 163/172 kB | 131/182 kB | 37/51 kBProgress (4): 276 kB | 163/172 kB | 131/182 kB | 41/51 kBProgress (4): 276 kB | 163/172 kB | 131/182 kB | 45/51 kBProgress (4): 276 kB | 167/172 kB | 131/182 kB | 45/51 kBProgress (4): 276 kB | 167/172 kB | 131/182 kB | 49/51 kBProgress (4): 276 kB | 171/172 kB | 131/182 kB | 49/51 kBProgress (4): 276 kB | 171/172 kB | 135/182 kB | 49/51 kBProgress (4): 276 kB | 172 kB | 135/182 kB | 49/51 kB    Progress (4): 276 kB | 172 kB | 135/182 kB | 51 kB   Progress (4): 276 kB | 172 kB | 139/182 kB | 51 kBProgress (4): 276 kB | 172 kB | 143/182 kB | 51 kBProgress (4): 276 kB | 172 kB | 147/182 kB | 51 kBProgress (4): 276 kB | 172 kB | 151/182 kB | 51 kBProgress (4): 276 kB | 172 kB | 155/182 kB | 51 kBProgress (4): 276 kB | 172 kB | 159/182 kB | 51 kBProgress (4): 276 kB | 172 kB | 163/182 kB | 51 kB                                                  Downloaded from central: https://repo.maven.apache.org/maven2/org/apache/httpcomponents/httpclient/4.0-beta2/httpclient-4.0-beta2.jar (276 kB at 2.0 MB/s)
Progress (3): 172 kB | 167/182 kB | 51 kBProgress (3): 172 kB | 171/182 kB | 51 kBProgress (3): 172 kB | 176/182 kB | 51 kBProgress (3): 172 kB | 180/182 kB | 51 kBProgress (3): 172 kB | 182 kB | 51 kB                                         Downloaded from central: https://repo.maven.apache.org/maven2/org/codehaus/plexus/plexus-io/1.0.1/plexus-io-1.0.1.jar (51 kB at 366 kB/s)
Downloaded from central: https://repo.maven.apache.org/maven2/org/apache/httpcomponents/httpcore/4.0-beta3/httpcore-4.0-beta3.jar (172 kB at 1.2 MB/s)
Downloaded from central: https://repo.maven.apache.org/maven2/org/codehaus/plexus/plexus-archiver/1.2/plexus-archiver-1.2.jar (182 kB at 1.3 MB/s)
Downloading: https://www.ecma-international.org/publications/files/ECMA-ST//Office%20Open%20XML%201st%20edition%20Part%204%20(PDF).zip
org.apache.maven.wagon.ResourceDoesNotExistException: Resource missing at https://www.ecma-international.org/publications/files/ECMA-ST/Office%2520Open%2520XML%25201st%2520edition%2520Part%25204%2520(PDF).zip 404 Not Found
        at org.apache.maven.wagon.providers.http.wagon.shared.AbstractHttpClientWagon.fillInputData(AbstractHttpClientWagon.java:1185)
        at org.apache.maven.wagon.providers.http.wagon.shared.AbstractHttpClientWagon.fillInputData(AbstractHttpClientWagon.java:1138)
        at org.apache.maven.wagon.StreamWagon.getInputStream(StreamWagon.java:126)
        at org.apache.maven.wagon.StreamWagon.getIfNewer(StreamWagon.java:88)
        at org.apache.maven.wagon.StreamWagon.get(StreamWagon.java:61)
        at com.googlecode.WGet.doGet(WGet.java:218)
        at com.googlecode.WGet.execute(WGet.java:173)
        at org.apache.maven.plugin.DefaultBuildPluginManager.executeMojo(DefaultBuildPluginManager.java:137)
        at org.apache.maven.lifecycle.internal.MojoExecutor.execute(MojoExecutor.java:210)
        at org.apache.maven.lifecycle.internal.MojoExecutor.execute(MojoExecutor.java:156)
        at org.apache.maven.lifecycle.internal.MojoExecutor.execute(MojoExecutor.java:148)
        at org.apache.maven.lifecycle.internal.LifecycleModuleBuilder.buildProject(LifecycleModuleBuilder.java:117)
        at org.apache.maven.lifecycle.internal.LifecycleModuleBuilder.buildProject(LifecycleModuleBuilder.java:81)
        at org.apache.maven.lifecycle.internal.builder.singlethreaded.SingleThreadedBuilder.build(SingleThreadedBuilder.java:56)
        at org.apache.maven.lifecycle.internal.LifecycleStarter.execute(LifecycleStarter.java:128)
        at org.apache.maven.DefaultMaven.doExecute(DefaultMaven.java:305)
        at org.apache.maven.DefaultMaven.doExecute(DefaultMaven.java:192)
        at org.apache.maven.DefaultMaven.execute(DefaultMaven.java:105)
        at org.apache.maven.cli.MavenCli.execute(MavenCli.java:957)
        at org.apache.maven.cli.MavenCli.doMain(MavenCli.java:289)
        at org.apache.maven.cli.MavenCli.main(MavenCli.java:193)
        at sun.reflect.NativeMethodAccessorImpl.invoke0(Native Method)
        at sun.reflect.NativeMethodAccessorImpl.invoke(NativeMethodAccessorImpl.java:62)
        at sun.reflect.DelegatingMethodAccessorImpl.invoke(DelegatingMethodAccessorImpl.java:43)
        at java.lang.reflect.Method.invoke(Method.java:498)
        at org.codehaus.plexus.classworlds.launcher.Launcher.launchEnhanced(Launcher.java:282)
        at org.codehaus.plexus.classworlds.launcher.Launcher.launch(Launcher.java:225)
        at org.codehaus.plexus.classworlds.launcher.Launcher.mainWithExitCode(Launcher.java:406)
        at org.codehaus.plexus.classworlds.launcher.Launcher.main(Launcher.java:347)
[WARNING] Could not get content
org.apache.maven.wagon.ResourceDoesNotExistException: Resource missing at https://www.ecma-international.org/publications/files/ECMA-ST/Office%2520Open%2520XML%25201st%2520edition%2520Part%25204%2520(PDF).zip 404 Not Found
    at org.apache.maven.wagon.providers.http.wagon.shared.AbstractHttpClientWagon.fillInputData (AbstractHttpClientWagon.java:1185)
    at org.apache.maven.wagon.providers.http.wagon.shared.AbstractHttpClientWagon.fillInputData (AbstractHttpClientWagon.java:1138)
    at org.apache.maven.wagon.StreamWagon.getInputStream (StreamWagon.java:126)
    at org.apache.maven.wagon.StreamWagon.getIfNewer (StreamWagon.java:88)
    at org.apache.maven.wagon.StreamWagon.get (StreamWagon.java:61)
    at com.googlecode.WGet.doGet (WGet.java:218)
    at com.googlecode.WGet.execute (WGet.java:173)
    at org.apache.maven.plugin.DefaultBuildPluginManager.executeMojo (DefaultBuildPluginManager.java:137)
    at org.apache.maven.lifecycle.internal.MojoExecutor.execute (MojoExecutor.java:210)
    at org.apache.maven.lifecycle.internal.MojoExecutor.execute (MojoExecutor.java:156)
    at org.apache.maven.lifecycle.internal.MojoExecutor.execute (MojoExecutor.java:148)
    at org.apache.maven.lifecycle.internal.LifecycleModuleBuilder.buildProject (LifecycleModuleBuilder.java:117)
    at org.apache.maven.lifecycle.internal.LifecycleModuleBuilder.buildProject (LifecycleModuleBuilder.java:81)
    at org.apache.maven.lifecycle.internal.builder.singlethreaded.SingleThreadedBuilder.build (SingleThreadedBuilder.java:56)
    at org.apache.maven.lifecycle.internal.LifecycleStarter.execute (LifecycleStarter.java:128)
    at org.apache.maven.DefaultMaven.doExecute (DefaultMaven.java:305)
    at org.apache.maven.DefaultMaven.doExecute (DefaultMaven.java:192)
    at org.apache.maven.DefaultMaven.execute (DefaultMaven.java:105)
    at org.apache.maven.cli.MavenCli.execute (MavenCli.java:957)
    at org.apache.maven.cli.MavenCli.doMain (MavenCli.java:289)
    at org.apache.maven.cli.MavenCli.main (MavenCli.java:193)
    at sun.reflect.NativeMethodAccessorImpl.invoke0 (Native Method)
    at sun.reflect.NativeMethodAccessorImpl.invoke (NativeMethodAccessorImpl.java:62)
    at sun.reflect.DelegatingMethodAccessorImpl.invoke (DelegatingMethodAccessorImpl.java:43)
    at java.lang.reflect.Method.invoke (Method.java:498)
    at org.codehaus.plexus.classworlds.launcher.Launcher.launchEnhanced (Launcher.java:282)
    at org.codehaus.plexus.classworlds.launcher.Launcher.launch (Launcher.java:225)
    at org.codehaus.plexus.classworlds.launcher.Launcher.mainWithExitCode (Launcher.java:406)
    at org.codehaus.plexus.classworlds.launcher.Launcher.main (Launcher.java:347)
[WARNING] Retrying (1 more)
Downloading: https://www.ecma-international.org/publications/files/ECMA-ST//Office%20Open%20XML%201st%20edition%20Part%204%20(PDF).zip
org.apache.maven.wagon.ResourceDoesNotExistException: Resource missing at https://www.ecma-international.org/publications/files/ECMA-ST/Office%2520Open%2520XML%25201st%2520edition%2520Part%25204%2520(PDF).zip 404 Not Found
        at org.apache.maven.wagon.providers.http.wagon.shared.AbstractHttpClientWagon.fillInputData(AbstractHttpClientWagon.java:1185)
        at org.apache.maven.wagon.providers.http.wagon.shared.AbstractHttpClientWagon.fillInputData(AbstractHttpClientWagon.java:1138)
        at org.apache.maven.wagon.StreamWagon.getInputStream(StreamWagon.java:126)
        at org.apache.maven.wagon.StreamWagon.getIfNewer(StreamWagon.java:88)
        at org.apache.maven.wagon.StreamWagon.get(StreamWagon.java:61)
        at com.googlecode.WGet.doGet(WGet.java:218)
        at com.googlecode.WGet.execute(WGet.java:173)
        at org.apache.maven.plugin.DefaultBuildPluginManager.executeMojo(DefaultBuildPluginManager.java:137)
        at org.apache.maven.lifecycle.internal.MojoExecutor.execute(MojoExecutor.java:210)
        at org.apache.maven.lifecycle.internal.MojoExecutor.execute(MojoExecutor.java:156)
        at org.apache.maven.lifecycle.internal.MojoExecutor.execute(MojoExecutor.java:148)
        at org.apache.maven.lifecycle.internal.LifecycleModuleBuilder.buildProject(LifecycleModuleBuilder.java:117)
        at org.apache.maven.lifecycle.internal.LifecycleModuleBuilder.buildProject(LifecycleModuleBuilder.java:81)
        at org.apache.maven.lifecycle.internal.builder.singlethreaded.SingleThreadedBuilder.build(SingleThreadedBuilder.java:56)
        at org.apache.maven.lifecycle.internal.LifecycleStarter.execute(LifecycleStarter.java:128)
        at org.apache.maven.DefaultMaven.doExecute(DefaultMaven.java:305)
        at org.apache.maven.DefaultMaven.doExecute(DefaultMaven.java:192)
        at org.apache.maven.DefaultMaven.execute(DefaultMaven.java:105)
        at org.apache.maven.cli.MavenCli.execute(MavenCli.java:957)
        at org.apache.maven.cli.MavenCli.doMain(MavenCli.java:289)
        at org.apache.maven.cli.MavenCli.main(MavenCli.java:193)
        at sun.reflect.NativeMethodAccessorImpl.invoke0(Native Method)
        at sun.reflect.NativeMethodAccessorImpl.invoke(NativeMethodAccessorImpl.java:62)
        at sun.reflect.DelegatingMethodAccessorImpl.invoke(DelegatingMethodAccessorImpl.java:43)
        at java.lang.reflect.Method.invoke(Method.java:498)
        at org.codehaus.plexus.classworlds.launcher.Launcher.launchEnhanced(Launcher.java:282)
        at org.codehaus.plexus.classworlds.launcher.Launcher.launch(Launcher.java:225)
        at org.codehaus.plexus.classworlds.launcher.Launcher.mainWithExitCode(Launcher.java:406)
        at org.codehaus.plexus.classworlds.launcher.Launcher.main(Launcher.java:347)
[WARNING] Could not get content
org.apache.maven.wagon.ResourceDoesNotExistException: Resource missing at https://www.ecma-international.org/publications/files/ECMA-ST/Office%2520Open%2520XML%25201st%2520edition%2520Part%25204%2520(PDF).zip 404 Not Found
    at org.apache.maven.wagon.providers.http.wagon.shared.AbstractHttpClientWagon.fillInputData (AbstractHttpClientWagon.java:1185)
    at org.apache.maven.wagon.providers.http.wagon.shared.AbstractHttpClientWagon.fillInputData (AbstractHttpClientWagon.java:1138)
    at org.apache.maven.wagon.StreamWagon.getInputStream (StreamWagon.java:126)
    at org.apache.maven.wagon.StreamWagon.getIfNewer (StreamWagon.java:88)
    at org.apache.maven.wagon.StreamWagon.get (StreamWagon.java:61)
    at com.googlecode.WGet.doGet (WGet.java:218)
    at com.googlecode.WGet.execute (WGet.java:173)
    at org.apache.maven.plugin.DefaultBuildPluginManager.executeMojo (DefaultBuildPluginManager.java:137)
    at org.apache.maven.lifecycle.internal.MojoExecutor.execute (MojoExecutor.java:210)
    at org.apache.maven.lifecycle.internal.MojoExecutor.execute (MojoExecutor.java:156)
    at org.apache.maven.lifecycle.internal.MojoExecutor.execute (MojoExecutor.java:148)
    at org.apache.maven.lifecycle.internal.LifecycleModuleBuilder.buildProject (LifecycleModuleBuilder.java:117)
    at org.apache.maven.lifecycle.internal.LifecycleModuleBuilder.buildProject (LifecycleModuleBuilder.java:81)
    at org.apache.maven.lifecycle.internal.builder.singlethreaded.SingleThreadedBuilder.build (SingleThreadedBuilder.java:56)
    at org.apache.maven.lifecycle.internal.LifecycleStarter.execute (LifecycleStarter.java:128)
    at org.apache.maven.DefaultMaven.doExecute (DefaultMaven.java:305)
    at org.apache.maven.DefaultMaven.doExecute (DefaultMaven.java:192)
    at org.apache.maven.DefaultMaven.execute (DefaultMaven.java:105)
    at org.apache.maven.cli.MavenCli.execute (MavenCli.java:957)
    at org.apache.maven.cli.MavenCli.doMain (MavenCli.java:289)
    at org.apache.maven.cli.MavenCli.main (MavenCli.java:193)
    at sun.reflect.NativeMethodAccessorImpl.invoke0 (Native Method)
    at sun.reflect.NativeMethodAccessorImpl.invoke (NativeMethodAccessorImpl.java:62)
    at sun.reflect.DelegatingMethodAccessorImpl.invoke (DelegatingMethodAccessorImpl.java:43)
    at java.lang.reflect.Method.invoke (Method.java:498)
    at org.codehaus.plexus.classworlds.launcher.Launcher.launchEnhanced (Launcher.java:282)
    at org.codehaus.plexus.classworlds.launcher.Launcher.launch (Launcher.java:225)
    at org.codehaus.plexus.classworlds.launcher.Launcher.mainWithExitCode (Launcher.java:406)
    at org.codehaus.plexus.classworlds.launcher.Launcher.main (Launcher.java:347)
[INFO] ------------------------------------------------------------------------
[INFO] Reactor Summary for Apache POI - the Java API for Microsoft Documents 4.1.3-SNAPSHOT:
[INFO]
[INFO] Apache POI - the Java API for Microsoft Documents .. SUCCESS [  7.838 s]
[INFO] Apache POI Main package ............................ SUCCESS [02:31 min]
[INFO] Apache POI Scratchpad package ...................... SUCCESS [ 30.777 s]
[INFO] Apache POI - Openxmlformats Schema package ......... FAILURE [  5.842 s]
[INFO] Apache POI - Openxmlformats Encryption Schema package SKIPPED
[INFO] Apache POI - Openxmlformats Security-Schema package  SKIPPED
[INFO] Apache POI OOXML package ........................... SKIPPED
[INFO] Apache POI ExcelAnt package ........................ SKIPPED
[INFO] Apache POI Examples package ........................ SKIPPED
[INFO] Apache POI integration test ........................ SKIPPED
[INFO] ------------------------------------------------------------------------
[INFO] BUILD FAILURE
[INFO] ------------------------------------------------------------------------
[INFO] Total time:  03:16 min
[INFO] Finished at: 2020-02-10T20:08:40Z
[INFO] ------------------------------------------------------------------------
[ERROR] Failed to execute goal com.googlecode.maven-download-plugin:maven-download-plugin:1.1.0:wget (download-xsds) on project poi-ooxml-schema: IO Error: Could not get content -> [Help 1]
[ERROR]
[ERROR] To see the full stack trace of the errors, re-run Maven with the -e switch.
[ERROR] Re-run Maven using the -X switch to enable full debug logging.
[ERROR]
[ERROR] For more information about the errors and possible solutions, please read the following articles:
[ERROR] [Help 1] http://cwiki.apache.org/confluence/display/MAVEN/MojoExecutionException
[ERROR]
[ERROR] After correcting the problems, you can resume the build with the command
[ERROR]   mvn <args> -rf :poi-ooxml-schema
Build step 'Invoke top-level Maven targets' marked build as failure
Recording test results

---------------------------------------------------------------------
To unsubscribe, e-mail: [hidden email]
For additional commands, e-mail: [hidden email]

Reply | Threaded
Open this post in threaded view
|

Build failed in Jenkins: POI-DSL-Maven #1041

Apache Jenkins Server
See <https://builds.apache.org/job/POI-DSL-Maven/1041/display/redirect?page=changes>

Changes:

[kiwiwings] update references to 4.1.2


------------------------------------------
[...truncated 1.70 MB...]
Progress (1): 1.4 kB                    Downloaded from central: https://repo.maven.apache.org/maven2/org/apache/maven/maven-profile/2.0/maven-profile-2.0.pom (1.4 kB at 114 kB/s)
Downloading from central: https://repo.maven.apache.org/maven2/org/apache/maven/maven-artifact/2.0/maven-artifact-2.0.pom
Progress (1): 723 B                   Downloaded from central: https://repo.maven.apache.org/maven2/org/apache/maven/maven-artifact/2.0/maven-artifact-2.0.pom (723 B at 66 kB/s)
Downloading from central: https://repo.maven.apache.org/maven2/org/apache/maven/maven-repository-metadata/2.0/maven-repository-metadata-2.0.pom
Progress (1): 1.2 kB                    Downloaded from central: https://repo.maven.apache.org/maven2/org/apache/maven/maven-repository-metadata/2.0/maven-repository-metadata-2.0.pom (1.2 kB at 112 kB/s)
Downloading from central: https://repo.maven.apache.org/maven2/org/apache/maven/maven-error-diagnostics/2.0/maven-error-diagnostics-2.0.pom
Progress (1): 812 B                   Downloaded from central: https://repo.maven.apache.org/maven2/org/apache/maven/maven-error-diagnostics/2.0/maven-error-diagnostics-2.0.pom (812 B at 62 kB/s)
Downloading from central: https://repo.maven.apache.org/maven2/org/apache/maven/maven-project/2.0/maven-project-2.0.pom
Progress (1): 1.6 kB                    Downloaded from central: https://repo.maven.apache.org/maven2/org/apache/maven/maven-project/2.0/maven-project-2.0.pom (1.6 kB at 149 kB/s)
Downloading from central: https://repo.maven.apache.org/maven2/org/apache/maven/maven-artifact-manager/2.0/maven-artifact-manager-2.0.pom
Progress (1): 1.3 kB                    Downloaded from central: https://repo.maven.apache.org/maven2/org/apache/maven/maven-artifact-manager/2.0/maven-artifact-manager-2.0.pom (1.3 kB at 112 kB/s)
Downloading from central: https://repo.maven.apache.org/maven2/org/apache/maven/maven-plugin-registry/2.0/maven-plugin-registry-2.0.pom
Progress (1): 1.3 kB                    Downloaded from central: https://repo.maven.apache.org/maven2/org/apache/maven/maven-plugin-registry/2.0/maven-plugin-registry-2.0.pom (1.3 kB at 117 kB/s)
Downloading from central: https://repo.maven.apache.org/maven2/org/apache/maven/maven-plugin-api/2.0/maven-plugin-api-2.0.pom
Progress (1): 601 B                   Downloaded from central: https://repo.maven.apache.org/maven2/org/apache/maven/maven-plugin-api/2.0/maven-plugin-api-2.0.pom (601 B at 50 kB/s)
Downloading from central: https://repo.maven.apache.org/maven2/org/apache/maven/maven-plugin-descriptor/2.0/maven-plugin-descriptor-2.0.pom
Progress (1): 1.5 kB                    Downloaded from central: https://repo.maven.apache.org/maven2/org/apache/maven/maven-plugin-descriptor/2.0/maven-plugin-descriptor-2.0.pom (1.5 kB at 122 kB/s)
Downloading from central: https://repo.maven.apache.org/maven2/org/apache/maven/maven-monitor/2.0/maven-monitor-2.0.pom
Progress (1): 400 B                   Downloaded from central: https://repo.maven.apache.org/maven2/org/apache/maven/maven-monitor/2.0/maven-monitor-2.0.pom (400 B at 36 kB/s)
Downloading from central: https://repo.maven.apache.org/maven2/commons-io/commons-io/1.4/commons-io-1.4.pom
Progress (1): 2.2/13 kBProgress (1): 5.0/13 kBProgress (1): 7.8/13 kBProgress (1): 11/13 kB Progress (1): 13 kB                      Downloaded from central: https://repo.maven.apache.org/maven2/commons-io/commons-io/1.4/commons-io-1.4.pom (13 kB at 1.1 MB/s)
Downloading from central: https://repo.maven.apache.org/maven2/org/apache/commons/commons-parent/7/commons-parent-7.pom
Progress (1): 2.2/17 kBProgress (1): 5.0/17 kBProgress (1): 7.8/17 kBProgress (1): 11/17 kB Progress (1): 13/17 kBProgress (1): 16/17 kBProgress (1): 17 kB                      Downloaded from central: https://repo.maven.apache.org/maven2/org/apache/commons/commons-parent/7/commons-parent-7.pom (17 kB at 1.5 MB/s)
Downloading from central: https://repo.maven.apache.org/maven2/org/apache/httpcomponents/httpclient/4.0-beta2/httpclient-4.0-beta2.pom
Progress (1): 2.2/5.1 kBProgress (1): 5.0/5.1 kBProgress (1): 5.1 kB                        Downloaded from central: https://repo.maven.apache.org/maven2/org/apache/httpcomponents/httpclient/4.0-beta2/httpclient-4.0-beta2.pom (5.1 kB at 389 kB/s)
Downloading from central: https://repo.maven.apache.org/maven2/org/apache/httpcomponents/httpcomponents-client/4.0-beta2/httpcomponents-client-4.0-beta2.pom
Progress (1): 2.2/7.9 kBProgress (1): 5.0/7.9 kBProgress (1): 7.8/7.9 kBProgress (1): 7.9 kB                        Downloaded from central: https://repo.maven.apache.org/maven2/org/apache/httpcomponents/httpcomponents-client/4.0-beta2/httpcomponents-client-4.0-beta2.pom (7.9 kB at 606 kB/s)
Downloading from central: https://repo.maven.apache.org/maven2/org/apache/httpcomponents/project/4.0/project-4.0.pom
Progress (1): 2.2/13 kBProgress (1): 5.0/13 kBProgress (1): 7.8/13 kBProgress (1): 11/13 kB Progress (1): 13 kB                      Downloaded from central: https://repo.maven.apache.org/maven2/org/apache/httpcomponents/project/4.0/project-4.0.pom (13 kB at 1.0 MB/s)
Downloading from central: https://repo.maven.apache.org/maven2/org/apache/httpcomponents/httpcore/4.0-beta3/httpcore-4.0-beta3.pom
Progress (1): 2.2/4.7 kBProgress (1): 4.7 kB                        Downloaded from central: https://repo.maven.apache.org/maven2/org/apache/httpcomponents/httpcore/4.0-beta3/httpcore-4.0-beta3.pom (4.7 kB at 394 kB/s)
Downloading from central: https://repo.maven.apache.org/maven2/org/apache/httpcomponents/httpcomponents-core/4.0-beta3/httpcomponents-core-4.0-beta3.pom
Progress (1): 2.2/6.9 kBProgress (1): 5.0/6.9 kBProgress (1): 6.9 kB                        Downloaded from central: https://repo.maven.apache.org/maven2/org/apache/httpcomponents/httpcomponents-core/4.0-beta3/httpcomponents-core-4.0-beta3.pom (6.9 kB at 533 kB/s)
Downloading from central: https://repo.maven.apache.org/maven2/commons-logging/commons-logging/1.1.1/commons-logging-1.1.1.pom
Progress (1): 2.2/18 kBProgress (1): 5.0/18 kBProgress (1): 7.8/18 kBProgress (1): 11/18 kB Progress (1): 13/18 kBProgress (1): 16/18 kBProgress (1): 18 kB                      Downloaded from central: https://repo.maven.apache.org/maven2/commons-logging/commons-logging/1.1.1/commons-logging-1.1.1.pom (18 kB at 1.3 MB/s)
Downloading from central: https://repo.maven.apache.org/maven2/org/apache/commons/commons-parent/5/commons-parent-5.pom
Progress (1): 2.2/16 kBProgress (1): 5.0/16 kBProgress (1): 7.8/16 kBProgress (1): 11/16 kB Progress (1): 13/16 kBProgress (1): 16/16 kBProgress (1): 16 kB                      Downloaded from central: https://repo.maven.apache.org/maven2/org/apache/commons/commons-parent/5/commons-parent-5.pom (16 kB at 1.2 MB/s)
Downloading from central: https://repo.maven.apache.org/maven2/commons-codec/commons-codec/1.3/commons-codec-1.3.pom
Progress (1): 2.2/6.1 kBProgress (1): 5.0/6.1 kBProgress (1): 6.1 kB                        Downloaded from central: https://repo.maven.apache.org/maven2/commons-codec/commons-codec/1.3/commons-codec-1.3.pom (6.1 kB at 509 kB/s)
Downloading from central: https://repo.maven.apache.org/maven2/org/codehaus/plexus/plexus-archiver/1.2/plexus-archiver-1.2.pom
Progress (1): 2.0 kB                    Downloaded from central: https://repo.maven.apache.org/maven2/org/codehaus/plexus/plexus-archiver/1.2/plexus-archiver-1.2.pom (2.0 kB at 170 kB/s)
Downloading from central: https://repo.maven.apache.org/maven2/org/codehaus/plexus/plexus-io/1.0.1/plexus-io-1.0.1.pom
Progress (1): 1.2 kB                    Downloaded from central: https://repo.maven.apache.org/maven2/org/codehaus/plexus/plexus-io/1.0.1/plexus-io-1.0.1.pom (1.2 kB at 112 kB/s)
Downloading from central: https://repo.maven.apache.org/maven2/org/apache/maven/maven-core/2.0/maven-core-2.0.jar
Downloading from central: https://repo.maven.apache.org/maven2/org/apache/maven/maven-plugin-parameter-documenter/2.0/maven-plugin-parameter-documenter-2.0.jar
Downloading from central: https://repo.maven.apache.org/maven2/org/apache/maven/maven-settings/2.0/maven-settings-2.0.jar
Downloading from central: https://repo.maven.apache.org/maven2/doxia/doxia-sink-api/1.0-alpha-4/doxia-sink-api-1.0-alpha-4.jar
Downloading from central: https://repo.maven.apache.org/maven2/org/apache/maven/reporting/maven-reporting-api/2.0/maven-reporting-api-2.0.jar
Progress (1): 2.2/4.3 kBProgress (2): 2.2/4.3 kB | 2.2/43 kBProgress (2): 4.3 kB | 2.2/43 kB    Progress (3): 4.3 kB | 2.2/43 kB | 2.2/136 kBProgress (4): 4.3 kB | 2.2/43 kB | 2.2/136 kB | 2.2/18 kBProgress (4): 4.3 kB | 5.0/43 kB | 2.2/136 kB | 2.2/18 kBProgress (4): 4.3 kB | 5.0/43 kB | 5.0/136 kB | 2.2/18 kBProgress (4): 4.3 kB | 7.7/43 kB | 5.0/136 kB | 2.2/18 kBProgress (4): 4.3 kB | 7.7/43 kB | 5.0/136 kB | 5.0/18 kBProgress (4): 4.3 kB | 10/43 kB | 5.0/136 kB | 5.0/18 kB Progress (4): 4.3 kB | 10/43 kB | 7.7/136 kB | 5.0/18 kBProgress (5): 4.3 kB | 10/43 kB | 7.7/136 kB | 5.0/18 kB | 2.2/6.6 kBProgress (5): 4.3 kB | 10/43 kB | 10/136 kB | 5.0/18 kB | 2.2/6.6 kB Progress (5): 4.3 kB | 13/43 kB | 10/136 kB | 5.0/18 kB | 2.2/6.6 kBProgress (5): 4.3 kB | 13/43 kB | 10/136 kB | 7.7/18 kB | 2.2/6.6 kBProgress (5): 4.3 kB | 16/43 kB | 10/136 kB | 7.7/18 kB | 2.2/6.6 kBProgress (5): 4.3 kB | 16/43 kB | 13/136 kB | 7.7/18 kB | 2.2/6.6 kBProgress (5): 4.3 kB | 16/43 kB | 13/136 kB | 7.7/18 kB | 5.0/6.6 kBProgress (5): 4.3 kB | 19/43 kB | 13/136 kB | 7.7/18 kB | 5.0/6.6 kBProgress (5): 4.3 kB | 19/43 kB | 13/136 kB | 10/18 kB | 5.0/6.6 kB Progress (5): 4.3 kB | 21/43 kB | 13/136 kB | 10/18 kB | 5.0/6.6 kBProgress (5): 4.3 kB | 21/43 kB | 13/136 kB | 10/18 kB | 6.6 kB    Progress (5): 4.3 kB | 21/43 kB | 16/136 kB | 10/18 kB | 6.6 kBProgress (5): 4.3 kB | 24/43 kB | 16/136 kB | 10/18 kB | 6.6 kBProgress (5): 4.3 kB | 24/43 kB | 16/136 kB | 13/18 kB | 6.6 kBProgress (5): 4.3 kB | 27/43 kB | 16/136 kB | 13/18 kB | 6.6 kBProgress (5): 4.3 kB | 27/43 kB | 19/136 kB | 13/18 kB | 6.6 kBProgress (5): 4.3 kB | 30/43 kB | 19/136 kB | 13/18 kB | 6.6 kBProgress (5): 4.3 kB | 30/43 kB | 19/136 kB | 16/18 kB | 6.6 kBProgress (5): 4.3 kB | 30/43 kB | 21/136 kB | 16/18 kB | 6.6 kBProgress (5): 4.3 kB | 30/43 kB | 21/136 kB | 18 kB | 6.6 kB   Progress (5): 4.3 kB | 32/43 kB | 21/136 kB | 18 kB | 6.6 kBProgress (5): 4.3 kB | 32/43 kB | 24/136 kB | 18 kB | 6.6 kB                                                            Downloaded from central: https://repo.maven.apache.org/maven2/doxia/doxia-sink-api/1.0-alpha-4/doxia-sink-api-1.0-alpha-4.jar (4.3 kB at 306 kB/s)
Progress (4): 36/43 kB | 24/136 kB | 18 kB | 6.6 kBProgress (4): 36/43 kB | 27/136 kB | 18 kB | 6.6 kBProgress (4): 40/43 kB | 27/136 kB | 18 kB | 6.6 kB                                                   Downloading from central: https://repo.maven.apache.org/maven2/org/apache/maven/maven-profile/2.0/maven-profile-2.0.jar
Progress (4): 40/43 kB | 30/136 kB | 18 kB | 6.6 kBProgress (4): 43 kB | 30/136 kB | 18 kB | 6.6 kB   Progress (4): 43 kB | 32/136 kB | 18 kB | 6.6 kBProgress (4): 43 kB | 36/136 kB | 18 kB | 6.6 kBProgress (4): 43 kB | 40/136 kB | 18 kB | 6.6 kBProgress (4): 43 kB | 45/136 kB | 18 kB | 6.6 kBProgress (4): 43 kB | 49/136 kB | 18 kB | 6.6 kB                                                Downloaded from central: https://repo.maven.apache.org/maven2/org/apache/maven/reporting/maven-reporting-api/2.0/maven-reporting-api-2.0.jar (6.6 kB at 365 kB/s)
Progress (3): 43 kB | 53/136 kB | 18 kB                                       Downloading from central: https://repo.maven.apache.org/maven2/org/apache/maven/maven-model/2.0/maven-model-2.0.jar
Progress (3): 43 kB | 57/136 kB | 18 kBProgress (3): 43 kB | 61/136 kB | 18 kBProgress (3): 43 kB | 65/136 kB | 18 kB                                       Downloaded from central: https://repo.maven.apache.org/maven2/org/apache/maven/maven-plugin-parameter-documenter/2.0/maven-plugin-parameter-documenter-2.0.jar (18 kB at 881 kB/s)
Downloading from central: https://repo.maven.apache.org/maven2/org/codehaus/plexus/plexus-container-default/1.0-alpha-8/plexus-container-default-1.0-alpha-8.jar
Progress (2): 43 kB | 69/136 kBProgress (2): 43 kB | 73/136 kBProgress (2): 43 kB | 77/136 kBProgress (2): 43 kB | 81/136 kB                               Downloaded from central: https://repo.maven.apache.org/maven2/org/apache/maven/maven-settings/2.0/maven-settings-2.0.jar (43 kB at 2.0 MB/s)
Progress (2): 81/136 kB | 4.1/30 kBProgress (2): 85/136 kB | 4.1/30 kBProgress (2): 85/136 kB | 7.7/30 kBProgress (2): 90/136 kB | 7.7/30 kB                                   Downloading from central: https://repo.maven.apache.org/maven2/org/apache/maven/maven-repository-metadata/2.0/maven-repository-metadata-2.0.jar
Progress (2): 94/136 kB | 7.7/30 kBProgress (2): 94/136 kB | 12/30 kB Progress (2): 98/136 kB | 12/30 kBProgress (2): 98/136 kB | 16/30 kBProgress (2): 102/136 kB | 16/30 kBProgress (2): 102/136 kB | 20/30 kBProgress (2): 106/136 kB | 20/30 kBProgress (2): 106/136 kB | 24/30 kBProgress (2): 110/136 kB | 24/30 kBProgress (2): 110/136 kB | 28/30 kBProgress (2): 114/136 kB | 28/30 kBProgress (2): 114/136 kB | 30 kB   Progress (2): 118/136 kB | 30 kBProgress (3): 118/136 kB | 30 kB | 2.2/78 kBProgress (3): 122/136 kB | 30 kB | 2.2/78 kBProgress (3): 126/136 kB | 30 kB | 2.2/78 kBProgress (3): 126/136 kB | 30 kB | 5.0/78 kBProgress (3): 131/136 kB | 30 kB | 5.0/78 kBProgress (3): 131/136 kB | 30 kB | 7.7/78 kBProgress (3): 135/136 kB | 30 kB | 7.7/78 kBProgress (3): 135/136 kB | 30 kB | 10/78 kB Progress (3): 136 kB | 30 kB | 10/78 kB    Progress (3): 136 kB | 30 kB | 13/78 kBProgress (4): 136 kB | 30 kB | 13/78 kB | 2.2/195 kBProgress (4): 136 kB | 30 kB | 16/78 kB | 2.2/195 kBProgress (4): 136 kB | 30 kB | 16/78 kB | 5.0/195 kBProgress (4): 136 kB | 30 kB | 19/78 kB | 5.0/195 kBProgress (4): 136 kB | 30 kB | 19/78 kB | 7.7/195 kBProgress (4): 136 kB | 30 kB | 21/78 kB | 7.7/195 kBProgress (4): 136 kB | 30 kB | 21/78 kB | 10/195 kB Progress (4): 136 kB | 30 kB | 24/78 kB | 10/195 kBProgress (4): 136 kB | 30 kB | 24/78 kB | 13/195 kBProgress (4): 136 kB | 30 kB | 27/78 kB | 13/195 kBProgress (4): 136 kB | 30 kB | 27/78 kB | 16/195 kBProgress (4): 136 kB | 30 kB | 30/78 kB | 16/195 kBProgress (4): 136 kB | 30 kB | 30/78 kB | 19/195 kBProgress (4): 136 kB | 30 kB | 32/78 kB | 19/195 kBProgress (4): 136 kB | 30 kB | 32/78 kB | 21/195 kBProgress (4): 136 kB | 30 kB | 32/78 kB | 24/195 kBProgress (4): 136 kB | 30 kB | 32/78 kB | 27/195 kBProgress (4): 136 kB | 30 kB | 36/78 kB | 27/195 kBProgress (4): 136 kB | 30 kB | 36/78 kB | 30/195 kBProgress (4): 136 kB | 30 kB | 40/78 kB | 30/195 kBProgress (4): 136 kB | 30 kB | 40/78 kB | 32/195 kBProgress (4): 136 kB | 30 kB | 45/78 kB | 32/195 kB                                                   Downloaded from central: https://repo.maven.apache.org/maven2/org/apache/maven/maven-profile/2.0/maven-profile-2.0.jar (30 kB at 981 kB/s)
Progress (4): 136 kB | 45/78 kB | 32/195 kB | 2.2/21 kBProgress (4): 136 kB | 49/78 kB | 32/195 kB | 2.2/21 kBProgress (4): 136 kB | 49/78 kB | 36/195 kB | 2.2/21 kB                                                       Downloading from central: https://repo.maven.apache.org/maven2/org/apache/maven/maven-error-diagnostics/2.0/maven-error-diagnostics-2.0.jar
Progress (4): 136 kB | 53/78 kB | 36/195 kB | 2.2/21 kBProgress (4): 136 kB | 53/78 kB | 40/195 kB | 2.2/21 kBProgress (4): 136 kB | 53/78 kB | 40/195 kB | 5.0/21 kBProgress (4): 136 kB | 53/78 kB | 45/195 kB | 5.0/21 kBProgress (4): 136 kB | 57/78 kB | 45/195 kB | 5.0/21 kBProgress (4): 136 kB | 57/78 kB | 45/195 kB | 7.7/21 kBProgress (4): 136 kB | 57/78 kB | 49/195 kB | 7.7/21 kB                                                       Downloaded from central: https://repo.maven.apache.org/maven2/org/apache/maven/maven-core/2.0/maven-core-2.0.jar (136 kB at 4.0 MB/s)
Progress (3): 57/78 kB | 49/195 kB | 10/21 kBProgress (3): 57/78 kB | 53/195 kB | 10/21 kBProgress (3): 61/78 kB | 53/195 kB | 10/21 kBProgress (3): 61/78 kB | 57/195 kB | 10/21 kBProgress (3): 61/78 kB | 57/195 kB | 13/21 kB                                             Downloading from central: https://repo.maven.apache.org/maven2/org/apache/maven/maven-plugin-registry/2.0/maven-plugin-registry-2.0.jar
Progress (3): 61/78 kB | 57/195 kB | 16/21 kBProgress (3): 61/78 kB | 61/195 kB | 16/21 kBProgress (3): 65/78 kB | 61/195 kB | 16/21 kBProgress (3): 65/78 kB | 65/195 kB | 16/21 kBProgress (3): 65/78 kB | 65/195 kB | 19/21 kBProgress (3): 65/78 kB | 65/195 kB | 21 kB   Progress (3): 69/78 kB | 65/195 kB | 21 kBProgress (3): 73/78 kB | 65/195 kB | 21 kBProgress (3): 73/78 kB | 69/195 kB | 21 kBProgress (3): 77/78 kB | 69/195 kB | 21 kBProgress (3): 77/78 kB | 73/195 kB | 21 kBProgress (3): 78 kB | 73/195 kB | 21 kB   Progress (3): 78 kB | 77/195 kB | 21 kBProgress (3): 78 kB | 81/195 kB | 21 kBProgress (3): 78 kB | 85/195 kB | 21 kBProgress (3): 78 kB | 90/195 kB | 21 kBProgress (3): 78 kB | 94/195 kB | 21 kBProgress (3): 78 kB | 98/195 kB | 21 kBProgress (4): 78 kB | 98/195 kB | 21 kB | 4.1/10 kBProgress (4): 78 kB | 102/195 kB | 21 kB | 4.1/10 kBProgress (4): 78 kB | 102/195 kB | 21 kB | 7.7/10 kBProgress (4): 78 kB | 106/195 kB | 21 kB | 7.7/10 kBProgress (4): 78 kB | 106/195 kB | 21 kB | 10 kB    Progress (4): 78 kB | 110/195 kB | 21 kB | 10 kBProgress (4): 78 kB | 114/195 kB | 21 kB | 10 kBProgress (4): 78 kB | 118/195 kB | 21 kB | 10 kBProgress (4): 78 kB | 122/195 kB | 21 kB | 10 kBProgress (4): 78 kB | 126/195 kB | 21 kB | 10 kBProgress (4): 78 kB | 131/195 kB | 21 kB | 10 kBProgress (4): 78 kB | 135/195 kB | 21 kB | 10 kBProgress (4): 78 kB | 139/195 kB | 21 kB | 10 kBProgress (5): 78 kB | 139/195 kB | 21 kB | 10 kB | 4.1/25 kBProgress (5): 78 kB | 143/195 kB | 21 kB | 10 kB | 4.1/25 kBProgress (5): 78 kB | 143/195 kB | 21 kB | 10 kB | 7.7/25 kB                                                            Downloaded from central: https://repo.maven.apache.org/maven2/org/apache/maven/maven-repository-metadata/2.0/maven-repository-metadata-2.0.jar (21 kB at 492 kB/s)
Downloaded from central: https://repo.maven.apache.org/maven2/org/apache/maven/maven-model/2.0/maven-model-2.0.jar (78 kB at 1.9 MB/s)
Progress (3): 143/195 kB | 10 kB | 12/25 kBProgress (3): 147/195 kB | 10 kB | 12/25 kBProgress (3): 147/195 kB | 10 kB | 16/25 kB                                           Downloading from central: https://repo.maven.apache.org/maven2/org/apache/maven/maven-artifact-manager/2.0/maven-artifact-manager-2.0.jar
Downloading from central: https://repo.maven.apache.org/maven2/org/apache/maven/maven-plugin-descriptor/2.0/maven-plugin-descriptor-2.0.jar
Progress (3): 147/195 kB | 10 kB | 20/25 kBProgress (3): 151/195 kB | 10 kB | 20/25 kBProgress (3): 151/195 kB | 10 kB | 24/25 kBProgress (3): 155/195 kB | 10 kB | 24/25 kBProgress (3): 155/195 kB | 10 kB | 25 kB   Progress (3): 159/195 kB | 10 kB | 25 kB                                        Downloaded from central: https://repo.maven.apache.org/maven2/org/apache/maven/maven-error-diagnostics/2.0/maven-error-diagnostics-2.0.jar (10 kB at 228 kB/s)
Progress (2): 163/195 kB | 25 kB                                Downloading from central: https://repo.maven.apache.org/maven2/org/apache/maven/maven-monitor/2.0/maven-monitor-2.0.jar
Progress (2): 167/195 kB | 25 kBProgress (2): 171/195 kB | 25 kBProgress (2): 176/195 kB | 25 kBProgress (2): 180/195 kB | 25 kBProgress (2): 184/195 kB | 25 kBProgress (2): 188/195 kB | 25 kBProgress (2): 192/195 kB | 25 kBProgress (2): 195 kB | 25 kB    Progress (3): 195 kB | 25 kB | 4.1/51 kBProgress (3): 195 kB | 25 kB | 7.7/51 kBProgress (3): 195 kB | 25 kB | 12/51 kB Progress (3): 195 kB | 25 kB | 16/51 kBProgress (4): 195 kB | 25 kB | 16/51 kB | 2.2/33 kBProgress (4): 195 kB | 25 kB | 20/51 kB | 2.2/33 kBProgress (5): 195 kB | 25 kB | 20/51 kB | 2.2/33 kB | 4.1/7.6 kBProgress (5): 195 kB | 25 kB | 24/51 kB | 2.2/33 kB | 4.1/7.6 kBProgress (5): 195 kB | 25 kB | 24/51 kB | 5.0/33 kB | 4.1/7.6 kBProgress (5): 195 kB | 25 kB | 24/51 kB | 5.0/33 kB | 7.6 kB    Progress (5): 195 kB | 25 kB | 24/51 kB | 7.7/33 kB | 7.6 kBProgress (5): 195 kB | 25 kB | 28/51 kB | 7.7/33 kB | 7.6 kB                                                            Downloaded from central: https://repo.maven.apache.org/maven2/org/apache/maven/maven-plugin-registry/2.0/maven-plugin-registry-2.0.jar (25 kB at 467 kB/s)
Downloading from central: https://repo.maven.apache.org/maven2/org/codehaus/plexus/plexus-utils/1.0.4/plexus-utils-1.0.4.jar
Progress (4): 195 kB | 32/51 kB | 7.7/33 kB | 7.6 kBProgress (4): 195 kB | 32/51 kB | 10/33 kB | 7.6 kB                                                    Downloaded from central: https://repo.maven.apache.org/maven2/org/codehaus/plexus/plexus-container-default/1.0-alpha-8/plexus-container-default-1.0-alpha-8.jar (195 kB at 3.6 MB/s)
Progress (3): 36/51 kB | 10/33 kB | 7.6 kBProgress (3): 36/51 kB | 13/33 kB | 7.6 kBProgress (3): 40/51 kB | 13/33 kB | 7.6 kB                                          Downloading from central: https://repo.maven.apache.org/maven2/org/apache/maven/maven-plugin-api/2.0/maven-plugin-api-2.0.jar
Progress (3): 45/51 kB | 13/33 kB | 7.6 kBProgress (3): 45/51 kB | 16/33 kB | 7.6 kBProgress (3): 49/51 kB | 16/33 kB | 7.6 kBProgress (3): 49/51 kB | 19/33 kB | 7.6 kBProgress (3): 51 kB | 19/33 kB | 7.6 kB   Progress (3): 51 kB | 21/33 kB | 7.6 kBProgress (3): 51 kB | 24/33 kB | 7.6 kBProgress (3): 51 kB | 27/33 kB | 7.6 kBProgress (3): 51 kB | 30/33 kB | 7.6 kBProgress (3): 51 kB | 32/33 kB | 7.6 kBProgress (3): 51 kB | 33 kB | 7.6 kB                                       Downloaded from central: https://repo.maven.apache.org/maven2/org/apache/maven/maven-monitor/2.0/maven-monitor-2.0.jar (7.6 kB at 131 kB/s)
Downloading from central: https://repo.maven.apache.org/maven2/org/apache/maven/maven-artifact/2.0/maven-artifact-2.0.jar
Progress (3): 51 kB | 33 kB | 4.1/164 kBProgress (3): 51 kB | 33 kB | 7.7/164 kBProgress (3): 51 kB | 33 kB | 12/164 kB Progress (3): 51 kB | 33 kB | 16/164 kBProgress (4): 51 kB | 33 kB | 16/164 kB | 4.1/10 kB                                                   Downloaded from central: https://repo.maven.apache.org/maven2/org/apache/maven/maven-artifact-manager/2.0/maven-artifact-manager-2.0.jar (51 kB at 817 kB/s)
Downloading from central: https://repo.maven.apache.org/maven2/org/apache/maven/maven-project/2.0/maven-project-2.0.jar
Progress (3): 33 kB | 20/164 kB | 4.1/10 kBProgress (3): 33 kB | 20/164 kB | 7.7/10 kBProgress (3): 33 kB | 24/164 kB | 7.7/10 kBProgress (3): 33 kB | 24/164 kB | 10 kB    Progress (3): 33 kB | 28/164 kB | 10 kB                                       Downloaded from central: https://repo.maven.apache.org/maven2/org/apache/maven/maven-plugin-descriptor/2.0/maven-plugin-descriptor-2.0.jar (33 kB at 526 kB/s)
Progress (2): 32/164 kB | 10 kB                               Downloading from central: https://repo.maven.apache.org/maven2/commons-io/commons-io/1.4/commons-io-1.4.jar
Progress (2): 36/164 kB | 10 kBProgress (2): 40/164 kB | 10 kBProgress (2): 45/164 kB | 10 kBProgress (2): 49/164 kB | 10 kBProgress (2): 53/164 kB | 10 kBProgress (2): 57/164 kB | 10 kBProgress (3): 57/164 kB | 10 kB | 2.2/79 kBProgress (3): 61/164 kB | 10 kB | 2.2/79 kBProgress (3): 65/164 kB | 10 kB | 2.2/79 kBProgress (3): 65/164 kB | 10 kB | 5.0/79 kBProgress (3): 65/164 kB | 10 kB | 7.7/79 kBProgress (3): 65/164 kB | 10 kB | 10/79 kB Progress (3): 69/164 kB | 10 kB | 10/79 kBProgress (3): 73/164 kB | 10 kB | 10/79 kBProgress (3): 73/164 kB | 10 kB | 13/79 kBProgress (3): 77/164 kB | 10 kB | 13/79 kBProgress (3): 81/164 kB | 10 kB | 13/79 kBProgress (3): 81/164 kB | 10 kB | 16/79 kBProgress (3): 81/164 kB | 10 kB | 19/79 kBProgress (3): 85/164 kB | 10 kB | 19/79 kBProgress (3): 85/164 kB | 10 kB | 21/79 kBProgress (3): 90/164 kB | 10 kB | 21/79 kBProgress (3): 94/164 kB | 10 kB | 21/79 kB                                          Downloaded from central: https://repo.maven.apache.org/maven2/org/apache/maven/maven-plugin-api/2.0/maven-plugin-api-2.0.jar (10 kB at 151 kB/s)
Progress (2): 94/164 kB | 24/79 kBProgress (3): 94/164 kB | 24/79 kB | 2.2/109 kB                                               Downloading from central: https://repo.maven.apache.org/maven2/org/apache/httpcomponents/httpclient/4.0-beta2/httpclient-4.0-beta2.jar
Progress (3): 98/164 kB | 24/79 kB | 2.2/109 kBProgress (3): 98/164 kB | 24/79 kB | 5.0/109 kBProgress (3): 98/164 kB | 27/79 kB | 5.0/109 kBProgress (3): 98/164 kB | 27/79 kB | 7.7/109 kBProgress (3): 98/164 kB | 30/79 kB | 7.7/109 kBProgress (3): 98/164 kB | 30/79 kB | 10/109 kB Progress (3): 98/164 kB | 32/79 kB | 10/109 kBProgress (4): 98/164 kB | 32/79 kB | 10/109 kB | 4.1/105 kBProgress (4): 98/164 kB | 32/79 kB | 13/109 kB | 4.1/105 kBProgress (4): 98/164 kB | 32/79 kB | 13/109 kB | 7.7/105 kBProgress (4): 102/164 kB | 32/79 kB | 13/109 kB | 7.7/105 kBProgress (4): 102/164 kB | 36/79 kB | 13/109 kB | 7.7/105 kBProgress (4): 102/164 kB | 36/79 kB | 13/109 kB | 12/105 kB Progress (4): 102/164 kB | 36/79 kB | 16/109 kB | 12/105 kBProgress (4): 102/164 kB | 36/79 kB | 16/109 kB | 16/105 kBProgress (4): 102/164 kB | 40/79 kB | 16/109 kB | 16/105 kBProgress (4): 106/164 kB | 40/79 kB | 16/109 kB | 16/105 kBProgress (4): 106/164 kB | 45/79 kB | 16/109 kB | 16/105 kBProgress (4): 106/164 kB | 45/79 kB | 16/109 kB | 20/105 kBProgress (4): 106/164 kB | 45/79 kB | 19/109 kB | 20/105 kBProgress (4): 106/164 kB | 45/79 kB | 19/109 kB | 24/105 kBProgress (4): 106/164 kB | 49/79 kB | 19/109 kB | 24/105 kBProgress (4): 110/164 kB | 49/79 kB | 19/109 kB | 24/105 kBProgress (4): 110/164 kB | 49/79 kB | 21/109 kB | 24/105 kBProgress (4): 110/164 kB | 49/79 kB | 21/109 kB | 28/105 kBProgress (4): 114/164 kB | 49/79 kB | 21/109 kB | 28/105 kBProgress (4): 114/164 kB | 49/79 kB | 21/109 kB | 32/105 kBProgress (4): 114/164 kB | 49/79 kB | 24/109 kB | 32/105 kBProgress (4): 114/164 kB | 53/79 kB | 24/109 kB | 32/105 kBProgress (4): 114/164 kB | 53/79 kB | 27/109 kB | 32/105 kBProgress (4): 114/164 kB | 53/79 kB | 27/109 kB | 36/105 kBProgress (4): 114/164 kB | 57/79 kB | 27/109 kB | 36/105 kBProgress (4): 114/164 kB | 57/79 kB | 30/109 kB | 36/105 kBProgress (4): 114/164 kB | 57/79 kB | 30/109 kB | 40/105 kBProgress (4): 114/164 kB | 57/79 kB | 32/109 kB | 40/105 kBProgress (4): 118/164 kB | 57/79 kB | 32/109 kB | 40/105 kBProgress (4): 118/164 kB | 57/79 kB | 32/109 kB | 45/105 kBProgress (4): 118/164 kB | 61/79 kB | 32/109 kB | 45/105 kBProgress (4): 118/164 kB | 61/79 kB | 32/109 kB | 49/105 kBProgress (5): 118/164 kB | 61/79 kB | 32/109 kB | 49/105 kB | 4.1/276 kBProgress (5): 122/164 kB | 61/79 kB | 32/109 kB | 49/105 kB | 4.1/276 kBProgress (5): 122/164 kB | 61/79 kB | 32/109 kB | 49/105 kB | 7.7/276 kBProgress (5): 122/164 kB | 65/79 kB | 32/109 kB | 49/105 kB | 7.7/276 kBProgress (5): 122/164 kB | 65/79 kB | 36/109 kB | 49/105 kB | 7.7/276 kBProgress (5): 122/164 kB | 65/79 kB | 36/109 kB | 49/105 kB | 12/276 kB Progress (5): 122/164 kB | 65/79 kB | 36/109 kB | 53/105 kB | 12/276 kBProgress (5): 126/164 kB | 65/79 kB | 36/109 kB | 53/105 kB | 12/276 kBProgress (5): 126/164 kB | 65/79 kB | 36/109 kB | 57/105 kB | 12/276 kBProgress (5): 126/164 kB | 69/79 kB | 36/109 kB | 57/105 kB | 12/276 kBProgress (5): 126/164 kB | 69/79 kB | 36/109 kB | 57/105 kB | 16/276 kBProgress (5): 126/164 kB | 69/79 kB | 40/109 kB | 57/105 kB | 16/276 kBProgress (5): 126/164 kB | 73/79 kB | 40/109 kB | 57/105 kB | 16/276 kBProgress (5): 126/164 kB | 73/79 kB | 40/109 kB | 61/105 kB | 16/276 kBProgress (5): 131/164 kB | 73/79 kB | 40/109 kB | 61/105 kB | 16/276 kBProgress (5): 131/164 kB | 73/79 kB | 40/109 kB | 61/105 kB | 20/276 kBProgress (5): 131/164 kB | 73/79 kB | 40/109 kB | 65/105 kB | 20/276 kBProgress (5): 131/164 kB | 77/79 kB | 40/109 kB | 65/105 kB | 20/276 kBProgress (5): 131/164 kB | 77/79 kB | 45/109 kB | 65/105 kB | 20/276 kBProgress (5): 135/164 kB | 77/79 kB | 45/109 kB | 65/105 kB | 20/276 kBProgress (5): 135/164 kB | 79 kB | 45/109 kB | 65/105 kB | 20/276 kB   Progress (5): 135/164 kB | 79 kB | 45/109 kB | 65/105 kB | 24/276 kBProgress (5): 139/164 kB | 79 kB | 45/109 kB | 65/105 kB | 24/276 kBProgress (5): 139/164 kB | 79 kB | 45/109 kB | 69/105 kB | 24/276 kBProgress (5): 139/164 kB | 79 kB | 49/109 kB | 69/105 kB | 24/276 kBProgress (5): 139/164 kB | 79 kB | 49/109 kB | 73/105 kB | 24/276 kBProgress (5): 143/164 kB | 79 kB | 49/109 kB | 73/105 kB | 24/276 kBProgress (5): 143/164 kB | 79 kB | 49/109 kB | 73/105 kB | 28/276 kBProgress (5): 147/164 kB | 79 kB | 49/109 kB | 73/105 kB | 28/276 kBProgress (5): 147/164 kB | 79 kB | 49/109 kB | 77/105 kB | 28/276 kBProgress (5): 147/164 kB | 79 kB | 53/109 kB | 77/105 kB | 28/276 kBProgress (5): 147/164 kB | 79 kB | 53/109 kB | 77/105 kB | 32/276 kBProgress (5): 147/164 kB | 79 kB | 57/109 kB | 77/105 kB | 32/276 kBProgress (5): 151/164 kB | 79 kB | 57/109 kB | 77/105 kB | 32/276 kBProgress (5): 151/164 kB | 79 kB | 57/109 kB | 81/105 kB | 32/276 kBProgress (5): 155/164 kB | 79 kB | 57/109 kB | 81/105 kB | 32/276 kBProgress (5): 155/164 kB | 79 kB | 61/109 kB | 81/105 kB | 32/276 kBProgress (5): 159/164 kB | 79 kB | 61/109 kB | 81/105 kB | 32/276 kBProgress (5): 159/164 kB | 79 kB | 61/109 kB | 81/105 kB | 36/276 kBProgress (5): 159/164 kB | 79 kB | 61/109 kB | 85/105 kB | 36/276 kBProgress (5): 163/164 kB | 79 kB | 61/109 kB | 85/105 kB | 36/276 kBProgress (5): 163/164 kB | 79 kB | 65/109 kB | 85/105 kB | 36/276 kBProgress (5): 164 kB | 79 kB | 65/109 kB | 85/105 kB | 36/276 kB    Progress (5): 164 kB | 79 kB | 65/109 kB | 90/105 kB | 36/276 kBProgress (5): 164 kB | 79 kB | 65/109 kB | 90/105 kB | 40/276 kBProgress (5): 164 kB | 79 kB | 65/109 kB | 94/105 kB | 40/276 kBProgress (5): 164 kB | 79 kB | 69/109 kB | 94/105 kB | 40/276 kBProgress (5): 164 kB | 79 kB | 69/109 kB | 94/105 kB | 45/276 kBProgress (5): 164 kB | 79 kB | 73/109 kB | 94/105 kB | 45/276 kBProgress (5): 164 kB | 79 kB | 73/109 kB | 98/105 kB | 45/276 kBProgress (5): 164 kB | 79 kB | 77/109 kB | 98/105 kB | 45/276 kBProgress (5): 164 kB | 79 kB | 77/109 kB | 98/105 kB | 49/276 kBProgress (5): 164 kB | 79 kB | 77/109 kB | 102/105 kB | 49/276 kBProgress (5): 164 kB | 79 kB | 81/109 kB | 102/105 kB | 49/276 kBProgress (5): 164 kB | 79 kB | 81/109 kB | 105 kB | 49/276 kB                                                                 Downloaded from central: https://repo.maven.apache.org/maven2/org/apache/maven/maven-artifact/2.0/maven-artifact-2.0.jar (79 kB at 927 kB/s)
Progress (4): 164 kB | 85/109 kB | 105 kB | 49/276 kBProgress (4): 164 kB | 85/109 kB | 105 kB | 53/276 kBProgress (4): 164 kB | 90/109 kB | 105 kB | 53/276 kB                                                     Downloading from central: https://repo.maven.apache.org/maven2/org/apache/httpcomponents/httpcore/4.0-beta3/httpcore-4.0-beta3.jar
Progress (4): 164 kB | 94/109 kB | 105 kB | 53/276 kBProgress (4): 164 kB | 94/109 kB | 105 kB | 57/276 kBProgress (4): 164 kB | 98/109 kB | 105 kB | 57/276 kBProgress (4): 164 kB | 98/109 kB | 105 kB | 61/276 kBProgress (4): 164 kB | 98/109 kB | 105 kB | 65/276 kBProgress (4): 164 kB | 102/109 kB | 105 kB | 65/276 kBProgress (4): 164 kB | 106/109 kB | 105 kB | 65/276 kBProgress (4): 164 kB | 109 kB | 105 kB | 65/276 kB    Progress (4): 164 kB | 109 kB | 105 kB | 69/276 kBProgress (4): 164 kB | 109 kB | 105 kB | 73/276 kB                                                  Downloaded from central: https://repo.maven.apache.org/maven2/org/codehaus/plexus/plexus-utils/1.0.4/plexus-utils-1.0.4.jar (164 kB at 1.8 MB/s)
Progress (3): 109 kB | 105 kB | 77/276 kB                                         Downloading from central: https://repo.maven.apache.org/maven2/commons-logging/commons-logging/1.1.1/commons-logging-1.1.1.jar
Progress (3): 109 kB | 105 kB | 81/276 kBProgress (3): 109 kB | 105 kB | 85/276 kBProgress (3): 109 kB | 105 kB | 90/276 kBProgress (3): 109 kB | 105 kB | 94/276 kBProgress (3): 109 kB | 105 kB | 98/276 kB                                         Downloaded from central: https://repo.maven.apache.org/maven2/org/apache/maven/maven-project/2.0/maven-project-2.0.jar (105 kB at 1.1 MB/s)
Downloading from central: https://repo.maven.apache.org/maven2/commons-codec/commons-codec/1.3/commons-codec-1.3.jar
Progress (2): 109 kB | 102/276 kBProgress (2): 109 kB | 106/276 kBProgress (2): 109 kB | 110/276 kBProgress (2): 109 kB | 114/276 kBProgress (2): 109 kB | 118/276 kBProgress (2): 109 kB | 122/276 kB                                 Downloaded from central: https://repo.maven.apache.org/maven2/commons-io/commons-io/1.4/commons-io-1.4.jar (109 kB at 1.2 MB/s)
Progress (1): 126/276 kB                        Downloading from central: https://repo.maven.apache.org/maven2/org/codehaus/plexus/plexus-archiver/1.2/plexus-archiver-1.2.jar
Progress (2): 126/276 kB | 4.1/172 kBProgress (2): 131/276 kB | 4.1/172 kBProgress (2): 131/276 kB | 7.7/172 kBProgress (2): 131/276 kB | 12/172 kB Progress (2): 131/276 kB | 16/172 kBProgress (2): 135/276 kB | 16/172 kBProgress (2): 139/276 kB | 16/172 kBProgress (3): 139/276 kB | 16/172 kB | 4.1/61 kBProgress (3): 143/276 kB | 16/172 kB | 4.1/61 kBProgress (3): 143/276 kB | 20/172 kB | 4.1/61 kBProgress (3): 147/276 kB | 20/172 kB | 4.1/61 kBProgress (3): 147/276 kB | 20/172 kB | 7.7/61 kBProgress (3): 147/276 kB | 24/172 kB | 7.7/61 kBProgress (3): 147/276 kB | 24/172 kB | 12/61 kB Progress (3): 147/276 kB | 28/172 kB | 12/61 kBProgress (3): 147/276 kB | 28/172 kB | 16/61 kBProgress (3): 151/276 kB | 28/172 kB | 16/61 kBProgress (3): 151/276 kB | 32/172 kB | 16/61 kBProgress (3): 155/276 kB | 32/172 kB | 16/61 kBProgress (3): 159/276 kB | 32/172 kB | 16/61 kBProgress (3): 163/276 kB | 32/172 kB | 16/61 kBProgress (3): 163/276 kB | 32/172 kB | 20/61 kBProgress (4): 163/276 kB | 32/172 kB | 20/61 kB | 4.1/47 kBProgress (4): 163/276 kB | 32/172 kB | 24/61 kB | 4.1/47 kBProgress (4): 163/276 kB | 36/172 kB | 24/61 kB | 4.1/47 kBProgress (4): 167/276 kB | 36/172 kB | 24/61 kB | 4.1/47 kBProgress (4): 167/276 kB | 36/172 kB | 28/61 kB | 4.1/47 kBProgress (4): 167/276 kB | 36/172 kB | 28/61 kB | 7.7/47 kBProgress (4): 167/276 kB | 36/172 kB | 32/61 kB | 7.7/47 kBProgress (4): 171/276 kB | 36/172 kB | 32/61 kB | 7.7/47 kBProgress (4): 171/276 kB | 40/172 kB | 32/61 kB | 7.7/47 kBProgress (4): 176/276 kB | 40/172 kB | 32/61 kB | 7.7/47 kBProgress (4): 176/276 kB | 40/172 kB | 32/61 kB | 12/47 kB Progress (4): 180/276 kB | 40/172 kB | 32/61 kB | 12/47 kBProgress (4): 180/276 kB | 45/172 kB | 32/61 kB | 12/47 kBProgress (5): 180/276 kB | 45/172 kB | 32/61 kB | 12/47 kB | 2.2/182 kBProgress (5): 180/276 kB | 45/172 kB | 32/61 kB | 16/47 kB | 2.2/182 kBProgress (5): 180/276 kB | 45/172 kB | 36/61 kB | 16/47 kB | 2.2/182 kBProgress (5): 184/276 kB | 45/172 kB | 36/61 kB | 16/47 kB | 2.2/182 kBProgress (5): 184/276 kB | 45/172 kB | 36/61 kB | 16/47 kB | 5.0/182 kBProgress (5): 184/276 kB | 49/172 kB | 36/61 kB | 16/47 kB | 5.0/182 kBProgress (5): 184/276 kB | 49/172 kB | 36/61 kB | 16/47 kB | 7.7/182 kBProgress (5): 188/276 kB | 49/172 kB | 36/61 kB | 16/47 kB | 7.7/182 kBProgress (5): 188/276 kB | 49/172 kB | 36/61 kB | 16/47 kB | 10/182 kB Progress (5): 188/276 kB | 49/172 kB | 40/61 kB | 16/47 kB | 10/182 kBProgress (5): 188/276 kB | 53/172 kB | 40/61 kB | 16/47 kB | 10/182 kBProgress (5): 188/276 kB | 53/172 kB | 40/61 kB | 16/47 kB | 13/182 kBProgress (5): 188/276 kB | 53/172 kB | 40/61 kB | 20/47 kB | 13/182 kBProgress (5): 192/276 kB | 53/172 kB | 40/61 kB | 20/47 kB | 13/182 kBProgress (5): 192/276 kB | 53/172 kB | 40/61 kB | 24/47 kB | 13/182 kBProgress (5): 192/276 kB | 53/172 kB | 40/61 kB | 24/47 kB | 16/182 kBProgress (5): 192/276 kB | 57/172 kB | 40/61 kB | 24/47 kB | 16/182 kBProgress (5): 192/276 kB | 57/172 kB | 45/61 kB | 24/47 kB | 16/182 kBProgress (5): 192/276 kB | 61/172 kB | 45/61 kB | 24/47 kB | 16/182 kBProgress (5): 192/276 kB | 61/172 kB | 45/61 kB | 24/47 kB | 19/182 kBProgress (5): 192/276 kB | 61/172 kB | 45/61 kB | 28/47 kB | 19/182 kBProgress (5): 196/276 kB | 61/172 kB | 45/61 kB | 28/47 kB | 19/182 kBProgress (5): 196/276 kB | 61/172 kB | 45/61 kB | 32/47 kB | 19/182 kBProgress (5): 196/276 kB | 61/172 kB | 45/61 kB | 32/47 kB | 21/182 kBProgress (5): 196/276 kB | 65/172 kB | 45/61 kB | 32/47 kB | 21/182 kBProgress (5): 196/276 kB | 65/172 kB | 49/61 kB | 32/47 kB | 21/182 kBProgress (5): 200/276 kB | 65/172 kB | 49/61 kB | 32/47 kB | 21/182 kBProgress (5): 200/276 kB | 65/172 kB | 49/61 kB | 32/47 kB | 24/182 kBProgress (5): 200/276 kB | 65/172 kB | 49/61 kB | 36/47 kB | 24/182 kBProgress (5): 204/276 kB | 65/172 kB | 49/61 kB | 36/47 kB | 24/182 kBProgress (5): 204/276 kB | 69/172 kB | 49/61 kB | 36/47 kB | 24/182 kBProgress (5): 204/276 kB | 69/172 kB | 49/61 kB | 40/47 kB | 24/182 kBProgress (5): 204/276 kB | 69/172 kB | 53/61 kB | 40/47 kB | 24/182 kBProgress (5): 204/276 kB | 69/172 kB | 53/61 kB | 40/47 kB | 27/182 kBProgress (5): 204/276 kB | 69/172 kB | 57/61 kB | 40/47 kB | 27/182 kBProgress (5): 204/276 kB | 69/172 kB | 57/61 kB | 45/47 kB | 27/182 kBProgress (5): 204/276 kB | 73/172 kB | 57/61 kB | 45/47 kB | 27/182 kBProgress (5): 208/276 kB | 73/172 kB | 57/61 kB | 45/47 kB | 27/182 kBProgress (5): 208/276 kB | 77/172 kB | 57/61 kB | 45/47 kB | 27/182 kBProgress (5): 208/276 kB | 77/172 kB | 57/61 kB | 47 kB | 27/182 kB   Progress (5): 208/276 kB | 77/172 kB | 61 kB | 47 kB | 27/182 kB   Progress (5): 208/276 kB | 77/172 kB | 61 kB | 47 kB | 30/182 kBProgress (5): 208/276 kB | 81/172 kB | 61 kB | 47 kB | 30/182 kBProgress (5): 212/276 kB | 81/172 kB | 61 kB | 47 kB | 30/182 kBProgress (5): 212/276 kB | 81/172 kB | 61 kB | 47 kB | 32/182 kBProgress (5): 212/276 kB | 85/172 kB | 61 kB | 47 kB | 32/182 kBProgress (5): 217/276 kB | 85/172 kB | 61 kB | 47 kB | 32/182 kBProgress (5): 217/276 kB | 85/172 kB | 61 kB | 47 kB | 36/182 kBProgress (5): 217/276 kB | 90/172 kB | 61 kB | 47 kB | 36/182 kBProgress (5): 217/276 kB | 90/172 kB | 61 kB | 47 kB | 40/182 kBProgress (5): 221/276 kB | 90/172 kB | 61 kB | 47 kB | 40/182 kBProgress (5): 221/276 kB | 90/172 kB | 61 kB | 47 kB | 45/182 kBProgress (5): 221/276 kB | 94/172 kB | 61 kB | 47 kB | 45/182 kBProgress (5): 221/276 kB | 94/172 kB | 61 kB | 47 kB | 49/182 kBProgress (5): 225/276 kB | 94/172 kB | 61 kB | 47 kB | 49/182 kBProgress (5): 225/276 kB | 98/172 kB | 61 kB | 47 kB | 49/182 kBProgress (5): 229/276 kB | 98/172 kB | 61 kB | 47 kB | 49/182 kBProgress (5): 229/276 kB | 98/172 kB | 61 kB | 47 kB | 53/182 kBProgress (5): 229/276 kB | 98/172 kB | 61 kB | 47 kB | 57/182 kBProgress (5): 229/276 kB | 98/172 kB | 61 kB | 47 kB | 61/182 kBProgress (5): 233/276 kB | 98/172 kB | 61 kB | 47 kB | 61/182 kBProgress (5): 233/276 kB | 102/172 kB | 61 kB | 47 kB | 61/182 kBProgress (5): 237/276 kB | 102/172 kB | 61 kB | 47 kB | 61/182 kBProgress (5): 237/276 kB | 102/172 kB | 61 kB | 47 kB | 65/182 kBProgress (5): 241/276 kB | 102/172 kB | 61 kB | 47 kB | 65/182 kBProgress (5): 241/276 kB | 106/172 kB | 61 kB | 47 kB | 65/182 kBProgress (5): 245/276 kB | 106/172 kB | 61 kB | 47 kB | 65/182 kBProgress (5): 245/276 kB | 110/172 kB | 61 kB | 47 kB | 65/182 kB                                                                 Downloaded from central: https://repo.maven.apache.org/maven2/commons-codec/commons-codec/1.3/commons-codec-1.3.jar (47 kB at 410 kB/s)
Progress (4): 249/276 kB | 110/172 kB | 61 kB | 65/182 kBProgress (4): 249/276 kB | 110/172 kB | 61 kB | 69/182 kBProgress (4): 253/276 kB | 110/172 kB | 61 kB | 69/182 kB                                                         Downloaded from central: https://repo.maven.apache.org/maven2/commons-logging/commons-logging/1.1.1/commons-logging-1.1.1.jar (61 kB at 528 kB/s)
Downloading from central: https://repo.maven.apache.org/maven2/org/codehaus/plexus/plexus-io/1.0.1/plexus-io-1.0.1.jar
Progress (3): 253/276 kB | 114/172 kB | 69/182 kBProgress (3): 258/276 kB | 114/172 kB | 69/182 kBProgress (3): 258/276 kB | 114/172 kB | 73/182 kBProgress (3): 262/276 kB | 114/172 kB | 73/182 kBProgress (3): 262/276 kB | 114/172 kB | 77/182 kBProgress (3): 262/276 kB | 114/172 kB | 81/182 kBProgress (3): 262/276 kB | 118/172 kB | 81/182 kBProgress (3): 262/276 kB | 122/172 kB | 81/182 kBProgress (3): 266/276 kB | 122/172 kB | 81/182 kBProgress (3): 266/276 kB | 126/172 kB | 81/182 kBProgress (3): 270/276 kB | 126/172 kB | 81/182 kBProgress (3): 270/276 kB | 131/172 kB | 81/182 kBProgress (3): 274/276 kB | 131/172 kB | 81/182 kBProgress (3): 274/276 kB | 131/172 kB | 85/182 kBProgress (3): 276 kB | 131/172 kB | 85/182 kB    Progress (3): 276 kB | 131/172 kB | 90/182 kBProgress (3): 276 kB | 131/172 kB | 94/182 kBProgress (3): 276 kB | 135/172 kB | 94/182 kBProgress (3): 276 kB | 135/172 kB | 98/182 kBProgress (3): 276 kB | 139/172 kB | 98/182 kBProgress (3): 276 kB | 143/172 kB | 98/182 kBProgress (3): 276 kB | 147/172 kB | 98/182 kBProgress (3): 276 kB | 147/172 kB | 102/182 kBProgress (3): 276 kB | 147/172 kB | 106/182 kBProgress (3): 276 kB | 147/172 kB | 110/182 kBProgress (3): 276 kB | 151/172 kB | 110/182 kBProgress (3): 276 kB | 151/172 kB | 114/182 kBProgress (3): 276 kB | 155/172 kB | 114/182 kBProgress (3): 276 kB | 159/172 kB | 114/182 kBProgress (3): 276 kB | 163/172 kB | 114/182 kBProgress (3): 276 kB | 163/172 kB | 118/182 kBProgress (3): 276 kB | 163/172 kB | 122/182 kBProgress (3): 276 kB | 167/172 kB | 122/182 kBProgress (3): 276 kB | 167/172 kB | 126/182 kBProgress (3): 276 kB | 171/172 kB | 126/182 kBProgress (3): 276 kB | 171/172 kB | 131/182 kBProgress (3): 276 kB | 172 kB | 131/182 kB    Progress (3): 276 kB | 172 kB | 135/182 kBProgress (3): 276 kB | 172 kB | 139/182 kBProgress (3): 276 kB | 172 kB | 143/182 kBProgress (4): 276 kB | 172 kB | 143/182 kB | 4.1/51 kBProgress (4): 276 kB | 172 kB | 147/182 kB | 4.1/51 kBProgress (4): 276 kB | 172 kB | 147/182 kB | 8.2/51 kBProgress (4): 276 kB | 172 kB | 147/182 kB | 12/51 kB Progress (4): 276 kB | 172 kB | 147/182 kB | 16/51 kBProgress (4): 276 kB | 172 kB | 151/182 kB | 16/51 kBProgress (4): 276 kB | 172 kB | 155/182 kB | 16/51 kBProgress (4): 276 kB | 172 kB | 159/182 kB | 16/51 kBProgress (4): 276 kB | 172 kB | 163/182 kB | 16/51 kBProgress (4): 276 kB | 172 kB | 163/182 kB | 20/51 kB                                                     Downloaded from central: https://repo.maven.apache.org/maven2/org/apache/httpcomponents/httpclient/4.0-beta2/httpclient-4.0-beta2.jar (276 kB at 2.2 MB/s)
Progress (3): 172 kB | 163/182 kB | 25/51 kBProgress (3): 172 kB | 167/182 kB | 25/51 kBProgress (3): 172 kB | 167/182 kB | 29/51 kBProgress (3): 172 kB | 171/182 kB | 29/51 kBProgress (3): 172 kB | 171/182 kB | 33/51 kBProgress (3): 172 kB | 176/182 kB | 33/51 kBProgress (3): 172 kB | 180/182 kB | 33/51 kBProgress (3): 172 kB | 182 kB | 33/51 kB    Progress (3): 172 kB | 182 kB | 37/51 kBProgress (3): 172 kB | 182 kB | 41/51 kBProgress (3): 172 kB | 182 kB | 45/51 kBProgress (3): 172 kB | 182 kB | 49/51 kBProgress (3): 172 kB | 182 kB | 51 kB                                        Downloaded from central: https://repo.maven.apache.org/maven2/org/apache/httpcomponents/httpcore/4.0-beta3/httpcore-4.0-beta3.jar (172 kB at 1.4 MB/s)
Downloaded from central: https://repo.maven.apache.org/maven2/org/codehaus/plexus/plexus-archiver/1.2/plexus-archiver-1.2.jar (182 kB at 1.4 MB/s)
Downloaded from central: https://repo.maven.apache.org/maven2/org/codehaus/plexus/plexus-io/1.0.1/plexus-io-1.0.1.jar (51 kB at 385 kB/s)
Downloading: https://www.ecma-international.org/publications/files/ECMA-ST//Office%20Open%20XML%201st%20edition%20Part%204%20(PDF).zip
org.apache.maven.wagon.ResourceDoesNotExistException: Resource missing at https://www.ecma-international.org/publications/files/ECMA-ST/Office%2520Open%2520XML%25201st%2520edition%2520Part%25204%2520(PDF).zip 404 Not Found
        at org.apache.maven.wagon.providers.http.wagon.shared.AbstractHttpClientWagon.fillInputData(AbstractHttpClientWagon.java:1185)
        at org.apache.maven.wagon.providers.http.wagon.shared.AbstractHttpClientWagon.fillInputData(AbstractHttpClientWagon.java:1138)
        at org.apache.maven.wagon.StreamWagon.getInputStream(StreamWagon.java:126)
        at org.apache.maven.wagon.StreamWagon.getIfNewer(StreamWagon.java:88)
        at org.apache.maven.wagon.StreamWagon.get(StreamWagon.java:61)
        at com.googlecode.WGet.doGet(WGet.java:218)
        at com.googlecode.WGet.execute(WGet.java:173)
        at org.apache.maven.plugin.DefaultBuildPluginManager.executeMojo(DefaultBuildPluginManager.java:137)
        at org.apache.maven.lifecycle.internal.MojoExecutor.execute(MojoExecutor.java:210)
        at org.apache.maven.lifecycle.internal.MojoExecutor.execute(MojoExecutor.java:156)
        at org.apache.maven.lifecycle.internal.MojoExecutor.execute(MojoExecutor.java:148)
        at org.apache.maven.lifecycle.internal.LifecycleModuleBuilder.buildProject(LifecycleModuleBuilder.java:117)
        at org.apache.maven.lifecycle.internal.LifecycleModuleBuilder.buildProject(LifecycleModuleBuilder.java:81)
        at org.apache.maven.lifecycle.internal.builder.singlethreaded.SingleThreadedBuilder.build(SingleThreadedBuilder.java:56)
        at org.apache.maven.lifecycle.internal.LifecycleStarter.execute(LifecycleStarter.java:128)
        at org.apache.maven.DefaultMaven.doExecute(DefaultMaven.java:305)
        at org.apache.maven.DefaultMaven.doExecute(DefaultMaven.java:192)
        at org.apache.maven.DefaultMaven.execute(DefaultMaven.java:105)
        at org.apache.maven.cli.MavenCli.execute(MavenCli.java:957)
        at org.apache.maven.cli.MavenCli.doMain(MavenCli.java:289)
        at org.apache.maven.cli.MavenCli.main(MavenCli.java:193)
        at sun.reflect.NativeMethodAccessorImpl.invoke0(Native Method)
        at sun.reflect.NativeMethodAccessorImpl.invoke(NativeMethodAccessorImpl.java:62)
        at sun.reflect.DelegatingMethodAccessorImpl.invoke(DelegatingMethodAccessorImpl.java:43)
        at java.lang.reflect.Method.invoke(Method.java:498)
        at org.codehaus.plexus.classworlds.launcher.Launcher.launchEnhanced(Launcher.java:282)
        at org.codehaus.plexus.classworlds.launcher.Launcher.launch(Launcher.java:225)
        at org.codehaus.plexus.classworlds.launcher.Launcher.mainWithExitCode(Launcher.java:406)
        at org.codehaus.plexus.classworlds.launcher.Launcher.main(Launcher.java:347)
[WARNING] Could not get content
org.apache.maven.wagon.ResourceDoesNotExistException: Resource missing at https://www.ecma-international.org/publications/files/ECMA-ST/Office%2520Open%2520XML%25201st%2520edition%2520Part%25204%2520(PDF).zip 404 Not Found
    at org.apache.maven.wagon.providers.http.wagon.shared.AbstractHttpClientWagon.fillInputData (AbstractHttpClientWagon.java:1185)
    at org.apache.maven.wagon.providers.http.wagon.shared.AbstractHttpClientWagon.fillInputData (AbstractHttpClientWagon.java:1138)
    at org.apache.maven.wagon.StreamWagon.getInputStream (StreamWagon.java:126)
    at org.apache.maven.wagon.StreamWagon.getIfNewer (StreamWagon.java:88)
    at org.apache.maven.wagon.StreamWagon.get (StreamWagon.java:61)
    at com.googlecode.WGet.doGet (WGet.java:218)
    at com.googlecode.WGet.execute (WGet.java:173)
    at org.apache.maven.plugin.DefaultBuildPluginManager.executeMojo (DefaultBuildPluginManager.java:137)
    at org.apache.maven.lifecycle.internal.MojoExecutor.execute (MojoExecutor.java:210)
    at org.apache.maven.lifecycle.internal.MojoExecutor.execute (MojoExecutor.java:156)
    at org.apache.maven.lifecycle.internal.MojoExecutor.execute (MojoExecutor.java:148)
    at org.apache.maven.lifecycle.internal.LifecycleModuleBuilder.buildProject (LifecycleModuleBuilder.java:117)
    at org.apache.maven.lifecycle.internal.LifecycleModuleBuilder.buildProject (LifecycleModuleBuilder.java:81)
    at org.apache.maven.lifecycle.internal.builder.singlethreaded.SingleThreadedBuilder.build (SingleThreadedBuilder.java:56)
    at org.apache.maven.lifecycle.internal.LifecycleStarter.execute (LifecycleStarter.java:128)
    at org.apache.maven.DefaultMaven.doExecute (DefaultMaven.java:305)
    at org.apache.maven.DefaultMaven.doExecute (DefaultMaven.java:192)
    at org.apache.maven.DefaultMaven.execute (DefaultMaven.java:105)
    at org.apache.maven.cli.MavenCli.execute (MavenCli.java:957)
    at org.apache.maven.cli.MavenCli.doMain (MavenCli.java:289)
    at org.apache.maven.cli.MavenCli.main (MavenCli.java:193)
    at sun.reflect.NativeMethodAccessorImpl.invoke0 (Native Method)
    at sun.reflect.NativeMethodAccessorImpl.invoke (NativeMethodAccessorImpl.java:62)
    at sun.reflect.DelegatingMethodAccessorImpl.invoke (DelegatingMethodAccessorImpl.java:43)
    at java.lang.reflect.Method.invoke (Method.java:498)
    at org.codehaus.plexus.classworlds.launcher.Launcher.launchEnhanced (Launcher.java:282)
    at org.codehaus.plexus.classworlds.launcher.Launcher.launch (Launcher.java:225)
    at org.codehaus.plexus.classworlds.launcher.Launcher.mainWithExitCode (Launcher.java:406)
    at org.codehaus.plexus.classworlds.launcher.Launcher.main (Launcher.java:347)
[WARNING] Retrying (1 more)
Downloading: https://www.ecma-international.org/publications/files/ECMA-ST//Office%20Open%20XML%201st%20edition%20Part%204%20(PDF).zip
org.apache.maven.wagon.ResourceDoesNotExistException: Resource missing at https://www.ecma-international.org/publications/files/ECMA-ST/Office%2520Open%2520XML%25201st%2520edition%2520Part%25204%2520(PDF).zip 404 Not Found
        at org.apache.maven.wagon.providers.http.wagon.shared.AbstractHttpClientWagon.fillInputData(AbstractHttpClientWagon.java:1185)
        at org.apache.maven.wagon.providers.http.wagon.shared.AbstractHttpClientWagon.fillInputData(AbstractHttpClientWagon.java:1138)
        at org.apache.maven.wagon.StreamWagon.getInputStream(StreamWagon.java:126)
        at org.apache.maven.wagon.StreamWagon.getIfNewer(StreamWagon.java:88)
        at org.apache.maven.wagon.StreamWagon.get(StreamWagon.java:61)
        at com.googlecode.WGet.doGet(WGet.java:218)
        at com.googlecode.WGet.execute(WGet.java:173)
        at org.apache.maven.plugin.DefaultBuildPluginManager.executeMojo(DefaultBuildPluginManager.java:137)
        at org.apache.maven.lifecycle.internal.MojoExecutor.execute(MojoExecutor.java:210)
        at org.apache.maven.lifecycle.internal.MojoExecutor.execute(MojoExecutor.java:156)
        at org.apache.maven.lifecycle.internal.MojoExecutor.execute(MojoExecutor.java:148)
        at org.apache.maven.lifecycle.internal.LifecycleModuleBuilder.buildProject(LifecycleModuleBuilder.java:117)
        at org.apache.maven.lifecycle.internal.LifecycleModuleBuilder.buildProject(LifecycleModuleBuilder.java:81)
        at org.apache.maven.lifecycle.internal.builder.singlethreaded.SingleThreadedBuilder.build(SingleThreadedBuilder.java:56)
        at org.apache.maven.lifecycle.internal.LifecycleStarter.execute(LifecycleStarter.java:128)
        at org.apache.maven.DefaultMaven.doExecute(DefaultMaven.java:305)
        at org.apache.maven.DefaultMaven.doExecute(DefaultMaven.java:192)
        at org.apache.maven.DefaultMaven.execute(DefaultMaven.java:105)
        at org.apache.maven.cli.MavenCli.execute(MavenCli.java:957)
        at org.apache.maven.cli.MavenCli.doMain(MavenCli.java:289)
        at org.apache.maven.cli.MavenCli.main(MavenCli.java:193)
        at sun.reflect.NativeMethodAccessorImpl.invoke0(Native Method)
        at sun.reflect.NativeMethodAccessorImpl.invoke(NativeMethodAccessorImpl.java:62)
        at sun.reflect.DelegatingMethodAccessorImpl.invoke(DelegatingMethodAccessorImpl.java:43)
        at java.lang.reflect.Method.invoke(Method.java:498)
        at org.codehaus.plexus.classworlds.launcher.Launcher.launchEnhanced(Launcher.java:282)
        at org.codehaus.plexus.classworlds.launcher.Launcher.launch(Launcher.java:225)
        at org.codehaus.plexus.classworlds.launcher.Launcher.mainWithExitCode(Launcher.java:406)
        at org.codehaus.plexus.classworlds.launcher.Launcher.main(Launcher.java:347)
[WARNING] Could not get content
org.apache.maven.wagon.ResourceDoesNotExistException: Resource missing at https://www.ecma-international.org/publications/files/ECMA-ST/Office%2520Open%2520XML%25201st%2520edition%2520Part%25204%2520(PDF).zip 404 Not Found
    at org.apache.maven.wagon.providers.http.wagon.shared.AbstractHttpClientWagon.fillInputData (AbstractHttpClientWagon.java:1185)
    at org.apache.maven.wagon.providers.http.wagon.shared.AbstractHttpClientWagon.fillInputData (AbstractHttpClientWagon.java:1138)
    at org.apache.maven.wagon.StreamWagon.getInputStream (StreamWagon.java:126)
    at org.apache.maven.wagon.StreamWagon.getIfNewer (StreamWagon.java:88)
    at org.apache.maven.wagon.StreamWagon.get (StreamWagon.java:61)
    at com.googlecode.WGet.doGet (WGet.java:218)
    at com.googlecode.WGet.execute (WGet.java:173)
    at org.apache.maven.plugin.DefaultBuildPluginManager.executeMojo (DefaultBuildPluginManager.java:137)
    at org.apache.maven.lifecycle.internal.MojoExecutor.execute (MojoExecutor.java:210)
    at org.apache.maven.lifecycle.internal.MojoExecutor.execute (MojoExecutor.java:156)
    at org.apache.maven.lifecycle.internal.MojoExecutor.execute (MojoExecutor.java:148)
    at org.apache.maven.lifecycle.internal.LifecycleModuleBuilder.buildProject (LifecycleModuleBuilder.java:117)
    at org.apache.maven.lifecycle.internal.LifecycleModuleBuilder.buildProject (LifecycleModuleBuilder.java:81)
    at org.apache.maven.lifecycle.internal.builder.singlethreaded.SingleThreadedBuilder.build (SingleThreadedBuilder.java:56)
    at org.apache.maven.lifecycle.internal.LifecycleStarter.execute (LifecycleStarter.java:128)
    at org.apache.maven.DefaultMaven.doExecute (DefaultMaven.java:305)
    at org.apache.maven.DefaultMaven.doExecute (DefaultMaven.java:192)
    at org.apache.maven.DefaultMaven.execute (DefaultMaven.java:105)
    at org.apache.maven.cli.MavenCli.execute (MavenCli.java:957)
    at org.apache.maven.cli.MavenCli.doMain (MavenCli.java:289)
    at org.apache.maven.cli.MavenCli.main (MavenCli.java:193)
    at sun.reflect.NativeMethodAccessorImpl.invoke0 (Native Method)
    at sun.reflect.NativeMethodAccessorImpl.invoke (NativeMethodAccessorImpl.java:62)
    at sun.reflect.DelegatingMethodAccessorImpl.invoke (DelegatingMethodAccessorImpl.java:43)
    at java.lang.reflect.Method.invoke (Method.java:498)
    at org.codehaus.plexus.classworlds.launcher.Launcher.launchEnhanced (Launcher.java:282)
    at org.codehaus.plexus.classworlds.launcher.Launcher.launch (Launcher.java:225)
    at org.codehaus.plexus.classworlds.launcher.Launcher.mainWithExitCode (Launcher.java:406)
    at org.codehaus.plexus.classworlds.launcher.Launcher.main (Launcher.java:347)
[INFO] ------------------------------------------------------------------------
[INFO] Reactor Summary for Apache POI - the Java API for Microsoft Documents 4.1.3-SNAPSHOT:
[INFO]
[INFO] Apache POI - the Java API for Microsoft Documents .. SUCCESS [  8.011 s]
[INFO] Apache POI Main package ............................ SUCCESS [02:57 min]
[INFO] Apache POI Scratchpad package ...................... SUCCESS [ 32.991 s]
[INFO] Apache POI - Openxmlformats Schema package ......... FAILURE [  5.684 s]
[INFO] Apache POI - Openxmlformats Encryption Schema package SKIPPED
[INFO] Apache POI - Openxmlformats Security-Schema package  SKIPPED
[INFO] Apache POI OOXML package ........................... SKIPPED
[INFO] Apache POI ExcelAnt package ........................ SKIPPED
[INFO] Apache POI Examples package ........................ SKIPPED
[INFO] Apache POI integration test ........................ SKIPPED
[INFO] ------------------------------------------------------------------------
[INFO] BUILD FAILURE
[INFO] ------------------------------------------------------------------------
[INFO] Total time:  03:44 min
[INFO] Finished at: 2020-02-14T00:14:23Z
[INFO] ------------------------------------------------------------------------
[ERROR] Failed to execute goal com.googlecode.maven-download-plugin:maven-download-plugin:1.1.0:wget (download-xsds) on project poi-ooxml-schema: IO Error: Could not get content -> [Help 1]
[ERROR]
[ERROR] To see the full stack trace of the errors, re-run Maven with the -e switch.
[ERROR] Re-run Maven using the -X switch to enable full debug logging.
[ERROR]
[ERROR] For more information about the errors and possible solutions, please read the following articles:
[ERROR] [Help 1] http://cwiki.apache.org/confluence/display/MAVEN/MojoExecutionException
[ERROR]
[ERROR] After correcting the problems, you can resume the build with the command
[ERROR]   mvn <args> -rf :poi-ooxml-schema
Build step 'Invoke top-level Maven targets' marked build as failure
Recording test results

---------------------------------------------------------------------
To unsubscribe, e-mail: [hidden email]
For additional commands, e-mail: [hidden email]

Reply | Threaded
Open this post in threaded view
|

Build failed in Jenkins: POI-DSL-Maven #1042

Apache Jenkins Server
See <https://builds.apache.org/job/POI-DSL-Maven/1042/display/redirect?page=changes>

Changes:

[fanningpj] try to gradle tests

[fanningpj] try to gradle tests

[fanningpj] update junit to 4.13 and mockito to 3.2.4

[fanningpj] gradle 6.1.1


------------------------------------------
[...truncated 1.70 MB...]
Progress (1): 1.4 kB                    Downloaded from central: https://repo.maven.apache.org/maven2/org/apache/maven/maven-profile/2.0/maven-profile-2.0.pom (1.4 kB at 114 kB/s)
Downloading from central: https://repo.maven.apache.org/maven2/org/apache/maven/maven-artifact/2.0/maven-artifact-2.0.pom
Progress (1): 723 B                   Downloaded from central: https://repo.maven.apache.org/maven2/org/apache/maven/maven-artifact/2.0/maven-artifact-2.0.pom (723 B at 66 kB/s)
Downloading from central: https://repo.maven.apache.org/maven2/org/apache/maven/maven-repository-metadata/2.0/maven-repository-metadata-2.0.pom
Progress (1): 1.2 kB                    Downloaded from central: https://repo.maven.apache.org/maven2/org/apache/maven/maven-repository-metadata/2.0/maven-repository-metadata-2.0.pom (1.2 kB at 102 kB/s)
Downloading from central: https://repo.maven.apache.org/maven2/org/apache/maven/maven-error-diagnostics/2.0/maven-error-diagnostics-2.0.pom
Progress (1): 812 B                   Downloaded from central: https://repo.maven.apache.org/maven2/org/apache/maven/maven-error-diagnostics/2.0/maven-error-diagnostics-2.0.pom (812 B at 62 kB/s)
Downloading from central: https://repo.maven.apache.org/maven2/org/apache/maven/maven-project/2.0/maven-project-2.0.pom
Progress (1): 1.6 kB                    Downloaded from central: https://repo.maven.apache.org/maven2/org/apache/maven/maven-project/2.0/maven-project-2.0.pom (1.6 kB at 136 kB/s)
Downloading from central: https://repo.maven.apache.org/maven2/org/apache/maven/maven-artifact-manager/2.0/maven-artifact-manager-2.0.pom
Progress (1): 1.3 kB                    Downloaded from central: https://repo.maven.apache.org/maven2/org/apache/maven/maven-artifact-manager/2.0/maven-artifact-manager-2.0.pom (1.3 kB at 104 kB/s)
Downloading from central: https://repo.maven.apache.org/maven2/org/apache/maven/maven-plugin-registry/2.0/maven-plugin-registry-2.0.pom
Progress (1): 1.3 kB                    Downloaded from central: https://repo.maven.apache.org/maven2/org/apache/maven/maven-plugin-registry/2.0/maven-plugin-registry-2.0.pom (1.3 kB at 107 kB/s)
Downloading from central: https://repo.maven.apache.org/maven2/org/apache/maven/maven-plugin-api/2.0/maven-plugin-api-2.0.pom
Progress (1): 601 B                   Downloaded from central: https://repo.maven.apache.org/maven2/org/apache/maven/maven-plugin-api/2.0/maven-plugin-api-2.0.pom (601 B at 50 kB/s)
Downloading from central: https://repo.maven.apache.org/maven2/org/apache/maven/maven-plugin-descriptor/2.0/maven-plugin-descriptor-2.0.pom
Progress (1): 1.5 kB                    Downloaded from central: https://repo.maven.apache.org/maven2/org/apache/maven/maven-plugin-descriptor/2.0/maven-plugin-descriptor-2.0.pom (1.5 kB at 122 kB/s)
Downloading from central: https://repo.maven.apache.org/maven2/org/apache/maven/maven-monitor/2.0/maven-monitor-2.0.pom
Progress (1): 400 B                   Downloaded from central: https://repo.maven.apache.org/maven2/org/apache/maven/maven-monitor/2.0/maven-monitor-2.0.pom (400 B at 33 kB/s)
Downloading from central: https://repo.maven.apache.org/maven2/commons-io/commons-io/1.4/commons-io-1.4.pom
Progress (1): 2.2/13 kBProgress (1): 5.0/13 kBProgress (1): 7.8/13 kBProgress (1): 11/13 kB Progress (1): 13 kB                      Downloaded from central: https://repo.maven.apache.org/maven2/commons-io/commons-io/1.4/commons-io-1.4.pom (13 kB at 940 kB/s)
Downloading from central: https://repo.maven.apache.org/maven2/org/apache/commons/commons-parent/7/commons-parent-7.pom
Progress (1): 2.2/17 kBProgress (1): 5.0/17 kBProgress (1): 7.8/17 kBProgress (1): 11/17 kB Progress (1): 13/17 kBProgress (1): 16/17 kBProgress (1): 17 kB                      Downloaded from central: https://repo.maven.apache.org/maven2/org/apache/commons/commons-parent/7/commons-parent-7.pom (17 kB at 1.2 MB/s)
Downloading from central: https://repo.maven.apache.org/maven2/org/apache/httpcomponents/httpclient/4.0-beta2/httpclient-4.0-beta2.pom
Progress (1): 2.2/5.1 kBProgress (1): 5.0/5.1 kBProgress (1): 5.1 kB                        Downloaded from central: https://repo.maven.apache.org/maven2/org/apache/httpcomponents/httpclient/4.0-beta2/httpclient-4.0-beta2.pom (5.1 kB at 389 kB/s)
Downloading from central: https://repo.maven.apache.org/maven2/org/apache/httpcomponents/httpcomponents-client/4.0-beta2/httpcomponents-client-4.0-beta2.pom
Progress (1): 2.2/7.9 kBProgress (1): 5.0/7.9 kBProgress (1): 7.8/7.9 kBProgress (1): 7.9 kB                        Downloaded from central: https://repo.maven.apache.org/maven2/org/apache/httpcomponents/httpcomponents-client/4.0-beta2/httpcomponents-client-4.0-beta2.pom (7.9 kB at 562 kB/s)
Downloading from central: https://repo.maven.apache.org/maven2/org/apache/httpcomponents/project/4.0/project-4.0.pom
Progress (1): 2.2/13 kBProgress (1): 5.0/13 kBProgress (1): 7.8/13 kBProgress (1): 11/13 kB Progress (1): 13 kB                      Downloaded from central: https://repo.maven.apache.org/maven2/org/apache/httpcomponents/project/4.0/project-4.0.pom (13 kB at 1.0 MB/s)
Downloading from central: https://repo.maven.apache.org/maven2/org/apache/httpcomponents/httpcore/4.0-beta3/httpcore-4.0-beta3.pom
Progress (1): 2.2/4.7 kBProgress (1): 4.7 kB                        Downloaded from central: https://repo.maven.apache.org/maven2/org/apache/httpcomponents/httpcore/4.0-beta3/httpcore-4.0-beta3.pom (4.7 kB at 315 kB/s)
Downloading from central: https://repo.maven.apache.org/maven2/org/apache/httpcomponents/httpcomponents-core/4.0-beta3/httpcomponents-core-4.0-beta3.pom
Progress (1): 2.2/6.9 kBProgress (1): 5.0/6.9 kBProgress (1): 6.9 kB                        Downloaded from central: https://repo.maven.apache.org/maven2/org/apache/httpcomponents/httpcomponents-core/4.0-beta3/httpcomponents-core-4.0-beta3.pom (6.9 kB at 533 kB/s)
Downloading from central: https://repo.maven.apache.org/maven2/commons-logging/commons-logging/1.1.1/commons-logging-1.1.1.pom
Progress (1): 2.2/18 kBProgress (1): 5.0/18 kBProgress (1): 7.8/18 kBProgress (1): 11/18 kB Progress (1): 13/18 kBProgress (1): 16/18 kBProgress (1): 18 kB                      Downloaded from central: https://repo.maven.apache.org/maven2/commons-logging/commons-logging/1.1.1/commons-logging-1.1.1.pom (18 kB at 1.1 MB/s)
Downloading from central: https://repo.maven.apache.org/maven2/org/apache/commons/commons-parent/5/commons-parent-5.pom
Progress (1): 2.2/16 kBProgress (1): 5.0/16 kBProgress (1): 7.8/16 kBProgress (1): 11/16 kB Progress (1): 13/16 kBProgress (1): 16/16 kBProgress (1): 16 kB                      Downloaded from central: https://repo.maven.apache.org/maven2/org/apache/commons/commons-parent/5/commons-parent-5.pom (16 kB at 1.2 MB/s)
Downloading from central: https://repo.maven.apache.org/maven2/commons-codec/commons-codec/1.3/commons-codec-1.3.pom
Progress (1): 2.2/6.1 kBProgress (1): 5.0/6.1 kBProgress (1): 6.1 kB                        Downloaded from central: https://repo.maven.apache.org/maven2/commons-codec/commons-codec/1.3/commons-codec-1.3.pom (6.1 kB at 509 kB/s)
Downloading from central: https://repo.maven.apache.org/maven2/org/codehaus/plexus/plexus-archiver/1.2/plexus-archiver-1.2.pom
Progress (1): 2.0 kB                    Downloaded from central: https://repo.maven.apache.org/maven2/org/codehaus/plexus/plexus-archiver/1.2/plexus-archiver-1.2.pom (2.0 kB at 170 kB/s)
Downloading from central: https://repo.maven.apache.org/maven2/org/codehaus/plexus/plexus-io/1.0.1/plexus-io-1.0.1.pom
Progress (1): 1.2 kB                    Downloaded from central: https://repo.maven.apache.org/maven2/org/codehaus/plexus/plexus-io/1.0.1/plexus-io-1.0.1.pom (1.2 kB at 103 kB/s)
Downloading from central: https://repo.maven.apache.org/maven2/org/apache/maven/maven-core/2.0/maven-core-2.0.jar
Downloading from central: https://repo.maven.apache.org/maven2/org/apache/maven/maven-settings/2.0/maven-settings-2.0.jar
Downloading from central: https://repo.maven.apache.org/maven2/org/apache/maven/maven-plugin-parameter-documenter/2.0/maven-plugin-parameter-documenter-2.0.jar
Downloading from central: https://repo.maven.apache.org/maven2/doxia/doxia-sink-api/1.0-alpha-4/doxia-sink-api-1.0-alpha-4.jar
Downloading from central: https://repo.maven.apache.org/maven2/org/apache/maven/reporting/maven-reporting-api/2.0/maven-reporting-api-2.0.jar
Progress (1): 2.2/136 kBProgress (1): 5.0/136 kBProgress (1): 7.7/136 kBProgress (1): 10/136 kB Progress (2): 10/136 kB | 2.2/43 kBProgress (2): 13/136 kB | 2.2/43 kBProgress (2): 13/136 kB | 5.0/43 kBProgress (3): 13/136 kB | 5.0/43 kB | 2.2/18 kBProgress (3): 13/136 kB | 7.7/43 kB | 2.2/18 kBProgress (3): 16/136 kB | 7.7/43 kB | 2.2/18 kBProgress (3): 16/136 kB | 10/43 kB | 2.2/18 kB Progress (3): 16/136 kB | 10/43 kB | 5.0/18 kBProgress (4): 16/136 kB | 10/43 kB | 5.0/18 kB | 2.2/4.3 kBProgress (5): 16/136 kB | 10/43 kB | 5.0/18 kB | 2.2/4.3 kB | 2.2/6.6 kBProgress (5): 16/136 kB | 10/43 kB | 5.0/18 kB | 4.3 kB | 2.2/6.6 kB    Progress (5): 16/136 kB | 10/43 kB | 5.0/18 kB | 4.3 kB | 5.0/6.6 kBProgress (5): 16/136 kB | 13/43 kB | 5.0/18 kB | 4.3 kB | 5.0/6.6 kBProgress (5): 19/136 kB | 13/43 kB | 5.0/18 kB | 4.3 kB | 5.0/6.6 kBProgress (5): 19/136 kB | 16/43 kB | 5.0/18 kB | 4.3 kB | 5.0/6.6 kBProgress (5): 19/136 kB | 16/43 kB | 5.0/18 kB | 4.3 kB | 6.6 kB    Progress (5): 19/136 kB | 16/43 kB | 7.7/18 kB | 4.3 kB | 6.6 kBProgress (5): 19/136 kB | 19/43 kB | 7.7/18 kB | 4.3 kB | 6.6 kBProgress (5): 19/136 kB | 19/43 kB | 10/18 kB | 4.3 kB | 6.6 kB Progress (5): 19/136 kB | 21/43 kB | 10/18 kB | 4.3 kB | 6.6 kBProgress (5): 19/136 kB | 21/43 kB | 13/18 kB | 4.3 kB | 6.6 kBProgress (5): 21/136 kB | 21/43 kB | 13/18 kB | 4.3 kB | 6.6 kBProgress (5): 21/136 kB | 21/43 kB | 16/18 kB | 4.3 kB | 6.6 kBProgress (5): 21/136 kB | 24/43 kB | 16/18 kB | 4.3 kB | 6.6 kBProgress (5): 21/136 kB | 24/43 kB | 18 kB | 4.3 kB | 6.6 kB   Progress (5): 24/136 kB | 24/43 kB | 18 kB | 4.3 kB | 6.6 kBProgress (5): 24/136 kB | 27/43 kB | 18 kB | 4.3 kB | 6.6 kBProgress (5): 27/136 kB | 27/43 kB | 18 kB | 4.3 kB | 6.6 kBProgress (5): 27/136 kB | 30/43 kB | 18 kB | 4.3 kB | 6.6 kBProgress (5): 30/136 kB | 30/43 kB | 18 kB | 4.3 kB | 6.6 kBProgress (5): 30/136 kB | 32/43 kB | 18 kB | 4.3 kB | 6.6 kBProgress (5): 32/136 kB | 32/43 kB | 18 kB | 4.3 kB | 6.6 kBProgress (5): 32/136 kB | 36/43 kB | 18 kB | 4.3 kB | 6.6 kB                                                            Downloaded from central: https://repo.maven.apache.org/maven2/doxia/doxia-sink-api/1.0-alpha-4/doxia-sink-api-1.0-alpha-4.jar (4.3 kB at 238 kB/s)
Progress (4): 36/136 kB | 36/43 kB | 18 kB | 6.6 kBProgress (4): 36/136 kB | 40/43 kB | 18 kB | 6.6 kBProgress (4): 40/136 kB | 40/43 kB | 18 kB | 6.6 kB                                                   Downloaded from central: https://repo.maven.apache.org/maven2/org/apache/maven/reporting/maven-reporting-api/2.0/maven-reporting-api-2.0.jar (6.6 kB at 328 kB/s)
Downloading from central: https://repo.maven.apache.org/maven2/org/apache/maven/maven-profile/2.0/maven-profile-2.0.jar
Downloading from central: https://repo.maven.apache.org/maven2/org/apache/maven/maven-model/2.0/maven-model-2.0.jar
Progress (3): 45/136 kB | 40/43 kB | 18 kBProgress (3): 45/136 kB | 43 kB | 18 kB   Progress (3): 49/136 kB | 43 kB | 18 kB                                       Downloaded from central: https://repo.maven.apache.org/maven2/org/apache/maven/maven-plugin-parameter-documenter/2.0/maven-plugin-parameter-documenter-2.0.jar (18 kB at 801 kB/s)
Downloading from central: https://repo.maven.apache.org/maven2/org/codehaus/plexus/plexus-container-default/1.0-alpha-8/plexus-container-default-1.0-alpha-8.jar
Progress (2): 53/136 kB | 43 kBProgress (2): 57/136 kB | 43 kBProgress (2): 61/136 kB | 43 kBProgress (2): 65/136 kB | 43 kBProgress (2): 69/136 kB | 43 kBProgress (2): 73/136 kB | 43 kBProgress (2): 77/136 kB | 43 kBProgress (2): 81/136 kB | 43 kBProgress (2): 85/136 kB | 43 kBProgress (3): 85/136 kB | 43 kB | 2.2/78 kBProgress (3): 90/136 kB | 43 kB | 2.2/78 kBProgress (4): 90/136 kB | 43 kB | 2.2/78 kB | 2.2/30 kBProgress (4): 90/136 kB | 43 kB | 5.0/78 kB | 2.2/30 kBProgress (4): 94/136 kB | 43 kB | 5.0/78 kB | 2.2/30 kBProgress (4): 94/136 kB | 43 kB | 5.0/78 kB | 5.0/30 kBProgress (4): 98/136 kB | 43 kB | 5.0/78 kB | 5.0/30 kBProgress (4): 98/136 kB | 43 kB | 5.0/78 kB | 7.7/30 kBProgress (4): 98/136 kB | 43 kB | 7.7/78 kB | 7.7/30 kB                                                       Downloaded from central: https://repo.maven.apache.org/maven2/org/apache/maven/maven-settings/2.0/maven-settings-2.0.jar (43 kB at 1.5 MB/s)
Progress (3): 102/136 kB | 7.7/78 kB | 7.7/30 kBProgress (3): 102/136 kB | 10/78 kB | 7.7/30 kB Progress (3): 102/136 kB | 10/78 kB | 10/30 kB Progress (3): 106/136 kB | 10/78 kB | 10/30 kBProgress (4): 106/136 kB | 10/78 kB | 10/30 kB | 2.2/195 kB                                                           Downloading from central: https://repo.maven.apache.org/maven2/org/apache/maven/maven-repository-metadata/2.0/maven-repository-metadata-2.0.jar
Progress (4): 106/136 kB | 10/78 kB | 10/30 kB | 5.0/195 kBProgress (4): 106/136 kB | 10/78 kB | 13/30 kB | 5.0/195 kBProgress (4): 110/136 kB | 10/78 kB | 13/30 kB | 5.0/195 kBProgress (4): 110/136 kB | 13/78 kB | 13/30 kB | 5.0/195 kBProgress (4): 110/136 kB | 13/78 kB | 16/30 kB | 5.0/195 kBProgress (4): 114/136 kB | 13/78 kB | 16/30 kB | 5.0/195 kBProgress (4): 114/136 kB | 13/78 kB | 16/30 kB | 7.7/195 kBProgress (4): 114/136 kB | 13/78 kB | 19/30 kB | 7.7/195 kBProgress (4): 114/136 kB | 16/78 kB | 19/30 kB | 7.7/195 kBProgress (4): 114/136 kB | 16/78 kB | 19/30 kB | 10/195 kB Progress (4): 114/136 kB | 16/78 kB | 21/30 kB | 10/195 kBProgress (4): 118/136 kB | 16/78 kB | 21/30 kB | 10/195 kBProgress (4): 118/136 kB | 16/78 kB | 24/30 kB | 10/195 kBProgress (4): 118/136 kB | 19/78 kB | 24/30 kB | 10/195 kBProgress (4): 122/136 kB | 19/78 kB | 24/30 kB | 10/195 kBProgress (4): 122/136 kB | 19/78 kB | 24/30 kB | 13/195 kBProgress (4): 126/136 kB | 19/78 kB | 24/30 kB | 13/195 kBProgress (4): 126/136 kB | 21/78 kB | 24/30 kB | 13/195 kBProgress (4): 126/136 kB | 21/78 kB | 27/30 kB | 13/195 kBProgress (4): 131/136 kB | 21/78 kB | 27/30 kB | 13/195 kBProgress (4): 131/136 kB | 21/78 kB | 27/30 kB | 16/195 kBProgress (4): 131/136 kB | 21/78 kB | 30/30 kB | 16/195 kBProgress (4): 131/136 kB | 24/78 kB | 30/30 kB | 16/195 kBProgress (4): 131/136 kB | 24/78 kB | 30 kB | 16/195 kB   Progress (4): 131/136 kB | 24/78 kB | 30 kB | 19/195 kBProgress (4): 135/136 kB | 24/78 kB | 30 kB | 19/195 kBProgress (4): 135/136 kB | 27/78 kB | 30 kB | 19/195 kBProgress (4): 135/136 kB | 27/78 kB | 30 kB | 21/195 kBProgress (4): 136 kB | 27/78 kB | 30 kB | 21/195 kB    Progress (4): 136 kB | 30/78 kB | 30 kB | 21/195 kBProgress (4): 136 kB | 30/78 kB | 30 kB | 24/195 kBProgress (4): 136 kB | 32/78 kB | 30 kB | 24/195 kBProgress (4): 136 kB | 32/78 kB | 30 kB | 27/195 kBProgress (4): 136 kB | 32/78 kB | 30 kB | 30/195 kBProgress (4): 136 kB | 32/78 kB | 30 kB | 32/195 kBProgress (4): 136 kB | 36/78 kB | 30 kB | 32/195 kBProgress (4): 136 kB | 40/78 kB | 30 kB | 32/195 kBProgress (5): 136 kB | 40/78 kB | 30 kB | 32/195 kB | 4.1/21 kBProgress (5): 136 kB | 45/78 kB | 30 kB | 32/195 kB | 4.1/21 kBProgress (5): 136 kB | 45/78 kB | 30 kB | 36/195 kB | 4.1/21 kBProgress (5): 136 kB | 45/78 kB | 30 kB | 36/195 kB | 7.7/21 kBProgress (5): 136 kB | 45/78 kB | 30 kB | 40/195 kB | 7.7/21 kBProgress (5): 136 kB | 49/78 kB | 30 kB | 40/195 kB | 7.7/21 kBProgress (5): 136 kB | 49/78 kB | 30 kB | 45/195 kB | 7.7/21 kBProgress (5): 136 kB | 49/78 kB | 30 kB | 45/195 kB | 12/21 kB Progress (5): 136 kB | 49/78 kB | 30 kB | 49/195 kB | 12/21 kBProgress (5): 136 kB | 49/78 kB | 30 kB | 49/195 kB | 16/21 kBProgress (5): 136 kB | 53/78 kB | 30 kB | 49/195 kB | 16/21 kBProgress (5): 136 kB | 53/78 kB | 30 kB | 49/195 kB | 20/21 kBProgress (5): 136 kB | 57/78 kB | 30 kB | 49/195 kB | 20/21 kBProgress (5): 136 kB | 57/78 kB | 30 kB | 53/195 kB | 20/21 kBProgress (5): 136 kB | 57/78 kB | 30 kB | 53/195 kB | 21 kB   Progress (5): 136 kB | 57/78 kB | 30 kB | 57/195 kB | 21 kBProgress (5): 136 kB | 61/78 kB | 30 kB | 57/195 kB | 21 kBProgress (5): 136 kB | 61/78 kB | 30 kB | 61/195 kB | 21 kBProgress (5): 136 kB | 65/78 kB | 30 kB | 61/195 kB | 21 kBProgress (5): 136 kB | 65/78 kB | 30 kB | 65/195 kB | 21 kB                                                           Downloaded from central: https://repo.maven.apache.org/maven2/org/apache/maven/maven-profile/2.0/maven-profile-2.0.jar (30 kB at 800 kB/s)
Progress (4): 136 kB | 69/78 kB | 65/195 kB | 21 kB                                                   Downloaded from central: https://repo.maven.apache.org/maven2/org/apache/maven/maven-core/2.0/maven-core-2.0.jar (136 kB at 3.3 MB/s)
Downloading from central: https://repo.maven.apache.org/maven2/org/apache/maven/maven-plugin-registry/2.0/maven-plugin-registry-2.0.jar
Progress (3): 73/78 kB | 65/195 kB | 21 kBProgress (3): 73/78 kB | 69/195 kB | 21 kB                                          Downloading from central: https://repo.maven.apache.org/maven2/org/apache/maven/maven-error-diagnostics/2.0/maven-error-diagnostics-2.0.jar
Progress (3): 73/78 kB | 73/195 kB | 21 kBProgress (3): 77/78 kB | 73/195 kB | 21 kBProgress (3): 77/78 kB | 77/195 kB | 21 kBProgress (3): 78 kB | 77/195 kB | 21 kB   Progress (3): 78 kB | 81/195 kB | 21 kBProgress (3): 78 kB | 85/195 kB | 21 kBProgress (3): 78 kB | 90/195 kB | 21 kBProgress (3): 78 kB | 94/195 kB | 21 kBProgress (3): 78 kB | 98/195 kB | 21 kB                                       Downloaded from central: https://repo.maven.apache.org/maven2/org/apache/maven/maven-repository-metadata/2.0/maven-repository-metadata-2.0.jar (21 kB at 480 kB/s)
Downloading from central: https://repo.maven.apache.org/maven2/org/apache/maven/maven-plugin-descriptor/2.0/maven-plugin-descriptor-2.0.jar
Progress (2): 78 kB | 102/195 kBProgress (2): 78 kB | 106/195 kBProgress (2): 78 kB | 110/195 kBProgress (2): 78 kB | 114/195 kBProgress (2): 78 kB | 118/195 kBProgress (2): 78 kB | 122/195 kBProgress (2): 78 kB | 126/195 kBProgress (2): 78 kB | 131/195 kBProgress (2): 78 kB | 135/195 kBProgress (2): 78 kB | 139/195 kBProgress (2): 78 kB | 143/195 kBProgress (3): 78 kB | 143/195 kB | 2.2/25 kBProgress (3): 78 kB | 147/195 kB | 2.2/25 kBProgress (3): 78 kB | 147/195 kB | 5.0/25 kBProgress (3): 78 kB | 147/195 kB | 7.7/25 kBProgress (4): 78 kB | 147/195 kB | 7.7/25 kB | 4.1/10 kB                                                        Downloaded from central: https://repo.maven.apache.org/maven2/org/apache/maven/maven-model/2.0/maven-model-2.0.jar (78 kB at 1.7 MB/s)
Downloading from central: https://repo.maven.apache.org/maven2/org/apache/maven/maven-artifact-manager/2.0/maven-artifact-manager-2.0.jar
Progress (3): 147/195 kB | 10/25 kB | 4.1/10 kBProgress (3): 151/195 kB | 10/25 kB | 4.1/10 kBProgress (3): 151/195 kB | 10/25 kB | 7.7/10 kBProgress (3): 151/195 kB | 13/25 kB | 7.7/10 kBProgress (3): 155/195 kB | 13/25 kB | 7.7/10 kBProgress (3): 155/195 kB | 13/25 kB | 10 kB    Progress (3): 155/195 kB | 16/25 kB | 10 kBProgress (3): 159/195 kB | 16/25 kB | 10 kBProgress (4): 159/195 kB | 16/25 kB | 10 kB | 2.2/33 kBProgress (4): 163/195 kB | 16/25 kB | 10 kB | 2.2/33 kBProgress (4): 163/195 kB | 19/25 kB | 10 kB | 2.2/33 kBProgress (4): 163/195 kB | 19/25 kB | 10 kB | 5.0/33 kBProgress (4): 163/195 kB | 21/25 kB | 10 kB | 5.0/33 kBProgress (4): 163/195 kB | 21/25 kB | 10 kB | 7.7/33 kBProgress (4): 163/195 kB | 24/25 kB | 10 kB | 7.7/33 kBProgress (4): 167/195 kB | 24/25 kB | 10 kB | 7.7/33 kBProgress (4): 167/195 kB | 25 kB | 10 kB | 7.7/33 kB   Progress (4): 167/195 kB | 25 kB | 10 kB | 10/33 kB Progress (4): 171/195 kB | 25 kB | 10 kB | 10/33 kBProgress (4): 171/195 kB | 25 kB | 10 kB | 13/33 kBProgress (4): 176/195 kB | 25 kB | 10 kB | 13/33 kBProgress (4): 176/195 kB | 25 kB | 10 kB | 16/33 kBProgress (4): 180/195 kB | 25 kB | 10 kB | 16/33 kBProgress (4): 180/195 kB | 25 kB | 10 kB | 19/33 kBProgress (4): 180/195 kB | 25 kB | 10 kB | 21/33 kBProgress (4): 180/195 kB | 25 kB | 10 kB | 24/33 kBProgress (4): 184/195 kB | 25 kB | 10 kB | 24/33 kBProgress (4): 184/195 kB | 25 kB | 10 kB | 27/33 kBProgress (4): 188/195 kB | 25 kB | 10 kB | 27/33 kBProgress (4): 188/195 kB | 25 kB | 10 kB | 30/33 kBProgress (4): 192/195 kB | 25 kB | 10 kB | 30/33 kBProgress (4): 192/195 kB | 25 kB | 10 kB | 32/33 kBProgress (4): 195 kB | 25 kB | 10 kB | 32/33 kB    Progress (4): 195 kB | 25 kB | 10 kB | 33 kB   Progress (5): 195 kB | 25 kB | 10 kB | 33 kB | 4.1/51 kBProgress (5): 195 kB | 25 kB | 10 kB | 33 kB | 7.7/51 kBProgress (5): 195 kB | 25 kB | 10 kB | 33 kB | 12/51 kB Progress (5): 195 kB | 25 kB | 10 kB | 33 kB | 16/51 kB                                                       Downloaded from central: https://repo.maven.apache.org/maven2/org/apache/maven/maven-error-diagnostics/2.0/maven-error-diagnostics-2.0.jar (10 kB at 190 kB/s)
Downloaded from central: https://repo.maven.apache.org/maven2/org/apache/maven/maven-plugin-registry/2.0/maven-plugin-registry-2.0.jar (25 kB at 458 kB/s)
Downloading from central: https://repo.maven.apache.org/maven2/org/codehaus/plexus/plexus-utils/1.0.4/plexus-utils-1.0.4.jar
Progress (3): 195 kB | 33 kB | 20/51 kB                                       Downloading from central: https://repo.maven.apache.org/maven2/org/apache/maven/maven-monitor/2.0/maven-monitor-2.0.jar
Progress (3): 195 kB | 33 kB | 24/51 kBProgress (3): 195 kB | 33 kB | 28/51 kBProgress (3): 195 kB | 33 kB | 32/51 kBProgress (3): 195 kB | 33 kB | 36/51 kBProgress (3): 195 kB | 33 kB | 40/51 kBProgress (3): 195 kB | 33 kB | 45/51 kB                                       Downloaded from central: https://repo.maven.apache.org/maven2/org/codehaus/plexus/plexus-container-default/1.0-alpha-8/plexus-container-default-1.0-alpha-8.jar (195 kB at 3.4 MB/s)
Progress (2): 33 kB | 49/51 kB                              Downloading from central: https://repo.maven.apache.org/maven2/org/apache/maven/maven-plugin-api/2.0/maven-plugin-api-2.0.jar
Downloaded from central: https://repo.maven.apache.org/maven2/org/apache/maven/maven-plugin-descriptor/2.0/maven-plugin-descriptor-2.0.jar (33 kB at 571 kB/s)
Progress (1): 51 kB                   Downloading from central: https://repo.maven.apache.org/maven2/org/apache/maven/maven-artifact/2.0/maven-artifact-2.0.jar
Progress (2): 51 kB | 4.1/7.6 kBProgress (2): 51 kB | 7.6 kB    Progress (3): 51 kB | 7.6 kB | 2.2/164 kBProgress (3): 51 kB | 7.6 kB | 5.0/164 kBProgress (3): 51 kB | 7.6 kB | 7.7/164 kBProgress (3): 51 kB | 7.6 kB | 10/164 kB Progress (3): 51 kB | 7.6 kB | 13/164 kBProgress (3): 51 kB | 7.6 kB | 16/164 kB                                        Downloaded from central: https://repo.maven.apache.org/maven2/org/apache/maven/maven-artifact-manager/2.0/maven-artifact-manager-2.0.jar (51 kB at 791 kB/s)
Downloading from central: https://repo.maven.apache.org/maven2/org/apache/maven/maven-project/2.0/maven-project-2.0.jar
Progress (3): 7.6 kB | 16/164 kB | 4.1/10 kBProgress (3): 7.6 kB | 19/164 kB | 4.1/10 kBProgress (3): 7.6 kB | 19/164 kB | 7.7/10 kBProgress (3): 7.6 kB | 19/164 kB | 10 kB    Progress (3): 7.6 kB | 21/164 kB | 10 kBProgress (4): 7.6 kB | 21/164 kB | 10 kB | 4.1/79 kBProgress (4): 7.6 kB | 24/164 kB | 10 kB | 4.1/79 kBProgress (4): 7.6 kB | 24/164 kB | 10 kB | 7.7/79 kBProgress (4): 7.6 kB | 27/164 kB | 10 kB | 7.7/79 kBProgress (4): 7.6 kB | 27/164 kB | 10 kB | 12/79 kB Progress (4): 7.6 kB | 30/164 kB | 10 kB | 12/79 kBProgress (4): 7.6 kB | 30/164 kB | 10 kB | 16/79 kBProgress (4): 7.6 kB | 32/164 kB | 10 kB | 16/79 kBProgress (4): 7.6 kB | 32/164 kB | 10 kB | 20/79 kBProgress (4): 7.6 kB | 36/164 kB | 10 kB | 20/79 kB                                                   Downloaded from central: https://repo.maven.apache.org/maven2/org/apache/maven/maven-monitor/2.0/maven-monitor-2.0.jar (7.6 kB at 112 kB/s)
Progress (3): 36/164 kB | 10 kB | 24/79 kB                                          Downloading from central: https://repo.maven.apache.org/maven2/commons-io/commons-io/1.4/commons-io-1.4.jar
Progress (3): 40/164 kB | 10 kB | 24/79 kBProgress (3): 40/164 kB | 10 kB | 28/79 kBProgress (3): 45/164 kB | 10 kB | 28/79 kBProgress (3): 45/164 kB | 10 kB | 32/79 kBProgress (3): 49/164 kB | 10 kB | 32/79 kBProgress (4): 49/164 kB | 10 kB | 32/79 kB | 2.2/105 kBProgress (4): 49/164 kB | 10 kB | 36/79 kB | 2.2/105 kBProgress (4): 53/164 kB | 10 kB | 36/79 kB | 2.2/105 kBProgress (4): 53/164 kB | 10 kB | 36/79 kB | 5.0/105 kBProgress (4): 53/164 kB | 10 kB | 40/79 kB | 5.0/105 kBProgress (4): 57/164 kB | 10 kB | 40/79 kB | 5.0/105 kBProgress (4): 57/164 kB | 10 kB | 45/79 kB | 5.0/105 kBProgress (4): 57/164 kB | 10 kB | 45/79 kB | 7.7/105 kBProgress (4): 57/164 kB | 10 kB | 49/79 kB | 7.7/105 kB                                                       Downloaded from central: https://repo.maven.apache.org/maven2/org/apache/maven/maven-plugin-api/2.0/maven-plugin-api-2.0.jar (10 kB at 141 kB/s)
Progress (3): 61/164 kB | 49/79 kB | 7.7/105 kB                                               Downloading from central: https://repo.maven.apache.org/maven2/org/apache/httpcomponents/httpclient/4.0-beta2/httpclient-4.0-beta2.jar
Progress (3): 61/164 kB | 49/79 kB | 10/105 kBProgress (3): 61/164 kB | 53/79 kB | 10/105 kBProgress (3): 65/164 kB | 53/79 kB | 10/105 kBProgress (3): 65/164 kB | 57/79 kB | 10/105 kBProgress (3): 65/164 kB | 57/79 kB | 13/105 kBProgress (3): 65/164 kB | 61/79 kB | 13/105 kBProgress (3): 65/164 kB | 65/79 kB | 13/105 kBProgress (3): 65/164 kB | 65/79 kB | 16/105 kBProgress (3): 69/164 kB | 65/79 kB | 16/105 kBProgress (3): 69/164 kB | 65/79 kB | 19/105 kBProgress (4): 69/164 kB | 65/79 kB | 19/105 kB | 2.2/109 kBProgress (4): 69/164 kB | 69/79 kB | 19/105 kB | 2.2/109 kBProgress (4): 73/164 kB | 69/79 kB | 19/105 kB | 2.2/109 kBProgress (4): 73/164 kB | 73/79 kB | 19/105 kB | 2.2/109 kBProgress (4): 73/164 kB | 73/79 kB | 19/105 kB | 5.0/109 kBProgress (4): 73/164 kB | 73/79 kB | 21/105 kB | 5.0/109 kBProgress (4): 73/164 kB | 77/79 kB | 21/105 kB | 5.0/109 kBProgress (4): 77/164 kB | 77/79 kB | 21/105 kB | 5.0/109 kBProgress (4): 77/164 kB | 79 kB | 21/105 kB | 5.0/109 kB   Progress (4): 77/164 kB | 79 kB | 24/105 kB | 5.0/109 kBProgress (4): 77/164 kB | 79 kB | 24/105 kB | 7.7/109 kBProgress (4): 77/164 kB | 79 kB | 27/105 kB | 7.7/109 kBProgress (4): 81/164 kB | 79 kB | 27/105 kB | 7.7/109 kBProgress (4): 81/164 kB | 79 kB | 30/105 kB | 7.7/109 kBProgress (4): 81/164 kB | 79 kB | 30/105 kB | 10/109 kB Progress (4): 81/164 kB | 79 kB | 32/105 kB | 10/109 kBProgress (4): 81/164 kB | 79 kB | 32/105 kB | 13/109 kBProgress (4): 81/164 kB | 79 kB | 32/105 kB | 16/109 kBProgress (4): 81/164 kB | 79 kB | 36/105 kB | 16/109 kBProgress (4): 85/164 kB | 79 kB | 36/105 kB | 16/109 kBProgress (4): 85/164 kB | 79 kB | 36/105 kB | 19/109 kBProgress (4): 85/164 kB | 79 kB | 40/105 kB | 19/109 kBProgress (4): 90/164 kB | 79 kB | 40/105 kB | 19/109 kBProgress (4): 90/164 kB | 79 kB | 40/105 kB | 21/109 kBProgress (4): 90/164 kB | 79 kB | 45/105 kB | 21/109 kBProgress (4): 94/164 kB | 79 kB | 45/105 kB | 21/109 kBProgress (4): 94/164 kB | 79 kB | 45/105 kB | 24/109 kBProgress (4): 94/164 kB | 79 kB | 49/105 kB | 24/109 kBProgress (4): 98/164 kB | 79 kB | 49/105 kB | 24/109 kBProgress (4): 98/164 kB | 79 kB | 49/105 kB | 27/109 kBProgress (4): 98/164 kB | 79 kB | 53/105 kB | 27/109 kBProgress (4): 98/164 kB | 79 kB | 53/105 kB | 30/109 kBProgress (4): 98/164 kB | 79 kB | 57/105 kB | 30/109 kBProgress (5): 98/164 kB | 79 kB | 57/105 kB | 30/109 kB | 4.1/276 kBProgress (5): 98/164 kB | 79 kB | 57/105 kB | 32/109 kB | 4.1/276 kBProgress (5): 102/164 kB | 79 kB | 57/105 kB | 32/109 kB | 4.1/276 kBProgress (5): 102/164 kB | 79 kB | 61/105 kB | 32/109 kB | 4.1/276 kBProgress (5): 106/164 kB | 79 kB | 61/105 kB | 32/109 kB | 4.1/276 kBProgress (5): 106/164 kB | 79 kB | 61/105 kB | 32/109 kB | 7.7/276 kBProgress (5): 110/164 kB | 79 kB | 61/105 kB | 32/109 kB | 7.7/276 kBProgress (5): 110/164 kB | 79 kB | 65/105 kB | 32/109 kB | 7.7/276 kBProgress (5): 110/164 kB | 79 kB | 65/105 kB | 36/109 kB | 7.7/276 kBProgress (5): 114/164 kB | 79 kB | 65/105 kB | 36/109 kB | 7.7/276 kB                                                                     Downloaded from central: https://repo.maven.apache.org/maven2/org/apache/maven/maven-artifact/2.0/maven-artifact-2.0.jar (79 kB at 960 kB/s)
Downloading from central: https://repo.maven.apache.org/maven2/org/apache/httpcomponents/httpcore/4.0-beta3/httpcore-4.0-beta3.jar
Progress (4): 114/164 kB | 65/105 kB | 36/109 kB | 12/276 kBProgress (4): 118/164 kB | 65/105 kB | 36/109 kB | 12/276 kBProgress (4): 118/164 kB | 69/105 kB | 36/109 kB | 12/276 kBProgress (4): 118/164 kB | 69/105 kB | 40/109 kB | 12/276 kBProgress (4): 118/164 kB | 73/105 kB | 40/109 kB | 12/276 kBProgress (4): 122/164 kB | 73/105 kB | 40/109 kB | 12/276 kBProgress (4): 122/164 kB | 73/105 kB | 40/109 kB | 16/276 kBProgress (4): 126/164 kB | 73/105 kB | 40/109 kB | 16/276 kBProgress (4): 126/164 kB | 77/105 kB | 40/109 kB | 16/276 kBProgress (4): 126/164 kB | 77/105 kB | 45/109 kB | 16/276 kBProgress (4): 126/164 kB | 81/105 kB | 45/109 kB | 16/276 kBProgress (4): 131/164 kB | 81/105 kB | 45/109 kB | 16/276 kBProgress (4): 131/164 kB | 81/105 kB | 45/109 kB | 20/276 kBProgress (4): 131/164 kB | 81/105 kB | 49/109 kB | 20/276 kBProgress (4): 131/164 kB | 81/105 kB | 49/109 kB | 24/276 kBProgress (4): 131/164 kB | 81/105 kB | 49/109 kB | 28/276 kBProgress (4): 131/164 kB | 85/105 kB | 49/109 kB | 28/276 kBProgress (4): 131/164 kB | 85/105 kB | 49/109 kB | 32/276 kBProgress (4): 131/164 kB | 90/105 kB | 49/109 kB | 32/276 kBProgress (4): 135/164 kB | 90/105 kB | 49/109 kB | 32/276 kBProgress (4): 135/164 kB | 90/105 kB | 53/109 kB | 32/276 kBProgress (4): 135/164 kB | 94/105 kB | 53/109 kB | 32/276 kBProgress (4): 135/164 kB | 94/105 kB | 53/109 kB | 36/276 kBProgress (4): 135/164 kB | 94/105 kB | 57/109 kB | 36/276 kBProgress (4): 139/164 kB | 94/105 kB | 57/109 kB | 36/276 kBProgress (4): 139/164 kB | 94/105 kB | 61/109 kB | 36/276 kBProgress (4): 139/164 kB | 94/105 kB | 61/109 kB | 40/276 kBProgress (4): 139/164 kB | 98/105 kB | 61/109 kB | 40/276 kBProgress (4): 139/164 kB | 98/105 kB | 61/109 kB | 45/276 kBProgress (4): 139/164 kB | 98/105 kB | 65/109 kB | 45/276 kBProgress (4): 143/164 kB | 98/105 kB | 65/109 kB | 45/276 kBProgress (4): 143/164 kB | 102/105 kB | 65/109 kB | 45/276 kBProgress (4): 143/164 kB | 102/105 kB | 65/109 kB | 49/276 kBProgress (4): 143/164 kB | 105 kB | 65/109 kB | 49/276 kB    Progress (4): 147/164 kB | 105 kB | 65/109 kB | 49/276 kBProgress (4): 147/164 kB | 105 kB | 69/109 kB | 49/276 kBProgress (5): 147/164 kB | 105 kB | 69/109 kB | 49/276 kB | 4.1/172 kBProgress (5): 147/164 kB | 105 kB | 73/109 kB | 49/276 kB | 4.1/172 kBProgress (5): 147/164 kB | 105 kB | 73/109 kB | 53/276 kB | 4.1/172 kBProgress (5): 147/164 kB | 105 kB | 77/109 kB | 53/276 kB | 4.1/172 kBProgress (5): 147/164 kB | 105 kB | 77/109 kB | 53/276 kB | 8.2/172 kBProgress (5): 147/164 kB | 105 kB | 81/109 kB | 53/276 kB | 8.2/172 kBProgress (5): 147/164 kB | 105 kB | 81/109 kB | 57/276 kB | 8.2/172 kBProgress (5): 151/164 kB | 105 kB | 81/109 kB | 57/276 kB | 8.2/172 kBProgress (5): 151/164 kB | 105 kB | 81/109 kB | 61/276 kB | 8.2/172 kBProgress (5): 151/164 kB | 105 kB | 81/109 kB | 61/276 kB | 12/172 kB Progress (5): 151/164 kB | 105 kB | 81/109 kB | 65/276 kB | 12/172 kBProgress (5): 155/164 kB | 105 kB | 81/109 kB | 65/276 kB | 12/172 kBProgress (5): 155/164 kB | 105 kB | 81/109 kB | 65/276 kB | 16/172 kBProgress (5): 155/164 kB | 105 kB | 85/109 kB | 65/276 kB | 16/172 kBProgress (5): 159/164 kB | 105 kB | 85/109 kB | 65/276 kB | 16/172 kBProgress (5): 159/164 kB | 105 kB | 90/109 kB | 65/276 kB | 16/172 kBProgress (5): 159/164 kB | 105 kB | 90/109 kB | 69/276 kB | 16/172 kBProgress (5): 163/164 kB | 105 kB | 90/109 kB | 69/276 kB | 16/172 kBProgress (5): 163/164 kB | 105 kB | 90/109 kB | 73/276 kB | 16/172 kBProgress (5): 163/164 kB | 105 kB | 90/109 kB | 73/276 kB | 20/172 kBProgress (5): 163/164 kB | 105 kB | 94/109 kB | 73/276 kB | 20/172 kBProgress (5): 163/164 kB | 105 kB | 94/109 kB | 73/276 kB | 25/172 kBProgress (5): 163/164 kB | 105 kB | 94/109 kB | 77/276 kB | 25/172 kBProgress (5): 164 kB | 105 kB | 94/109 kB | 77/276 kB | 25/172 kB    Progress (5): 164 kB | 105 kB | 94/109 kB | 81/276 kB | 25/172 kBProgress (5): 164 kB | 105 kB | 94/109 kB | 81/276 kB | 29/172 kBProgress (5): 164 kB | 105 kB | 98/109 kB | 81/276 kB | 29/172 kBProgress (5): 164 kB | 105 kB | 98/109 kB | 81/276 kB | 33/172 kBProgress (5): 164 kB | 105 kB | 98/109 kB | 85/276 kB | 33/172 kB                                                                 Downloaded from central: https://repo.maven.apache.org/maven2/org/apache/maven/maven-project/2.0/maven-project-2.0.jar (105 kB at 1.1 MB/s)
Progress (4): 164 kB | 98/109 kB | 85/276 kB | 37/172 kBProgress (4): 164 kB | 98/109 kB | 90/276 kB | 37/172 kBProgress (4): 164 kB | 102/109 kB | 90/276 kB | 37/172 kBProgress (4): 164 kB | 102/109 kB | 94/276 kB | 37/172 kBProgress (4): 164 kB | 102/109 kB | 94/276 kB | 41/172 kB                                                         Downloading from central: https://repo.maven.apache.org/maven2/commons-logging/commons-logging/1.1.1/commons-logging-1.1.1.jar
Progress (4): 164 kB | 102/109 kB | 94/276 kB | 45/172 kBProgress (4): 164 kB | 102/109 kB | 98/276 kB | 45/172 kBProgress (4): 164 kB | 106/109 kB | 98/276 kB | 45/172 kBProgress (4): 164 kB | 106/109 kB | 98/276 kB | 49/172 kBProgress (4): 164 kB | 109 kB | 98/276 kB | 49/172 kB    Progress (4): 164 kB | 109 kB | 102/276 kB | 49/172 kBProgress (4): 164 kB | 109 kB | 106/276 kB | 49/172 kBProgress (4): 164 kB | 109 kB | 106/276 kB | 53/172 kBProgress (4): 164 kB | 109 kB | 110/276 kB | 53/172 kBProgress (4): 164 kB | 109 kB | 110/276 kB | 57/172 kBProgress (4): 164 kB | 109 kB | 114/276 kB | 57/172 kBProgress (4): 164 kB | 109 kB | 114/276 kB | 61/172 kBProgress (4): 164 kB | 109 kB | 114/276 kB | 66/172 kBProgress (4): 164 kB | 109 kB | 118/276 kB | 66/172 kBProgress (4): 164 kB | 109 kB | 122/276 kB | 66/172 kBProgress (4): 164 kB | 109 kB | 122/276 kB | 70/172 kBProgress (4): 164 kB | 109 kB | 126/276 kB | 70/172 kBProgress (4): 164 kB | 109 kB | 126/276 kB | 74/172 kB                                                      Downloaded from central: https://repo.maven.apache.org/maven2/org/codehaus/plexus/plexus-utils/1.0.4/plexus-utils-1.0.4.jar (164 kB at 1.7 MB/s)
Progress (3): 109 kB | 131/276 kB | 74/172 kB                                             Downloading from central: https://repo.maven.apache.org/maven2/commons-codec/commons-codec/1.3/commons-codec-1.3.jar
Progress (3): 109 kB | 131/276 kB | 78/172 kBProgress (3): 109 kB | 131/276 kB | 82/172 kBProgress (3): 109 kB | 135/276 kB | 82/172 kBProgress (3): 109 kB | 139/276 kB | 82/172 kBProgress (3): 109 kB | 143/276 kB | 82/172 kBProgress (3): 109 kB | 147/276 kB | 82/172 kBProgress (3): 109 kB | 147/276 kB | 86/172 kBProgress (3): 109 kB | 147/276 kB | 90/172 kBProgress (3): 109 kB | 147/276 kB | 94/172 kBProgress (3): 109 kB | 147/276 kB | 98/172 kBProgress (4): 109 kB | 147/276 kB | 98/172 kB | 4.1/61 kBProgress (4): 109 kB | 151/276 kB | 98/172 kB | 4.1/61 kBProgress (4): 109 kB | 151/276 kB | 98/172 kB | 7.7/61 kB                                                         Downloaded from central: https://repo.maven.apache.org/maven2/commons-io/commons-io/1.4/commons-io-1.4.jar (109 kB at 1.1 MB/s)
Progress (3): 151/276 kB | 102/172 kB | 7.7/61 kBProgress (3): 151/276 kB | 102/172 kB | 12/61 kB Progress (3): 155/276 kB | 102/172 kB | 12/61 kBProgress (3): 155/276 kB | 102/172 kB | 16/61 kBProgress (3): 155/276 kB | 106/172 kB | 16/61 kB                                                Downloading from central: https://repo.maven.apache.org/maven2/org/codehaus/plexus/plexus-archiver/1.2/plexus-archiver-1.2.jar
Progress (3): 155/276 kB | 111/172 kB | 16/61 kBProgress (3): 159/276 kB | 111/172 kB | 16/61 kBProgress (3): 159/276 kB | 111/172 kB | 20/61 kBProgress (3): 159/276 kB | 115/172 kB | 20/61 kBProgress (3): 159/276 kB | 115/172 kB | 24/61 kBProgress (3): 163/276 kB | 115/172 kB | 24/61 kBProgress (3): 163/276 kB | 115/172 kB | 28/61 kBProgress (3): 163/276 kB | 115/172 kB | 32/61 kBProgress (3): 163/276 kB | 119/172 kB | 32/61 kBProgress (3): 163/276 kB | 123/172 kB | 32/61 kBProgress (3): 167/276 kB | 123/172 kB | 32/61 kBProgress (3): 167/276 kB | 127/172 kB | 32/61 kBProgress (3): 171/276 kB | 127/172 kB | 32/61 kBProgress (3): 171/276 kB | 131/172 kB | 32/61 kBProgress (3): 171/276 kB | 131/172 kB | 36/61 kBProgress (4): 171/276 kB | 131/172 kB | 36/61 kB | 4.1/47 kBProgress (4): 176/276 kB | 131/172 kB | 36/61 kB | 4.1/47 kBProgress (4): 176/276 kB | 131/172 kB | 36/61 kB | 7.7/47 kBProgress (4): 176/276 kB | 131/172 kB | 40/61 kB | 7.7/47 kBProgress (4): 176/276 kB | 135/172 kB | 40/61 kB | 7.7/47 kBProgress (4): 176/276 kB | 135/172 kB | 40/61 kB | 12/47 kB Progress (4): 180/276 kB | 135/172 kB | 40/61 kB | 12/47 kBProgress (4): 180/276 kB | 135/172 kB | 40/61 kB | 16/47 kBProgress (4): 180/276 kB | 139/172 kB | 40/61 kB | 16/47 kBProgress (4): 180/276 kB | 139/172 kB | 45/61 kB | 16/47 kBProgress (4): 180/276 kB | 143/172 kB | 45/61 kB | 16/47 kBProgress (4): 180/276 kB | 143/172 kB | 49/61 kB | 16/47 kBProgress (4): 180/276 kB | 147/172 kB | 49/61 kB | 16/47 kBProgress (4): 184/276 kB | 147/172 kB | 49/61 kB | 16/47 kBProgress (4): 184/276 kB | 147/172 kB | 49/61 kB | 20/47 kBProgress (4): 188/276 kB | 147/172 kB | 49/61 kB | 20/47 kBProgress (4): 188/276 kB | 147/172 kB | 49/61 kB | 24/47 kBProgress (4): 188/276 kB | 152/172 kB | 49/61 kB | 24/47 kBProgress (4): 188/276 kB | 152/172 kB | 53/61 kB | 24/47 kBProgress (4): 188/276 kB | 156/172 kB | 53/61 kB | 24/47 kBProgress (4): 188/276 kB | 156/172 kB | 53/61 kB | 28/47 kBProgress (4): 192/276 kB | 156/172 kB | 53/61 kB | 28/47 kBProgress (4): 192/276 kB | 156/172 kB | 53/61 kB | 32/47 kBProgress (4): 192/276 kB | 160/172 kB | 53/61 kB | 32/47 kBProgress (4): 192/276 kB | 160/172 kB | 57/61 kB | 32/47 kBProgress (4): 192/276 kB | 164/172 kB | 57/61 kB | 32/47 kBProgress (4): 196/276 kB | 164/172 kB | 57/61 kB | 32/47 kBProgress (4): 196/276 kB | 164/172 kB | 61 kB | 32/47 kB   Progress (4): 196/276 kB | 164/172 kB | 61 kB | 36/47 kBProgress (5): 196/276 kB | 164/172 kB | 61 kB | 36/47 kB | 4.1/182 kBProgress (5): 196/276 kB | 164/172 kB | 61 kB | 40/47 kB | 4.1/182 kBProgress (5): 196/276 kB | 168/172 kB | 61 kB | 40/47 kB | 4.1/182 kBProgress (5): 196/276 kB | 168/172 kB | 61 kB | 45/47 kB | 4.1/182 kBProgress (5): 200/276 kB | 168/172 kB | 61 kB | 45/47 kB | 4.1/182 kBProgress (5): 200/276 kB | 168/172 kB | 61 kB | 45/47 kB | 7.7/182 kBProgress (5): 204/276 kB | 168/172 kB | 61 kB | 45/47 kB | 7.7/182 kBProgress (5): 204/276 kB | 168/172 kB | 61 kB | 47 kB | 7.7/182 kB   Progress (5): 204/276 kB | 172/172 kB | 61 kB | 47 kB | 7.7/182 kBProgress (5): 208/276 kB | 172/172 kB | 61 kB | 47 kB | 7.7/182 kBProgress (5): 208/276 kB | 172/172 kB | 61 kB | 47 kB | 12/182 kB Progress (5): 212/276 kB | 172/172 kB | 61 kB | 47 kB | 12/182 kBProgress (5): 212/276 kB | 172 kB | 61 kB | 47 kB | 12/182 kB    Progress (5): 212/276 kB | 172 kB | 61 kB | 47 kB | 16/182 kBProgress (5): 217/276 kB | 172 kB | 61 kB | 47 kB | 16/182 kBProgress (5): 221/276 kB | 172 kB | 61 kB | 47 kB | 16/182 kBProgress (5): 221/276 kB | 172 kB | 61 kB | 47 kB | 20/182 kBProgress (5): 225/276 kB | 172 kB | 61 kB | 47 kB | 20/182 kBProgress (5): 225/276 kB | 172 kB | 61 kB | 47 kB | 24/182 kBProgress (5): 229/276 kB | 172 kB | 61 kB | 47 kB | 24/182 kBProgress (5): 229/276 kB | 172 kB | 61 kB | 47 kB | 28/182 kBProgress (5): 229/276 kB | 172 kB | 61 kB | 47 kB | 32/182 kBProgress (5): 233/276 kB | 172 kB | 61 kB | 47 kB | 32/182 kBProgress (5): 237/276 kB | 172 kB | 61 kB | 47 kB | 32/182 kBProgress (5): 241/276 kB | 172 kB | 61 kB | 47 kB | 32/182 kBProgress (5): 241/276 kB | 172 kB | 61 kB | 47 kB | 36/182 kBProgress (5): 245/276 kB | 172 kB | 61 kB | 47 kB | 36/182 kB                                                             Downloaded from central: https://repo.maven.apache.org/maven2/commons-logging/commons-logging/1.1.1/commons-logging-1.1.1.jar (61 kB at 523 kB/s)
Downloading from central: https://repo.maven.apache.org/maven2/org/codehaus/plexus/plexus-io/1.0.1/plexus-io-1.0.1.jar
Progress (4): 245/276 kB | 172 kB | 47 kB | 40/182 kBProgress (4): 249/276 kB | 172 kB | 47 kB | 40/182 kBProgress (4): 249/276 kB | 172 kB | 47 kB | 45/182 kBProgress (4): 253/276 kB | 172 kB | 47 kB | 45/182 kBProgress (4): 253/276 kB | 172 kB | 47 kB | 49/182 kBProgress (4): 258/276 kB | 172 kB | 47 kB | 49/182 kBProgress (4): 262/276 kB | 172 kB | 47 kB | 49/182 kB                                                     Downloaded from central: https://repo.maven.apache.org/maven2/commons-codec/commons-codec/1.3/commons-codec-1.3.jar (47 kB at 396 kB/s)
Progress (3): 262/276 kB | 172 kB | 53/182 kBProgress (3): 266/276 kB | 172 kB | 53/182 kBProgress (3): 266/276 kB | 172 kB | 57/182 kBProgress (3): 270/276 kB | 172 kB | 57/182 kB                                             Downloaded from central: https://repo.maven.apache.org/maven2/org/apache/httpcomponents/httpcore/4.0-beta3/httpcore-4.0-beta3.jar (172 kB at 1.4 MB/s)
Progress (2): 270/276 kB | 61/182 kBProgress (2): 274/276 kB | 61/182 kBProgress (2): 274/276 kB | 65/182 kBProgress (2): 276 kB | 65/182 kB    Progress (2): 276 kB | 69/182 kBProgress (2): 276 kB | 73/182 kBProgress (2): 276 kB | 77/182 kBProgress (2): 276 kB | 81/182 kBProgress (2): 276 kB | 85/182 kBProgress (2): 276 kB | 90/182 kBProgress (2): 276 kB | 94/182 kBProgress (2): 276 kB | 98/182 kBProgress (3): 276 kB | 98/182 kB | 4.1/51 kBProgress (3): 276 kB | 102/182 kB | 4.1/51 kBProgress (3): 276 kB | 102/182 kB | 8.2/51 kBProgress (3): 276 kB | 106/182 kB | 8.2/51 kBProgress (3): 276 kB | 106/182 kB | 12/51 kB Progress (3): 276 kB | 110/182 kB | 12/51 kBProgress (3): 276 kB | 110/182 kB | 16/51 kBProgress (3): 276 kB | 114/182 kB | 16/51 kBProgress (3): 276 kB | 114/182 kB | 20/51 kBProgress (3): 276 kB | 118/182 kB | 20/51 kBProgress (3): 276 kB | 118/182 kB | 25/51 kBProgress (3): 276 kB | 122/182 kB | 25/51 kBProgress (3): 276 kB | 122/182 kB | 29/51 kBProgress (3): 276 kB | 126/182 kB | 29/51 kBProgress (3): 276 kB | 126/182 kB | 33/51 kBProgress (3): 276 kB | 131/182 kB | 33/51 kB                                            Downloaded from central: https://repo.maven.apache.org/maven2/org/apache/httpcomponents/httpclient/4.0-beta2/httpclient-4.0-beta2.jar (276 kB at 2.2 MB/s)
Progress (2): 131/182 kB | 37/51 kBProgress (2): 135/182 kB | 37/51 kBProgress (2): 135/182 kB | 41/51 kBProgress (2): 139/182 kB | 41/51 kBProgress (2): 139/182 kB | 45/51 kBProgress (2): 143/182 kB | 45/51 kBProgress (2): 143/182 kB | 49/51 kBProgress (2): 147/182 kB | 49/51 kBProgress (2): 147/182 kB | 51 kB   Progress (2): 151/182 kB | 51 kBProgress (2): 155/182 kB | 51 kBProgress (2): 159/182 kB | 51 kBProgress (2): 163/182 kB | 51 kBProgress (2): 167/182 kB | 51 kBProgress (2): 171/182 kB | 51 kBProgress (2): 176/182 kB | 51 kBProgress (2): 180/182 kB | 51 kBProgress (2): 182 kB | 51 kB                                Downloaded from central: https://repo.maven.apache.org/maven2/org/codehaus/plexus/plexus-io/1.0.1/plexus-io-1.0.1.jar (51 kB at 385 kB/s)
Downloaded from central: https://repo.maven.apache.org/maven2/org/codehaus/plexus/plexus-archiver/1.2/plexus-archiver-1.2.jar (182 kB at 1.4 MB/s)
Downloading: https://www.ecma-international.org/publications/files/ECMA-ST//Office%20Open%20XML%201st%20edition%20Part%204%20(PDF).zip
org.apache.maven.wagon.ResourceDoesNotExistException: Resource missing at https://www.ecma-international.org/publications/files/ECMA-ST/Office%2520Open%2520XML%25201st%2520edition%2520Part%25204%2520(PDF).zip 404 Not Found
        at org.apache.maven.wagon.providers.http.wagon.shared.AbstractHttpClientWagon.fillInputData(AbstractHttpClientWagon.java:1185)
        at org.apache.maven.wagon.providers.http.wagon.shared.AbstractHttpClientWagon.fillInputData(AbstractHttpClientWagon.java:1138)
        at org.apache.maven.wagon.StreamWagon.getInputStream(StreamWagon.java:126)
        at org.apache.maven.wagon.StreamWagon.getIfNewer(StreamWagon.java:88)
        at org.apache.maven.wagon.StreamWagon.get(StreamWagon.java:61)
        at com.googlecode.WGet.doGet(WGet.java:218)
        at com.googlecode.WGet.execute(WGet.java:173)
        at org.apache.maven.plugin.DefaultBuildPluginManager.executeMojo(DefaultBuildPluginManager.java:137)
        at org.apache.maven.lifecycle.internal.MojoExecutor.execute(MojoExecutor.java:210)
        at org.apache.maven.lifecycle.internal.MojoExecutor.execute(MojoExecutor.java:156)
        at org.apache.maven.lifecycle.internal.MojoExecutor.execute(MojoExecutor.java:148)
        at org.apache.maven.lifecycle.internal.LifecycleModuleBuilder.buildProject(LifecycleModuleBuilder.java:117)
        at org.apache.maven.lifecycle.internal.LifecycleModuleBuilder.buildProject(LifecycleModuleBuilder.java:81)
        at org.apache.maven.lifecycle.internal.builder.singlethreaded.SingleThreadedBuilder.build(SingleThreadedBuilder.java:56)
        at org.apache.maven.lifecycle.internal.LifecycleStarter.execute(LifecycleStarter.java:128)
        at org.apache.maven.DefaultMaven.doExecute(DefaultMaven.java:305)
        at org.apache.maven.DefaultMaven.doExecute(DefaultMaven.java:192)
        at org.apache.maven.DefaultMaven.execute(DefaultMaven.java:105)
        at org.apache.maven.cli.MavenCli.execute(MavenCli.java:957)
        at org.apache.maven.cli.MavenCli.doMain(MavenCli.java:289)
        at org.apache.maven.cli.MavenCli.main(MavenCli.java:193)
        at sun.reflect.NativeMethodAccessorImpl.invoke0(Native Method)
        at sun.reflect.NativeMethodAccessorImpl.invoke(NativeMethodAccessorImpl.java:62)
        at sun.reflect.DelegatingMethodAccessorImpl.invoke(DelegatingMethodAccessorImpl.java:43)
        at java.lang.reflect.Method.invoke(Method.java:498)
        at org.codehaus.plexus.classworlds.launcher.Launcher.launchEnhanced(Launcher.java:282)
        at org.codehaus.plexus.classworlds.launcher.Launcher.launch(Launcher.java:225)
        at org.codehaus.plexus.classworlds.launcher.Launcher.mainWithExitCode(Launcher.java:406)
        at org.codehaus.plexus.classworlds.launcher.Launcher.main(Launcher.java:347)
[WARNING] Could not get content
org.apache.maven.wagon.ResourceDoesNotExistException: Resource missing at https://www.ecma-international.org/publications/files/ECMA-ST/Office%2520Open%2520XML%25201st%2520edition%2520Part%25204%2520(PDF).zip 404 Not Found
    at org.apache.maven.wagon.providers.http.wagon.shared.AbstractHttpClientWagon.fillInputData (AbstractHttpClientWagon.java:1185)
    at org.apache.maven.wagon.providers.http.wagon.shared.AbstractHttpClientWagon.fillInputData (AbstractHttpClientWagon.java:1138)
    at org.apache.maven.wagon.StreamWagon.getInputStream (StreamWagon.java:126)
    at org.apache.maven.wagon.StreamWagon.getIfNewer (StreamWagon.java:88)
    at org.apache.maven.wagon.StreamWagon.get (StreamWagon.java:61)
    at com.googlecode.WGet.doGet (WGet.java:218)
    at com.googlecode.WGet.execute (WGet.java:173)
    at org.apache.maven.plugin.DefaultBuildPluginManager.executeMojo (DefaultBuildPluginManager.java:137)
    at org.apache.maven.lifecycle.internal.MojoExecutor.execute (MojoExecutor.java:210)
    at org.apache.maven.lifecycle.internal.MojoExecutor.execute (MojoExecutor.java:156)
    at org.apache.maven.lifecycle.internal.MojoExecutor.execute (MojoExecutor.java:148)
    at org.apache.maven.lifecycle.internal.LifecycleModuleBuilder.buildProject (LifecycleModuleBuilder.java:117)
    at org.apache.maven.lifecycle.internal.LifecycleModuleBuilder.buildProject (LifecycleModuleBuilder.java:81)
    at org.apache.maven.lifecycle.internal.builder.singlethreaded.SingleThreadedBuilder.build (SingleThreadedBuilder.java:56)
    at org.apache.maven.lifecycle.internal.LifecycleStarter.execute (LifecycleStarter.java:128)
    at org.apache.maven.DefaultMaven.doExecute (DefaultMaven.java:305)
    at org.apache.maven.DefaultMaven.doExecute (DefaultMaven.java:192)
    at org.apache.maven.DefaultMaven.execute (DefaultMaven.java:105)
    at org.apache.maven.cli.MavenCli.execute (MavenCli.java:957)
    at org.apache.maven.cli.MavenCli.doMain (MavenCli.java:289)
    at org.apache.maven.cli.MavenCli.main (MavenCli.java:193)
    at sun.reflect.NativeMethodAccessorImpl.invoke0 (Native Method)
    at sun.reflect.NativeMethodAccessorImpl.invoke (NativeMethodAccessorImpl.java:62)
    at sun.reflect.DelegatingMethodAccessorImpl.invoke (DelegatingMethodAccessorImpl.java:43)
    at java.lang.reflect.Method.invoke (Method.java:498)
    at org.codehaus.plexus.classworlds.launcher.Launcher.launchEnhanced (Launcher.java:282)
    at org.codehaus.plexus.classworlds.launcher.Launcher.launch (Launcher.java:225)
    at org.codehaus.plexus.classworlds.launcher.Launcher.mainWithExitCode (Launcher.java:406)
    at org.codehaus.plexus.classworlds.launcher.Launcher.main (Launcher.java:347)
[WARNING] Retrying (1 more)
Downloading: https://www.ecma-international.org/publications/files/ECMA-ST//Office%20Open%20XML%201st%20edition%20Part%204%20(PDF).zip
org.apache.maven.wagon.ResourceDoesNotExistException: Resource missing at https://www.ecma-international.org/publications/files/ECMA-ST/Office%2520Open%2520XML%25201st%2520edition%2520Part%25204%2520(PDF).zip 404 Not Found
        at org.apache.maven.wagon.providers.http.wagon.shared.AbstractHttpClientWagon.fillInputData(AbstractHttpClientWagon.java:1185)
        at org.apache.maven.wagon.providers.http.wagon.shared.AbstractHttpClientWagon.fillInputData(AbstractHttpClientWagon.java:1138)
        at org.apache.maven.wagon.StreamWagon.getInputStream(StreamWagon.java:126)
        at org.apache.maven.wagon.StreamWagon.getIfNewer(StreamWagon.java:88)
        at org.apache.maven.wagon.StreamWagon.get(StreamWagon.java:61)
        at com.googlecode.WGet.doGet(WGet.java:218)
        at com.googlecode.WGet.execute(WGet.java:173)
        at org.apache.maven.plugin.DefaultBuildPluginManager.executeMojo(DefaultBuildPluginManager.java:137)
        at org.apache.maven.lifecycle.internal.MojoExecutor.execute(MojoExecutor.java:210)
        at org.apache.maven.lifecycle.internal.MojoExecutor.execute(MojoExecutor.java:156)
        at org.apache.maven.lifecycle.internal.MojoExecutor.execute(MojoExecutor.java:148)
        at org.apache.maven.lifecycle.internal.LifecycleModuleBuilder.buildProject(LifecycleModuleBuilder.java:117)
        at org.apache.maven.lifecycle.internal.LifecycleModuleBuilder.buildProject(LifecycleModuleBuilder.java:81)
        at org.apache.maven.lifecycle.internal.builder.singlethreaded.SingleThreadedBuilder.build(SingleThreadedBuilder.java:56)
        at org.apache.maven.lifecycle.internal.LifecycleStarter.execute(LifecycleStarter.java:128)
        at org.apache.maven.DefaultMaven.doExecute(DefaultMaven.java:305)
        at org.apache.maven.DefaultMaven.doExecute(DefaultMaven.java:192)
        at org.apache.maven.DefaultMaven.execute(DefaultMaven.java:105)
        at org.apache.maven.cli.MavenCli.execute(MavenCli.java:957)
        at org.apache.maven.cli.MavenCli.doMain(MavenCli.java:289)
        at org.apache.maven.cli.MavenCli.main(MavenCli.java:193)
        at sun.reflect.NativeMethodAccessorImpl.invoke0(Native Method)
        at sun.reflect.NativeMethodAccessorImpl.invoke(NativeMethodAccessorImpl.java:62)
        at sun.reflect.DelegatingMethodAccessorImpl.invoke(DelegatingMethodAccessorImpl.java:43)
        at java.lang.reflect.Method.invoke(Method.java:498)
        at org.codehaus.plexus.classworlds.launcher.Launcher.launchEnhanced(Launcher.java:282)
        at org.codehaus.plexus.classworlds.launcher.Launcher.launch(Launcher.java:225)
        at org.codehaus.plexus.classworlds.launcher.Launcher.mainWithExitCode(Launcher.java:406)
        at org.codehaus.plexus.classworlds.launcher.Launcher.main(Launcher.java:347)
[WARNING] Could not get content
org.apache.maven.wagon.ResourceDoesNotExistException: Resource missing at https://www.ecma-international.org/publications/files/ECMA-ST/Office%2520Open%2520XML%25201st%2520edition%2520Part%25204%2520(PDF).zip 404 Not Found
    at org.apache.maven.wagon.providers.http.wagon.shared.AbstractHttpClientWagon.fillInputData (AbstractHttpClientWagon.java:1185)
    at org.apache.maven.wagon.providers.http.wagon.shared.AbstractHttpClientWagon.fillInputData (AbstractHttpClientWagon.java:1138)
    at org.apache.maven.wagon.StreamWagon.getInputStream (StreamWagon.java:126)
    at org.apache.maven.wagon.StreamWagon.getIfNewer (StreamWagon.java:88)
    at org.apache.maven.wagon.StreamWagon.get (StreamWagon.java:61)
    at com.googlecode.WGet.doGet (WGet.java:218)
    at com.googlecode.WGet.execute (WGet.java:173)
    at org.apache.maven.plugin.DefaultBuildPluginManager.executeMojo (DefaultBuildPluginManager.java:137)
    at org.apache.maven.lifecycle.internal.MojoExecutor.execute (MojoExecutor.java:210)
    at org.apache.maven.lifecycle.internal.MojoExecutor.execute (MojoExecutor.java:156)
    at org.apache.maven.lifecycle.internal.MojoExecutor.execute (MojoExecutor.java:148)
    at org.apache.maven.lifecycle.internal.LifecycleModuleBuilder.buildProject (LifecycleModuleBuilder.java:117)
    at org.apache.maven.lifecycle.internal.LifecycleModuleBuilder.buildProject (LifecycleModuleBuilder.java:81)
    at org.apache.maven.lifecycle.internal.builder.singlethreaded.SingleThreadedBuilder.build (SingleThreadedBuilder.java:56)
    at org.apache.maven.lifecycle.internal.LifecycleStarter.execute (LifecycleStarter.java:128)
    at org.apache.maven.DefaultMaven.doExecute (DefaultMaven.java:305)
    at org.apache.maven.DefaultMaven.doExecute (DefaultMaven.java:192)
    at org.apache.maven.DefaultMaven.execute (DefaultMaven.java:105)
    at org.apache.maven.cli.MavenCli.execute (MavenCli.java:957)
    at org.apache.maven.cli.MavenCli.doMain (MavenCli.java:289)
    at org.apache.maven.cli.MavenCli.main (MavenCli.java:193)
    at sun.reflect.NativeMethodAccessorImpl.invoke0 (Native Method)
    at sun.reflect.NativeMethodAccessorImpl.invoke (NativeMethodAccessorImpl.java:62)
    at sun.reflect.DelegatingMethodAccessorImpl.invoke (DelegatingMethodAccessorImpl.java:43)
    at java.lang.reflect.Method.invoke (Method.java:498)
    at org.codehaus.plexus.classworlds.launcher.Launcher.launchEnhanced (Launcher.java:282)
    at org.codehaus.plexus.classworlds.launcher.Launcher.launch (Launcher.java:225)
    at org.codehaus.plexus.classworlds.launcher.Launcher.mainWithExitCode (Launcher.java:406)
    at org.codehaus.plexus.classworlds.launcher.Launcher.main (Launcher.java:347)
[INFO] ------------------------------------------------------------------------
[INFO] Reactor Summary for Apache POI - the Java API for Microsoft Documents 4.1.3-SNAPSHOT:
[INFO]
[INFO] Apache POI - the Java API for Microsoft Documents .. SUCCESS [  7.859 s]
[INFO] Apache POI Main package ............................ SUCCESS [02:25 min]
[INFO] Apache POI Scratchpad package ...................... SUCCESS [ 29.386 s]
[INFO] Apache POI - Openxmlformats Schema package ......... FAILURE [  6.126 s]
[INFO] Apache POI - Openxmlformats Encryption Schema package SKIPPED
[INFO] Apache POI - Openxmlformats Security-Schema package  SKIPPED
[INFO] Apache POI OOXML package ........................... SKIPPED
[INFO] Apache POI ExcelAnt package ........................ SKIPPED
[INFO] Apache POI Examples package ........................ SKIPPED
[INFO] Apache POI integration test ........................ SKIPPED
[INFO] ------------------------------------------------------------------------
[INFO] BUILD FAILURE
[INFO] ------------------------------------------------------------------------
[INFO] Total time:  03:09 min
[INFO] Finished at: 2020-02-14T17:35:19Z
[INFO] ------------------------------------------------------------------------
[ERROR] Failed to execute goal com.googlecode.maven-download-plugin:maven-download-plugin:1.1.0:wget (download-xsds) on project poi-ooxml-schema: IO Error: Could not get content -> [Help 1]
[ERROR]
[ERROR] To see the full stack trace of the errors, re-run Maven with the -e switch.
[ERROR] Re-run Maven using the -X switch to enable full debug logging.
[ERROR]
[ERROR] For more information about the errors and possible solutions, please read the following articles:
[ERROR] [Help 1] http://cwiki.apache.org/confluence/display/MAVEN/MojoExecutionException
[ERROR]
[ERROR] After correcting the problems, you can resume the build with the command
[ERROR]   mvn <args> -rf :poi-ooxml-schema
Build step 'Invoke top-level Maven targets' marked build as failure
Recording test results

---------------------------------------------------------------------
To unsubscribe, e-mail: [hidden email]
For additional commands, e-mail: [hidden email]

Reply | Threaded
Open this post in threaded view
|

Jenkins build is back to normal : POI-DSL-Maven #1043

Apache Jenkins Server
See <https://builds.apache.org/job/POI-DSL-Maven/1043/display/redirect?page=changes>


---------------------------------------------------------------------
To unsubscribe, e-mail: [hidden email]
For additional commands, e-mail: [hidden email]