Build failed in Jenkins: POI-DSL-Maven #1016

classic Classic list List threaded Threaded
3 messages Options
Reply | Threaded
Open this post in threaded view
|

Build failed in Jenkins: POI-DSL-Maven #1016

Apache Jenkins Server
See <https://builds.apache.org/job/POI-DSL-Maven/1016/display/redirect?page=changes>

Changes:

[abearez] Error bar minus and plus as numerical data sources

[abearez] Implement error bars on scatter chart data series

[abearez] Implement error bars for bar and line charts


------------------------------------------
[...truncated 373.64 KB...]
Downloading from central: https://repo.maven.apache.org/maven2/backport-util-concurrent/backport-util-concurrent/3.1/backport-util-concurrent-3.1.pom
Progress (1): 880 B                   Downloaded from central: https://repo.maven.apache.org/maven2/backport-util-concurrent/backport-util-concurrent/3.1/backport-util-concurrent-3.1.pom (880 B at 73 kB/s)
Downloading from central: https://repo.maven.apache.org/maven2/org/apache/maven/maven-plugin-registry/2.2.1/maven-plugin-registry-2.2.1.pom
Progress (1): 1.9 kB                    Downloaded from central: https://repo.maven.apache.org/maven2/org/apache/maven/maven-plugin-registry/2.2.1/maven-plugin-registry-2.2.1.pom (1.9 kB at 161 kB/s)
Downloading from central: https://repo.maven.apache.org/maven2/org/apache/maven/maven-plugin-descriptor/2.2.1/maven-plugin-descriptor-2.2.1.pom
Progress (1): 2.1 kB                    Downloaded from central: https://repo.maven.apache.org/maven2/org/apache/maven/maven-plugin-descriptor/2.2.1/maven-plugin-descriptor-2.2.1.pom (2.1 kB at 159 kB/s)
Downloading from central: https://repo.maven.apache.org/maven2/org/apache/maven/maven-monitor/2.2.1/maven-monitor-2.2.1.pom
Progress (1): 1.3 kB                    Downloaded from central: https://repo.maven.apache.org/maven2/org/apache/maven/maven-monitor/2.2.1/maven-monitor-2.2.1.pom (1.3 kB at 97 kB/s)
Downloading from central: https://repo.maven.apache.org/maven2/org/apache/maven/shared/maven-shared-utils/0.1/maven-shared-utils-0.1.pom
Progress (1): 2.2/4.0 kBProgress (1): 4.0 kB                        Downloaded from central: https://repo.maven.apache.org/maven2/org/apache/maven/shared/maven-shared-utils/0.1/maven-shared-utils-0.1.pom (4.0 kB at 337 kB/s)
Downloading from central: https://repo.maven.apache.org/maven2/org/apache/maven/shared/maven-shared-components/18/maven-shared-components-18.pom
Progress (1): 2.2/4.9 kBProgress (1): 4.9 kB                        Downloaded from central: https://repo.maven.apache.org/maven2/org/apache/maven/shared/maven-shared-components/18/maven-shared-components-18.pom (4.9 kB at 411 kB/s)
Downloading from central: https://repo.maven.apache.org/maven2/org/apache/maven/maven-parent/22/maven-parent-22.pom
Progress (1): 2.2/30 kBProgress (1): 5.0/30 kBProgress (1): 7.8/30 kBProgress (1): 11/30 kB Progress (1): 13/30 kBProgress (1): 16/30 kBProgress (1): 19/30 kBProgress (1): 21/30 kBProgress (1): 24/30 kBProgress (1): 27/30 kBProgress (1): 30/30 kBProgress (1): 30 kB                      Downloaded from central: https://repo.maven.apache.org/maven2/org/apache/maven/maven-parent/22/maven-parent-22.pom (30 kB at 2.1 MB/s)
Downloading from central: https://repo.maven.apache.org/maven2/org/apache/apache/11/apache-11.pom
Progress (1): 2.2/15 kBProgress (1): 5.0/15 kBProgress (1): 7.8/15 kBProgress (1): 11/15 kB Progress (1): 13/15 kBProgress (1): 15 kB                      Downloaded from central: https://repo.maven.apache.org/maven2/org/apache/apache/11/apache-11.pom (15 kB at 1.1 MB/s)
Downloading from central: https://repo.maven.apache.org/maven2/org/codehaus/plexus/plexus-java/0.9.10/plexus-java-0.9.10.pom
Progress (1): 2.2/5.1 kBProgress (1): 5.0/5.1 kBProgress (1): 5.1 kB                        Downloaded from central: https://repo.maven.apache.org/maven2/org/codehaus/plexus/plexus-java/0.9.10/plexus-java-0.9.10.pom (5.1 kB at 365 kB/s)
Downloading from central: https://repo.maven.apache.org/maven2/org/codehaus/plexus/plexus-languages/0.9.10/plexus-languages-0.9.10.pom
Progress (1): 2.2/4.1 kBProgress (1): 4.1 kB                        Downloaded from central: https://repo.maven.apache.org/maven2/org/codehaus/plexus/plexus-languages/0.9.10/plexus-languages-0.9.10.pom (4.1 kB at 318 kB/s)
Downloading from central: https://repo.maven.apache.org/maven2/org/ow2/asm/asm/6.2/asm-6.2.pom
Progress (1): 2.2/2.9 kBProgress (1): 2.9 kB                        Downloaded from central: https://repo.maven.apache.org/maven2/org/ow2/asm/asm/6.2/asm-6.2.pom (2.9 kB at 226 kB/s)
Downloading from central: https://repo.maven.apache.org/maven2/com/thoughtworks/qdox/qdox/2.0-M9/qdox-2.0-M9.pom
Progress (1): 2.2/16 kBProgress (1): 5.0/16 kBProgress (1): 7.8/16 kBProgress (1): 11/16 kB Progress (1): 13/16 kBProgress (1): 16 kB                      Downloaded from central: https://repo.maven.apache.org/maven2/com/thoughtworks/qdox/qdox/2.0-M9/qdox-2.0-M9.pom (16 kB at 1.1 MB/s)
Downloading from central: https://repo.maven.apache.org/maven2/org/sonatype/oss/oss-parent/9/oss-parent-9.pom
Progress (1): 2.2/6.6 kBProgress (1): 5.0/6.6 kBProgress (1): 6.6 kB                        Downloaded from central: https://repo.maven.apache.org/maven2/org/sonatype/oss/oss-parent/9/oss-parent-9.pom (6.6 kB at 505 kB/s)
Downloading from central: https://repo.maven.apache.org/maven2/org/codehaus/plexus/plexus-compiler-api/2.8.4/plexus-compiler-api-2.8.4.pom
Progress (1): 867 B                   Downloaded from central: https://repo.maven.apache.org/maven2/org/codehaus/plexus/plexus-compiler-api/2.8.4/plexus-compiler-api-2.8.4.pom (867 B at 79 kB/s)
Downloading from central: https://repo.maven.apache.org/maven2/org/codehaus/plexus/plexus-compiler/2.8.4/plexus-compiler-2.8.4.pom
Progress (1): 2.2/6.0 kBProgress (1): 5.0/6.0 kBProgress (1): 6.0 kB                        Downloaded from central: https://repo.maven.apache.org/maven2/org/codehaus/plexus/plexus-compiler/2.8.4/plexus-compiler-2.8.4.pom (6.0 kB at 402 kB/s)
Downloading from central: https://repo.maven.apache.org/maven2/org/codehaus/plexus/plexus-components/4.0/plexus-components-4.0.pom
Progress (1): 2.2/2.7 kBProgress (1): 2.7 kB                        Downloaded from central: https://repo.maven.apache.org/maven2/org/codehaus/plexus/plexus-components/4.0/plexus-components-4.0.pom (2.7 kB at 221 kB/s)
Downloading from central: https://repo.maven.apache.org/maven2/org/codehaus/plexus/plexus-compiler-manager/2.8.4/plexus-compiler-manager-2.8.4.pom
Progress (1): 692 B                   Downloaded from central: https://repo.maven.apache.org/maven2/org/codehaus/plexus/plexus-compiler-manager/2.8.4/plexus-compiler-manager-2.8.4.pom (692 B at 63 kB/s)
Downloading from central: https://repo.maven.apache.org/maven2/org/codehaus/plexus/plexus-compiler-javac/2.8.4/plexus-compiler-javac-2.8.4.pom
Progress (1): 771 B                   Downloaded from central: https://repo.maven.apache.org/maven2/org/codehaus/plexus/plexus-compiler-javac/2.8.4/plexus-compiler-javac-2.8.4.pom (771 B at 64 kB/s)
Downloading from central: https://repo.maven.apache.org/maven2/org/codehaus/plexus/plexus-compilers/2.8.4/plexus-compilers-2.8.4.pom
Progress (1): 1.3 kB                    Downloaded from central: https://repo.maven.apache.org/maven2/org/codehaus/plexus/plexus-compilers/2.8.4/plexus-compilers-2.8.4.pom (1.3 kB at 103 kB/s)
Downloading from central: https://repo.maven.apache.org/maven2/org/apache/maven/shared/maven-shared-incremental/1.1/maven-shared-incremental-1.1.jar
Downloading from central: https://repo.maven.apache.org/maven2/org/codehaus/plexus/plexus-java/0.9.10/plexus-java-0.9.10.jar
Downloading from central: https://repo.maven.apache.org/maven2/com/thoughtworks/qdox/qdox/2.0-M9/qdox-2.0-M9.jar
Downloading from central: https://repo.maven.apache.org/maven2/org/ow2/asm/asm/6.2/asm-6.2.jar
Downloading from central: https://repo.maven.apache.org/maven2/org/codehaus/plexus/plexus-compiler-api/2.8.4/plexus-compiler-api-2.8.4.jar
Progress (1): 2.2/14 kBProgress (2): 2.2/14 kB | 2.2/39 kBProgress (2): 5.0/14 kB | 2.2/39 kBProgress (2): 5.0/14 kB | 5.0/39 kBProgress (3): 5.0/14 kB | 5.0/39 kB | 2.2/111 kBProgress (3): 5.0/14 kB | 7.7/39 kB | 2.2/111 kBProgress (4): 5.0/14 kB | 7.7/39 kB | 2.2/111 kB | 2.2/27 kBProgress (4): 5.0/14 kB | 10/39 kB | 2.2/111 kB | 2.2/27 kB Progress (4): 5.0/14 kB | 10/39 kB | 5.0/111 kB | 2.2/27 kBProgress (4): 7.7/14 kB | 10/39 kB | 5.0/111 kB | 2.2/27 kBProgress (4): 7.7/14 kB | 13/39 kB | 5.0/111 kB | 2.2/27 kBProgress (5): 7.7/14 kB | 13/39 kB | 5.0/111 kB | 2.2/27 kB | 2.2/317 kBProgress (5): 7.7/14 kB | 13/39 kB | 5.0/111 kB | 5.0/27 kB | 2.2/317 kBProgress (5): 7.7/14 kB | 16/39 kB | 5.0/111 kB | 5.0/27 kB | 2.2/317 kBProgress (5): 10/14 kB | 16/39 kB | 5.0/111 kB | 5.0/27 kB | 2.2/317 kB Progress (5): 10/14 kB | 16/39 kB | 7.7/111 kB | 5.0/27 kB | 2.2/317 kBProgress (5): 13/14 kB | 16/39 kB | 7.7/111 kB | 5.0/27 kB | 2.2/317 kBProgress (5): 13/14 kB | 19/39 kB | 7.7/111 kB | 5.0/27 kB | 2.2/317 kBProgress (5): 13/14 kB | 19/39 kB | 7.7/111 kB | 7.7/27 kB | 2.2/317 kBProgress (5): 13/14 kB | 19/39 kB | 7.7/111 kB | 7.7/27 kB | 5.0/317 kBProgress (5): 13/14 kB | 19/39 kB | 7.7/111 kB | 10/27 kB | 5.0/317 kB Progress (5): 13/14 kB | 19/39 kB | 7.7/111 kB | 10/27 kB | 7.7/317 kBProgress (5): 13/14 kB | 21/39 kB | 7.7/111 kB | 10/27 kB | 7.7/317 kBProgress (5): 13/14 kB | 21/39 kB | 7.7/111 kB | 10/27 kB | 10/317 kB Progress (5): 14 kB | 21/39 kB | 7.7/111 kB | 10/27 kB | 10/317 kB   Progress (5): 14 kB | 21/39 kB | 7.7/111 kB | 10/27 kB | 13/317 kBProgress (5): 14 kB | 21/39 kB | 10/111 kB | 10/27 kB | 13/317 kB Progress (5): 14 kB | 21/39 kB | 10/111 kB | 10/27 kB | 16/317 kBProgress (5): 14 kB | 24/39 kB | 10/111 kB | 10/27 kB | 16/317 kBProgress (5): 14 kB | 24/39 kB | 10/111 kB | 13/27 kB | 16/317 kBProgress (5): 14 kB | 27/39 kB | 10/111 kB | 13/27 kB | 16/317 kBProgress (5): 14 kB | 27/39 kB | 10/111 kB | 13/27 kB | 19/317 kBProgress (5): 14 kB | 27/39 kB | 13/111 kB | 13/27 kB | 19/317 kBProgress (5): 14 kB | 30/39 kB | 13/111 kB | 13/27 kB | 19/317 kBProgress (5): 14 kB | 30/39 kB | 13/111 kB | 16/27 kB | 19/317 kBProgress (5): 14 kB | 32/39 kB | 13/111 kB | 16/27 kB | 19/317 kBProgress (5): 14 kB | 32/39 kB | 17/111 kB | 16/27 kB | 19/317 kBProgress (5): 14 kB | 32/39 kB | 17/111 kB | 16/27 kB | 21/317 kBProgress (5): 14 kB | 32/39 kB | 20/111 kB | 16/27 kB | 21/317 kBProgress (5): 14 kB | 35/39 kB | 20/111 kB | 16/27 kB | 21/317 kBProgress (5): 14 kB | 35/39 kB | 20/111 kB | 19/27 kB | 21/317 kBProgress (5): 14 kB | 38/39 kB | 20/111 kB | 19/27 kB | 21/317 kBProgress (5): 14 kB | 38/39 kB | 22/111 kB | 19/27 kB | 21/317 kBProgress (5): 14 kB | 38/39 kB | 22/111 kB | 19/27 kB | 24/317 kBProgress (5): 14 kB | 38/39 kB | 25/111 kB | 19/27 kB | 24/317 kBProgress (5): 14 kB | 39 kB | 25/111 kB | 19/27 kB | 24/317 kB   Progress (5): 14 kB | 39 kB | 25/111 kB | 21/27 kB | 24/317 kBProgress (5): 14 kB | 39 kB | 28/111 kB | 21/27 kB | 24/317 kBProgress (5): 14 kB | 39 kB | 28/111 kB | 24/27 kB | 24/317 kBProgress (5): 14 kB | 39 kB | 28/111 kB | 24/27 kB | 27/317 kBProgress (5): 14 kB | 39 kB | 28/111 kB | 27/27 kB | 27/317 kBProgress (5): 14 kB | 39 kB | 30/111 kB | 27/27 kB | 27/317 kBProgress (5): 14 kB | 39 kB | 30/111 kB | 27 kB | 27/317 kB   Progress (5): 14 kB | 39 kB | 30/111 kB | 27 kB | 30/317 kBProgress (5): 14 kB | 39 kB | 30/111 kB | 27 kB | 32/317 kBProgress (5): 14 kB | 39 kB | 34/111 kB | 27 kB | 32/317 kB                                                           Downloaded from central: https://repo.maven.apache.org/maven2/org/apache/maven/shared/maven-shared-incremental/1.1/maven-shared-incremental-1.1.jar (14 kB at 677 kB/s)
Progress (4): 39 kB | 34/111 kB | 27 kB | 36/317 kB                                                   Downloading from central: https://repo.maven.apache.org/maven2/org/codehaus/plexus/plexus-compiler-manager/2.8.4/plexus-compiler-manager-2.8.4.jar
Progress (4): 39 kB | 39/111 kB | 27 kB | 36/317 kBProgress (4): 39 kB | 39/111 kB | 27 kB | 40/317 kBProgress (4): 39 kB | 43/111 kB | 27 kB | 40/317 kBProgress (4): 39 kB | 43/111 kB | 27 kB | 45/317 kBProgress (4): 39 kB | 47/111 kB | 27 kB | 45/317 kBProgress (4): 39 kB | 47/111 kB | 27 kB | 49/317 kBProgress (4): 39 kB | 51/111 kB | 27 kB | 49/317 kBProgress (4): 39 kB | 51/111 kB | 27 kB | 53/317 kBProgress (4): 39 kB | 55/111 kB | 27 kB | 53/317 kBProgress (4): 39 kB | 55/111 kB | 27 kB | 57/317 kBProgress (4): 39 kB | 59/111 kB | 27 kB | 57/317 kBProgress (4): 39 kB | 59/111 kB | 27 kB | 61/317 kBProgress (4): 39 kB | 63/111 kB | 27 kB | 61/317 kBProgress (4): 39 kB | 63/111 kB | 27 kB | 65/317 kBProgress (4): 39 kB | 67/111 kB | 27 kB | 65/317 kBProgress (4): 39 kB | 67/111 kB | 27 kB | 69/317 kB                                                   Downloaded from central: https://repo.maven.apache.org/maven2/org/codehaus/plexus/plexus-java/0.9.10/plexus-java-0.9.10.jar (39 kB at 1.6 MB/s)
Downloaded from central: https://repo.maven.apache.org/maven2/org/codehaus/plexus/plexus-compiler-api/2.8.4/plexus-compiler-api-2.8.4.jar (27 kB at 1.1 MB/s)
Progress (2): 67/111 kB | 73/317 kBProgress (2): 71/111 kB | 73/317 kBProgress (2): 71/111 kB | 77/317 kB                                   Downloading from central: https://repo.maven.apache.org/maven2/org/codehaus/plexus/plexus-compiler-javac/2.8.4/plexus-compiler-javac-2.8.4.jar
Progress (3): 71/111 kB | 77/317 kB | 2.8/4.7 kBProgress (3): 71/111 kB | 81/317 kB | 2.8/4.7 kBProgress (3): 75/111 kB | 81/317 kB | 2.8/4.7 kBProgress (3): 75/111 kB | 81/317 kB | 4.7 kB    Progress (3): 80/111 kB | 81/317 kB | 4.7 kBProgress (3): 80/111 kB | 85/317 kB | 4.7 kBProgress (3): 84/111 kB | 85/317 kB | 4.7 kBProgress (3): 84/111 kB | 90/317 kB | 4.7 kBProgress (3): 88/111 kB | 90/317 kB | 4.7 kBProgress (3): 88/111 kB | 94/317 kB | 4.7 kBProgress (3): 92/111 kB | 94/317 kB | 4.7 kBProgress (3): 92/111 kB | 98/317 kB | 4.7 kBProgress (3): 96/111 kB | 98/317 kB | 4.7 kBProgress (3): 96/111 kB | 102/317 kB | 4.7 kBProgress (3): 100/111 kB | 102/317 kB | 4.7 kBProgress (3): 100/111 kB | 106/317 kB | 4.7 kBProgress (3): 104/111 kB | 106/317 kB | 4.7 kBProgress (3): 104/111 kB | 110/317 kB | 4.7 kBProgress (3): 108/111 kB | 110/317 kB | 4.7 kBProgress (3): 108/111 kB | 114/317 kB | 4.7 kBProgress (3): 111 kB | 114/317 kB | 4.7 kB    Progress (3): 111 kB | 118/317 kB | 4.7 kBProgress (3): 111 kB | 122/317 kB | 4.7 kBProgress (3): 111 kB | 126/317 kB | 4.7 kBProgress (4): 111 kB | 126/317 kB | 4.7 kB | 2.2/21 kBProgress (4): 111 kB | 131/317 kB | 4.7 kB | 2.2/21 kBProgress (4): 111 kB | 131/317 kB | 4.7 kB | 5.0/21 kBProgress (4): 111 kB | 131/317 kB | 4.7 kB | 7.7/21 kBProgress (4): 111 kB | 135/317 kB | 4.7 kB | 7.7/21 kBProgress (4): 111 kB | 135/317 kB | 4.7 kB | 10/21 kB Progress (4): 111 kB | 139/317 kB | 4.7 kB | 10/21 kB                                                     Downloaded from central: https://repo.maven.apache.org/maven2/org/codehaus/plexus/plexus-compiler-manager/2.8.4/plexus-compiler-manager-2.8.4.jar (4.7 kB at 147 kB/s)
Progress (3): 111 kB | 143/317 kB | 10/21 kBProgress (3): 111 kB | 143/317 kB | 13/21 kBProgress (3): 111 kB | 147/317 kB | 13/21 kBProgress (3): 111 kB | 147/317 kB | 16/21 kBProgress (3): 111 kB | 147/317 kB | 19/21 kBProgress (3): 111 kB | 147/317 kB | 21 kB   Progress (3): 111 kB | 151/317 kB | 21 kBProgress (3): 111 kB | 155/317 kB | 21 kBProgress (3): 111 kB | 159/317 kB | 21 kBProgress (3): 111 kB | 163/317 kB | 21 kBProgress (3): 111 kB | 167/317 kB | 21 kB                                         Downloaded from central: https://repo.maven.apache.org/maven2/org/ow2/asm/asm/6.2/asm-6.2.jar (111 kB at 3.2 MB/s)
Progress (2): 171/317 kB | 21 kBProgress (2): 176/317 kB | 21 kBProgress (2): 180/317 kB | 21 kBProgress (2): 184/317 kB | 21 kBProgress (2): 188/317 kB | 21 kBProgress (2): 192/317 kB | 21 kBProgress (2): 196/317 kB | 21 kBProgress (2): 200/317 kB | 21 kBProgress (2): 204/317 kB | 21 kBProgress (2): 208/317 kB | 21 kBProgress (2): 212/317 kB | 21 kBProgress (2): 217/317 kB | 21 kBProgress (2): 221/317 kB | 21 kBProgress (2): 225/317 kB | 21 kBProgress (2): 229/317 kB | 21 kB                                Downloaded from central: https://repo.maven.apache.org/maven2/org/codehaus/plexus/plexus-compiler-javac/2.8.4/plexus-compiler-javac-2.8.4.jar (21 kB at 546 kB/s)
Progress (1): 233/317 kBProgress (1): 237/317 kBProgress (1): 241/317 kBProgress (1): 245/317 kBProgress (1): 249/317 kBProgress (1): 253/317 kBProgress (1): 258/317 kBProgress (1): 262/317 kBProgress (1): 266/317 kBProgress (1): 270/317 kBProgress (1): 274/317 kBProgress (1): 278/317 kBProgress (1): 282/317 kBProgress (1): 286/317 kBProgress (1): 290/317 kBProgress (1): 294/317 kBProgress (1): 298/317 kBProgress (1): 303/317 kBProgress (1): 307/317 kBProgress (1): 311/317 kBProgress (1): 315/317 kBProgress (1): 317 kB                        Downloaded from central: https://repo.maven.apache.org/maven2/com/thoughtworks/qdox/qdox/2.0-M9/qdox-2.0-M9.jar (317 kB at 6.2 MB/s)
[INFO] Changes detected - recompiling the module!
[INFO] Compiling 1245 source files to <https://builds.apache.org/job/POI-DSL-Maven/ws/sonar/main/target/classes>
[INFO] <https://builds.apache.org/job/POI-DSL-Maven/ws/sonar/main/src/main/java/org/apache/poi/ss/usermodel/Chart.java>: Some input files use or override a deprecated API.
[INFO] <https://builds.apache.org/job/POI-DSL-Maven/ws/sonar/main/src/main/java/org/apache/poi/ss/usermodel/Chart.java>: Recompile with -Xlint:deprecation for details.
[INFO] <https://builds.apache.org/job/POI-DSL-Maven/ws/sonar/main/src/main/java/org/apache/poi/util/GenericRecordUtil.java>: Some input files use unchecked or unsafe operations.
[INFO] <https://builds.apache.org/job/POI-DSL-Maven/ws/sonar/main/src/main/java/org/apache/poi/util/GenericRecordUtil.java>: Recompile with -Xlint:unchecked for details.
[INFO]
[INFO] --- maven-resources-plugin:3.1.0:copy-resources (copy-tests) @ poi-main ---
[INFO] Using 'UTF-8' encoding to copy filtered resources.
[INFO] Copying 552 resources
[INFO]
[INFO] --- maven-resources-plugin:3.1.0:testResources (default-testResources) @ poi-main ---
[INFO] Using 'UTF-8' encoding to copy filtered resources.
[INFO] skip non existing resourceDirectory <https://builds.apache.org/job/POI-DSL-Maven/ws/sonar/main/src/test/resources>
[INFO]
[INFO] --- maven-compiler-plugin:3.8.1:testCompile (default-testCompile) @ poi-main ---
[INFO] Changes detected - recompiling the module!
[INFO] Compiling 549 source files to <https://builds.apache.org/job/POI-DSL-Maven/ws/sonar/main/target/test-classes>
[INFO] <https://builds.apache.org/job/POI-DSL-Maven/ws/sonar/main/src/test/java/org/apache/poi/hssf/usermodel/TestHSSFOptimiser.java>: Some input files use or override a deprecated API.
[INFO] <https://builds.apache.org/job/POI-DSL-Maven/ws/sonar/main/src/test/java/org/apache/poi/hssf/usermodel/TestHSSFOptimiser.java>: Recompile with -Xlint:deprecation for details.
[INFO]
[INFO] --- maven-surefire-plugin:3.0.0-M4:test (default-test) @ poi-main ---
Downloading from central: https://repo.maven.apache.org/maven2/org/apache/maven/surefire/surefire-junit47/3.0.0-M4/surefire-junit47-3.0.0-M4.pom
Progress (1): 2.2/8.3 kBProgress (1): 5.0/8.3 kBProgress (1): 7.8/8.3 kBProgress (1): 8.3 kB                        Downloaded from central: https://repo.maven.apache.org/maven2/org/apache/maven/surefire/surefire-junit47/3.0.0-M4/surefire-junit47-3.0.0-M4.pom (8.3 kB at 491 kB/s)
Downloading from central: https://repo.maven.apache.org/maven2/org/apache/maven/surefire/surefire-providers/3.0.0-M4/surefire-providers-3.0.0-M4.pom
Progress (1): 2.2/2.5 kBProgress (1): 2.5 kB                        Downloaded from central: https://repo.maven.apache.org/maven2/org/apache/maven/surefire/surefire-providers/3.0.0-M4/surefire-providers-3.0.0-M4.pom (2.5 kB at 181 kB/s)
Downloading from central: https://repo.maven.apache.org/maven2/org/apache/maven/surefire/common-junit48/3.0.0-M4/common-junit48-3.0.0-M4.pom
Progress (1): 2.2/3.2 kBProgress (1): 3.2 kB                        Downloaded from central: https://repo.maven.apache.org/maven2/org/apache/maven/surefire/common-junit48/3.0.0-M4/common-junit48-3.0.0-M4.pom (3.2 kB at 247 kB/s)
Downloading from central: https://repo.maven.apache.org/maven2/org/apache/maven/surefire/common-junit4/3.0.0-M4/common-junit4-3.0.0-M4.pom
Progress (1): 2.2/2.9 kBProgress (1): 2.9 kB                        Downloaded from central: https://repo.maven.apache.org/maven2/org/apache/maven/surefire/common-junit4/3.0.0-M4/common-junit4-3.0.0-M4.pom (2.9 kB at 227 kB/s)
Downloading from central: https://repo.maven.apache.org/maven2/org/apache/maven/surefire/common-junit3/3.0.0-M4/common-junit3-3.0.0-M4.pom
Progress (1): 2.2/2.6 kBProgress (1): 2.6 kB                        Downloaded from central: https://repo.maven.apache.org/maven2/org/apache/maven/surefire/common-junit3/3.0.0-M4/common-junit3-3.0.0-M4.pom (2.6 kB at 200 kB/s)
Downloading from central: https://repo.maven.apache.org/maven2/org/apache/maven/surefire/surefire-api/3.0.0-M4/surefire-api-3.0.0-M4.pom
Progress (1): 2.2/5.1 kBProgress (1): 5.0/5.1 kBProgress (1): 5.1 kB                        Downloaded from central: https://repo.maven.apache.org/maven2/org/apache/maven/surefire/surefire-api/3.0.0-M4/surefire-api-3.0.0-M4.pom (5.1 kB at 367 kB/s)
Downloading from central: https://repo.maven.apache.org/maven2/org/apache/maven/surefire/surefire-logger-api/3.0.0-M4/surefire-logger-api-3.0.0-M4.pom
Progress (1): 2.2/3.6 kBProgress (1): 3.6 kB                        Downloaded from central: https://repo.maven.apache.org/maven2/org/apache/maven/surefire/surefire-logger-api/3.0.0-M4/surefire-logger-api-3.0.0-M4.pom (3.6 kB at 257 kB/s)
Downloading from central: https://repo.maven.apache.org/maven2/org/apache/maven/surefire/common-java5/3.0.0-M4/common-java5-3.0.0-M4.pom
Progress (1): 2.2/3.8 kBProgress (1): 3.8 kB                        Downloaded from central: https://repo.maven.apache.org/maven2/org/apache/maven/surefire/common-java5/3.0.0-M4/common-java5-3.0.0-M4.pom (3.8 kB at 288 kB/s)
Downloading from central: https://repo.maven.apache.org/maven2/org/apache/maven/surefire/surefire-grouper/3.0.0-M4/surefire-grouper-3.0.0-M4.pom
Progress (1): 2.2/3.1 kBProgress (1): 3.1 kB                        Downloaded from central: https://repo.maven.apache.org/maven2/org/apache/maven/surefire/surefire-grouper/3.0.0-M4/surefire-grouper-3.0.0-M4.pom (3.1 kB at 240 kB/s)
Downloading from central: https://repo.maven.apache.org/maven2/org/apache/maven/surefire/maven-surefire-common/3.0.0-M4/maven-surefire-common-3.0.0-M4.pom
Progress (1): 2.2/13 kBProgress (1): 5.0/13 kBProgress (1): 7.8/13 kBProgress (1): 11/13 kB Progress (1): 13 kB                      Downloaded from central: https://repo.maven.apache.org/maven2/org/apache/maven/surefire/maven-surefire-common/3.0.0-M4/maven-surefire-common-3.0.0-M4.pom (13 kB at 916 kB/s)
Downloading from central: https://repo.maven.apache.org/maven2/org/apache/maven/surefire/surefire-extensions-api/3.0.0-M4/surefire-extensions-api-3.0.0-M4.pom
Progress (1): 2.2/3.8 kBProgress (1): 3.8 kB                        Downloaded from central: https://repo.maven.apache.org/maven2/org/apache/maven/surefire/surefire-extensions-api/3.0.0-M4/surefire-extensions-api-3.0.0-M4.pom (3.8 kB at 321 kB/s)
Downloading from central: https://repo.maven.apache.org/maven2/org/apache/maven/surefire/surefire-booter/3.0.0-M4/surefire-booter-3.0.0-M4.pom
Progress (1): 2.2/8.0 kBProgress (1): 5.0/8.0 kBProgress (1): 7.8/8.0 kBProgress (1): 8.0 kB                        Downloaded from central: https://repo.maven.apache.org/maven2/org/apache/maven/surefire/surefire-booter/3.0.0-M4/surefire-booter-3.0.0-M4.pom (8.0 kB at 569 kB/s)
Downloading from central: https://repo.maven.apache.org/maven2/org/apache/maven/maven-toolchain/3.0-alpha-2/maven-toolchain-3.0-alpha-2.pom
Progress (1): 2.2 kB                    Downloaded from central: https://repo.maven.apache.org/maven2/org/apache/maven/maven-toolchain/3.0-alpha-2/maven-toolchain-3.0-alpha-2.pom (2.2 kB at 186 kB/s)
Downloading from central: https://repo.maven.apache.org/maven2/org/apache/maven/maven/3.0-alpha-2/maven-3.0-alpha-2.pom
Progress (1): 2.2/21 kBProgress (1): 5.0/21 kBProgress (1): 7.8/21 kBProgress (1): 11/21 kB Progress (1): 13/21 kBProgress (1): 16/21 kBProgress (1): 19/21 kBProgress (1): 21 kB                      Downloaded from central: https://repo.maven.apache.org/maven2/org/apache/maven/maven/3.0-alpha-2/maven-3.0-alpha-2.pom (21 kB at 1.6 MB/s)
Downloading from central: https://repo.maven.apache.org/maven2/org/apache/maven/shared/maven-artifact-transfer/0.11.0/maven-artifact-transfer-0.11.0.pom
Progress (1): 2.2/11 kBProgress (1): 5.0/11 kBProgress (1): 7.8/11 kBProgress (1): 11/11 kB Progress (1): 11 kB                      Downloaded from central: https://repo.maven.apache.org/maven2/org/apache/maven/shared/maven-artifact-transfer/0.11.0/maven-artifact-transfer-0.11.0.pom (11 kB at 818 kB/s)
Downloading from central: https://repo.maven.apache.org/maven2/org/apache/maven/shared/maven-shared-components/33/maven-shared-components-33.pom
Progress (1): 2.2/5.1 kBProgress (1): 5.0/5.1 kBProgress (1): 5.1 kB                        Downloaded from central: https://repo.maven.apache.org/maven2/org/apache/maven/shared/maven-shared-components/33/maven-shared-components-33.pom (5.1 kB at 392 kB/s)
Downloading from central: https://repo.maven.apache.org/maven2/org/apache/maven/shared/maven-common-artifact-filters/3.1.0/maven-common-artifact-filters-3.1.0.pom
Progress (1): 2.2/5.3 kBProgress (1): 5.0/5.3 kBProgress (1): 5.3 kB                        Downloaded from central: https://repo.maven.apache.org/maven2/org/apache/maven/shared/maven-common-artifact-filters/3.1.0/maven-common-artifact-filters-3.1.0.pom (5.3 kB at 407 kB/s)
Downloading from central: https://repo.maven.apache.org/maven2/commons-codec/commons-codec/1.11/commons-codec-1.11.pom
Progress (1): 2.2/14 kBProgress (1): 5.0/14 kBProgress (1): 7.8/14 kBProgress (1): 11/14 kB Progress (1): 13/14 kBProgress (1): 14 kB                      Downloaded from central: https://repo.maven.apache.org/maven2/commons-codec/commons-codec/1.11/commons-codec-1.11.pom (14 kB at 1.1 MB/s)
Downloading from central: https://repo.maven.apache.org/maven2/org/apache/commons/commons-parent/42/commons-parent-42.pom
Progress (1): 2.2/68 kBProgress (1): 5.0/68 kBProgress (1): 7.8/68 kBProgress (1): 11/68 kB Progress (1): 13/68 kBProgress (1): 16/68 kBProgress (1): 19/68 kBProgress (1): 21/68 kBProgress (1): 24/68 kBProgress (1): 27/68 kBProgress (1): 30/68 kBProgress (1): 32/68 kBProgress (1): 36/68 kBProgress (1): 40/68 kBProgress (1): 45/68 kBProgress (1): 49/68 kBProgress (1): 53/68 kBProgress (1): 57/68 kBProgress (1): 61/68 kBProgress (1): 65/68 kBProgress (1): 68 kB                      Downloaded from central: https://repo.maven.apache.org/maven2/org/apache/commons/commons-parent/42/commons-parent-42.pom (68 kB at 4.0 MB/s)
Downloading from central: https://repo.maven.apache.org/maven2/org/codehaus/plexus/plexus-java/1.0.3/plexus-java-1.0.3.pom
Progress (1): 2.2/4.8 kBProgress (1): 4.8 kB                        Downloaded from central: https://repo.maven.apache.org/maven2/org/codehaus/plexus/plexus-java/1.0.3/plexus-java-1.0.3.pom (4.8 kB at 30 kB/s)
Downloading from central: https://repo.maven.apache.org/maven2/org/codehaus/plexus/plexus-languages/1.0.3/plexus-languages-1.0.3.pom
Progress (1): 2.2/4.2 kBProgress (1): 4.2 kB                        Downloaded from central: https://repo.maven.apache.org/maven2/org/codehaus/plexus/plexus-languages/1.0.3/plexus-languages-1.0.3.pom (4.2 kB at 352 kB/s)
Downloading from central: https://repo.maven.apache.org/maven2/org/ow2/asm/asm/7.0/asm-7.0.pom
Progress (1): 2.2/2.9 kBProgress (1): 2.9 kB                        Downloaded from central: https://repo.maven.apache.org/maven2/org/ow2/asm/asm/7.0/asm-7.0.pom (2.9 kB at 226 kB/s)
Downloading from central: https://repo.maven.apache.org/maven2/org/apache/maven/surefire/surefire-junit47/3.0.0-M4/surefire-junit47-3.0.0-M4.jar
Downloading from central: https://repo.maven.apache.org/maven2/org/apache/maven/surefire/common-junit48/3.0.0-M4/common-junit48-3.0.0-M4.jar
Downloading from central: https://repo.maven.apache.org/maven2/org/apache/maven/surefire/common-junit3/3.0.0-M4/common-junit3-3.0.0-M4.jar
Downloading from central: https://repo.maven.apache.org/maven2/org/apache/maven/surefire/common-junit4/3.0.0-M4/common-junit4-3.0.0-M4.jar
Downloading from central: https://repo.maven.apache.org/maven2/org/apache/maven/surefire/common-java5/3.0.0-M4/common-java5-3.0.0-M4.jar
Progress (1): 2.2/92 kBProgress (1): 5.0/92 kBProgress (1): 7.7/92 kBProgress (1): 10/92 kB Progress (1): 13/92 kBProgress (1): 16/92 kBProgress (1): 19/92 kBProgress (1): 21/92 kBProgress (2): 21/92 kB | 2.2/12 kBProgress (2): 24/92 kB | 2.2/12 kBProgress (3): 24/92 kB | 2.2/12 kB | 2.2/33 kBProgress (3): 24/92 kB | 5.0/12 kB | 2.2/33 kBProgress (3): 27/92 kB | 5.0/12 kB | 2.2/33 kBProgress (4): 27/92 kB | 5.0/12 kB | 2.2/33 kB | 2.2/27 kBProgress (4): 27/92 kB | 7.7/12 kB | 2.2/33 kB | 2.2/27 kBProgress (4): 27/92 kB | 7.7/12 kB | 5.0/33 kB | 2.2/27 kBProgress (5): 27/92 kB | 7.7/12 kB | 5.0/33 kB | 2.2/27 kB | 2.2/21 kBProgress (5): 27/92 kB | 10/12 kB | 5.0/33 kB | 2.2/27 kB | 2.2/21 kB Progress (5): 27/92 kB | 10/12 kB | 5.0/33 kB | 5.0/27 kB | 2.2/21 kBProgress (5): 30/92 kB | 10/12 kB | 5.0/33 kB | 5.0/27 kB | 2.2/21 kBProgress (5): 30/92 kB | 10/12 kB | 5.0/33 kB | 7.7/27 kB | 2.2/21 kBProgress (5): 30/92 kB | 12 kB | 5.0/33 kB | 7.7/27 kB | 2.2/21 kB   Progress (5): 30/92 kB | 12 kB | 5.0/33 kB | 7.7/27 kB | 5.0/21 kBProgress (5): 30/92 kB | 12 kB | 7.7/33 kB | 7.7/27 kB | 5.0/21 kBProgress (5): 30/92 kB | 12 kB | 7.7/33 kB | 10/27 kB | 5.0/21 kB Progress (5): 30/92 kB | 12 kB | 10/33 kB | 10/27 kB | 5.0/21 kB Progress (5): 32/92 kB | 12 kB | 10/33 kB | 10/27 kB | 5.0/21 kBProgress (5): 32/92 kB | 12 kB | 13/33 kB | 10/27 kB | 5.0/21 kBProgress (5): 32/92 kB | 12 kB | 13/33 kB | 13/27 kB | 5.0/21 kBProgress (5): 32/92 kB | 12 kB | 13/33 kB | 13/27 kB | 7.7/21 kBProgress (5): 32/92 kB | 12 kB | 13/33 kB | 16/27 kB | 7.7/21 kBProgress (5): 32/92 kB | 12 kB | 16/33 kB | 16/27 kB | 7.7/21 kBProgress (5): 32/92 kB | 12 kB | 16/33 kB | 19/27 kB | 7.7/21 kBProgress (5): 32/92 kB | 12 kB | 16/33 kB | 19/27 kB | 10/21 kB Progress (5): 36/92 kB | 12 kB | 16/33 kB | 19/27 kB | 10/21 kBProgress (5): 36/92 kB | 12 kB | 16/33 kB | 21/27 kB | 10/21 kBProgress (5): 36/92 kB | 12 kB | 19/33 kB | 21/27 kB | 10/21 kBProgress (5): 40/92 kB | 12 kB | 19/33 kB | 21/27 kB | 10/21 kBProgress (5): 40/92 kB | 12 kB | 19/33 kB | 21/27 kB | 13/21 kBProgress (5): 45/92 kB | 12 kB | 19/33 kB | 21/27 kB | 13/21 kBProgress (5): 45/92 kB | 12 kB | 21/33 kB | 21/27 kB | 13/21 kBProgress (5): 45/92 kB | 12 kB | 21/33 kB | 24/27 kB | 13/21 kBProgress (5): 49/92 kB | 12 kB | 21/33 kB | 24/27 kB | 13/21 kBProgress (5): 49/92 kB | 12 kB | 21/33 kB | 27 kB | 13/21 kB   Progress (5): 49/92 kB | 12 kB | 21/33 kB | 27 kB | 16/21 kBProgress (5): 49/92 kB | 12 kB | 24/33 kB | 27 kB | 16/21 kBProgress (5): 49/92 kB | 12 kB | 24/33 kB | 27 kB | 19/21 kBProgress (5): 49/92 kB | 12 kB | 27/33 kB | 27 kB | 19/21 kBProgress (5): 53/92 kB | 12 kB | 27/33 kB | 27 kB | 19/21 kBProgress (5): 53/92 kB | 12 kB | 27/33 kB | 27 kB | 21 kB   Progress (5): 57/92 kB | 12 kB | 27/33 kB | 27 kB | 21 kBProgress (5): 57/92 kB | 12 kB | 30/33 kB | 27 kB | 21 kBProgress (5): 61/92 kB | 12 kB | 30/33 kB | 27 kB | 21 kBProgress (5): 61/92 kB | 12 kB | 32/33 kB | 27 kB | 21 kBProgress (5): 65/92 kB | 12 kB | 32/33 kB | 27 kB | 21 kBProgress (5): 65/92 kB | 12 kB | 33 kB | 27 kB | 21 kB                                                         Downloaded from central: https://repo.maven.apache.org/maven2/org/apache/maven/surefire/common-junit3/3.0.0-M4/common-junit3-3.0.0-M4.jar (12 kB at 661 kB/s)
Progress (4): 69/92 kB | 33 kB | 27 kB | 21 kB                                              Downloading from central: https://repo.maven.apache.org/maven2/org/apache/maven/surefire/surefire-grouper/3.0.0-M4/surefire-grouper-3.0.0-M4.jar
Progress (4): 73/92 kB | 33 kB | 27 kB | 21 kBProgress (4): 77/92 kB | 33 kB | 27 kB | 21 kBProgress (4): 81/92 kB | 33 kB | 27 kB | 21 kBProgress (4): 85/92 kB | 33 kB | 27 kB | 21 kBProgress (4): 90/92 kB | 33 kB | 27 kB | 21 kBProgress (4): 92 kB | 33 kB | 27 kB | 21 kB                                              Downloaded from central: https://repo.maven.apache.org/maven2/org/apache/maven/surefire/common-junit4/3.0.0-M4/common-junit4-3.0.0-M4.jar (27 kB at 1.3 MB/s)
Downloading from central: https://repo.maven.apache.org/maven2/org/apache/maven/surefire/surefire-api/3.0.0-M4/surefire-api-3.0.0-M4.jar
Downloaded from central: https://repo.maven.apache.org/maven2/org/apache/maven/surefire/common-junit48/3.0.0-M4/common-junit48-3.0.0-M4.jar (21 kB at 961 kB/s)
Downloading from central: https://repo.maven.apache.org/maven2/org/apache/maven/surefire/surefire-logger-api/3.0.0-M4/surefire-logger-api-3.0.0-M4.jar
Downloaded from central: https://repo.maven.apache.org/maven2/org/apache/maven/surefire/common-java5/3.0.0-M4/common-java5-3.0.0-M4.jar (33 kB at 1.5 MB/s)
Downloading from central: https://repo.maven.apache.org/maven2/org/apache/maven/surefire/maven-surefire-common/3.0.0-M4/maven-surefire-common-3.0.0-M4.jar
Progress (2): 92 kB | 2.2/40 kBProgress (2): 92 kB | 5.0/40 kBProgress (2): 92 kB | 7.7/40 kBProgress (2): 92 kB | 10/40 kB Progress (2): 92 kB | 13/40 kBProgress (2): 92 kB | 16/40 kBProgress (2): 92 kB | 19/40 kBProgress (2): 92 kB | 21/40 kB                              Downloaded from central: https://repo.maven.apache.org/maven2/org/apache/maven/surefire/surefire-junit47/3.0.0-M4/surefire-junit47-3.0.0-M4.jar (92 kB at 3.4 MB/s)
Progress (1): 24/40 kB                      Downloading from central: https://repo.maven.apache.org/maven2/org/apache/maven/surefire/surefire-extensions-api/3.0.0-M4/surefire-extensions-api-3.0.0-M4.jar
Progress (1): 27/40 kBProgress (1): 30/40 kBProgress (1): 32/40 kBProgress (1): 35/40 kBProgress (1): 38/40 kBProgress (2): 38/40 kB | 2.2/14 kBProgress (2): 40 kB | 2.2/14 kB   Progress (2): 40 kB | 5.0/14 kBProgress (2): 40 kB | 7.7/14 kBProgress (2): 40 kB | 10/14 kB Progress (2): 40 kB | 13/14 kBProgress (2): 40 kB | 14 kB   Progress (3): 40 kB | 14 kB | 2.2/343 kBProgress (3): 40 kB | 14 kB | 5.0/343 kBProgress (3): 40 kB | 14 kB | 7.7/343 kBProgress (3): 40 kB | 14 kB | 10/343 kB Progress (3): 40 kB | 14 kB | 13/343 kBProgress (4): 40 kB | 14 kB | 13/343 kB | 2.2/804 kBProgress (4): 40 kB | 14 kB | 16/343 kB | 2.2/804 kBProgress (4): 40 kB | 14 kB | 16/343 kB | 5.0/804 kBProgress (4): 40 kB | 14 kB | 19/343 kB | 5.0/804 kBProgress (4): 40 kB | 14 kB | 19/343 kB | 7.7/804 kBProgress (4): 40 kB | 14 kB | 21/343 kB | 7.7/804 kBProgress (4): 40 kB | 14 kB | 21/343 kB | 10/804 kB Progress (4): 40 kB | 14 kB | 24/343 kB | 10/804 kBProgress (4): 40 kB | 14 kB | 24/343 kB | 13/804 kBProgress (4): 40 kB | 14 kB | 27/343 kB | 13/804 kBProgress (4): 40 kB | 14 kB | 27/343 kB | 16/804 kBProgress (4): 40 kB | 14 kB | 30/343 kB | 16/804 kBProgress (4): 40 kB | 14 kB | 30/343 kB | 19/804 kBProgress (4): 40 kB | 14 kB | 32/343 kB | 19/804 kBProgress (4): 40 kB | 14 kB | 32/343 kB | 21/804 kBProgress (4): 40 kB | 14 kB | 32/343 kB | 24/804 kBProgress (4): 40 kB | 14 kB | 32/343 kB | 27/804 kBProgress (4): 40 kB | 14 kB | 36/343 kB | 27/804 kBProgress (5): 40 kB | 14 kB | 36/343 kB | 27/804 kB | 4.1/14 kB                                                               Downloaded from central: https://repo.maven.apache.org/maven2/org/apache/maven/surefire/surefire-grouper/3.0.0-M4/surefire-grouper-3.0.0-M4.jar (40 kB at 1.2 MB/s)
Progress (4): 14 kB | 36/343 kB | 27/804 kB | 7.7/14 kBProgress (4): 14 kB | 40/343 kB | 27/804 kB | 7.7/14 kBProgress (4): 14 kB | 40/343 kB | 30/804 kB | 7.7/14 kB                                                       Downloaded from central: https://repo.maven.apache.org/maven2/org/apache/maven/surefire/surefire-logger-api/3.0.0-M4/surefire-logger-api-3.0.0-M4.jar (14 kB at 398 kB/s)
Progress (3): 45/343 kB | 30/804 kB | 7.7/14 kBProgress (3): 45/343 kB | 30/804 kB | 12/14 kB Progress (3): 45/343 kB | 30/804 kB | 14 kB                                              Downloading from central: https://repo.maven.apache.org/maven2/org/apache/maven/surefire/surefire-booter/3.0.0-M4/surefire-booter-3.0.0-M4.jar
Progress (3): 49/343 kB | 30/804 kB | 14 kB                                           Downloading from central: https://repo.maven.apache.org/maven2/org/apache/maven/maven-toolchain/3.0-alpha-2/maven-toolchain-3.0-alpha-2.jar
Progress (3): 49/343 kB | 32/804 kB | 14 kBProgress (3): 53/343 kB | 32/804 kB | 14 kBProgress (3): 57/343 kB | 32/804 kB | 14 kBProgress (3): 61/343 kB | 32/804 kB | 14 kBProgress (3): 65/343 kB | 32/804 kB | 14 kBProgress (3): 65/343 kB | 36/804 kB | 14 kBProgress (3): 65/343 kB | 40/804 kB | 14 kBProgress (3): 65/343 kB | 45/804 kB | 14 kBProgress (3): 65/343 kB | 49/804 kB | 14 kBProgress (3): 69/343 kB | 49/804 kB | 14 kBProgress (3): 73/343 kB | 49/804 kB | 14 kBProgress (3): 77/343 kB | 49/804 kB | 14 kBProgress (3): 81/343 kB | 49/804 kB | 14 kBProgress (3): 81/343 kB | 53/804 kB | 14 kBProgress (3): 81/343 kB | 57/804 kB | 14 kBProgress (3): 81/343 kB | 61/804 kB | 14 kBProgress (3): 81/343 kB | 65/804 kB | 14 kBProgress (3): 85/343 kB | 65/804 kB | 14 kBProgress (3): 90/343 kB | 65/804 kB | 14 kBProgress (3): 94/343 kB | 65/804 kB | 14 kBProgress (3): 98/343 kB | 65/804 kB | 14 kBProgress (3): 98/343 kB | 69/804 kB | 14 kBProgress (3): 98/343 kB | 73/804 kB | 14 kBProgress (3): 98/343 kB | 77/804 kB | 14 kBProgress (3): 98/343 kB | 81/804 kB | 14 kBProgress (3): 102/343 kB | 81/804 kB | 14 kBProgress (3): 106/343 kB | 81/804 kB | 14 kBProgress (3): 110/343 kB | 81/804 kB | 14 kBProgress (3): 114/343 kB | 81/804 kB | 14 kBProgress (3): 114/343 kB | 85/804 kB | 14 kB                                            Downloaded from central: https://repo.maven.apache.org/maven2/org/apache/maven/surefire/surefire-extensions-api/3.0.0-M4/surefire-extensions-api-3.0.0-M4.jar (14 kB at 338 kB/s)
Progress (2): 114/343 kB | 90/804 kB                                    Downloading from central: https://repo.maven.apache.org/maven2/org/apache/maven/shared/maven-artifact-transfer/0.11.0/maven-artifact-transfer-0.11.0.jar
Progress (2): 118/343 kB | 90/804 kBProgress (3): 118/343 kB | 90/804 kB | 2.2/36 kBProgress (3): 118/343 kB | 94/804 kB | 2.2/36 kBProgress (4): 118/343 kB | 94/804 kB | 2.2/36 kB | 2.2/317 kBProgress (4): 122/343 kB | 94/804 kB | 2.2/36 kB | 2.2/317 kBProgress (4): 122/343 kB | 94/804 kB | 5.0/36 kB | 2.2/317 kBProgress (4): 122/343 kB | 98/804 kB | 5.0/36 kB | 2.2/317 kBProgress (4): 126/343 kB | 98/804 kB | 5.0/36 kB | 2.2/317 kBProgress (4): 126/343 kB | 98/804 kB | 5.0/36 kB | 5.0/317 kBProgress (4): 131/343 kB | 98/804 kB | 5.0/36 kB | 5.0/317 kBProgress (4): 131/343 kB | 98/804 kB | 5.0/36 kB | 7.7/317 kBProgress (4): 131/343 kB | 98/804 kB | 7.7/36 kB | 7.7/317 kBProgress (4): 131/343 kB | 102/804 kB | 7.7/36 kB | 7.7/317 kBProgress (4): 131/343 kB | 102/804 kB | 7.7/36 kB | 10/317 kB Progress (4): 131/343 kB | 106/804 kB | 7.7/36 kB | 10/317 kBProgress (4): 131/343 kB | 106/804 kB | 10/36 kB | 10/317 kB Progress (4): 131/343 kB | 110/804 kB | 10/36 kB | 10/317 kBProgress (4): 135/343 kB | 110/804 kB | 10/36 kB | 10/317 kBProgress (4): 135/343 kB | 110/804 kB | 10/36 kB | 13/317 kBProgress (4): 139/343 kB | 110/804 kB | 10/36 kB | 13/317 kBProgress (4): 139/343 kB | 110/804 kB | 13/36 kB | 13/317 kBProgress (4): 139/343 kB | 114/804 kB | 13/36 kB | 13/317 kBProgress (4): 143/343 kB | 114/804 kB | 13/36 kB | 13/317 kBProgress (4): 143/343 kB | 114/804 kB | 13/36 kB | 16/317 kBProgress (4): 147/343 kB | 114/804 kB | 13/36 kB | 16/317 kBProgress (4): 147/343 kB | 114/804 kB | 16/36 kB | 16/317 kBProgress (4): 147/343 kB | 118/804 kB | 16/36 kB | 16/317 kBProgress (4): 147/343 kB | 118/804 kB | 16/36 kB | 19/317 kBProgress (4): 147/343 kB | 122/804 kB | 16/36 kB | 19/317 kBProgress (4): 147/343 kB | 122/804 kB | 19/36 kB | 19/317 kBProgress (4): 151/343 kB | 122/804 kB | 19/36 kB | 19/317 kBProgress (4): 151/343 kB | 126/804 kB | 19/36 kB | 19/317 kBProgress (4): 151/343 kB | 126/804 kB | 19/36 kB | 21/317 kBProgress (4): 151/343 kB | 131/804 kB | 19/36 kB | 21/317 kBProgress (4): 155/343 kB | 131/804 kB | 19/36 kB | 21/317 kBProgress (4): 155/343 kB | 131/804 kB | 21/36 kB | 21/317 kBProgress (4): 159/343 kB | 131/804 kB | 21/36 kB | 21/317 kBProgress (4): 159/343 kB | 131/804 kB | 21/36 kB | 24/317 kBProgress (4): 159/343 kB | 131/804 kB | 24/36 kB | 24/317 kBProgress (4): 163/343 kB | 131/804 kB | 24/36 kB | 24/317 kBProgress (4): 163/343 kB | 131/804 kB | 24/36 kB | 27/317 kBProgress (4): 163/343 kB | 135/804 kB | 24/36 kB | 27/317 kBProgress (4): 163/343 kB | 135/804 kB | 27/36 kB | 27/317 kBProgress (4): 163/343 kB | 139/804 kB | 27/36 kB | 27/317 kBProgress (4): 163/343 kB | 139/804 kB | 27/36 kB | 30/317 kBProgress (4): 163/343 kB | 143/804 kB | 27/36 kB | 30/317 kBProgress (4): 163/343 kB | 143/804 kB | 30/36 kB | 30/317 kBProgress (4): 167/343 kB | 143/804 kB | 30/36 kB | 30/317 kBProgress (4): 167/343 kB | 147/804 kB | 30/36 kB | 30/317 kBProgress (4): 167/343 kB | 147/804 kB | 30/36 kB | 32/317 kBProgress (5): 167/343 kB | 147/804 kB | 30/36 kB | 32/317 kB | 4.1/128 kBProgress (5): 171/343 kB | 147/804 kB | 30/36 kB | 32/317 kB | 4.1/128 kBProgress (5): 171/343 kB | 147/804 kB | 32/36 kB | 32/317 kB | 4.1/128 kBProgress (5): 171/343 kB | 151/804 kB | 32/36 kB | 32/317 kB | 4.1/128 kBProgress (5): 176/343 kB | 151/804 kB | 32/36 kB | 32/317 kB | 4.1/128 kBProgress (5): 176/343 kB | 151/804 kB | 32/36 kB | 32/317 kB | 7.7/128 kBProgress (5): 180/343 kB | 151/804 kB | 32/36 kB | 32/317 kB | 7.7/128 kBProgress (5): 180/343 kB | 155/804 kB | 32/36 kB | 32/317 kB | 7.7/128 kBProgress (5): 180/343 kB | 155/804 kB | 35/36 kB | 32/317 kB | 7.7/128 kBProgress (5): 180/343 kB | 155/804 kB | 35/36 kB | 36/317 kB | 7.7/128 kBProgress (5): 184/343 kB | 155/804 kB | 35/36 kB | 36/317 kB | 7.7/128 kBProgress (5): 184/343 kB | 155/804 kB | 36 kB | 36/317 kB | 7.7/128 kB   Progress (5): 184/343 kB | 159/804 kB | 36 kB | 36/317 kB | 7.7/128 kBProgress (5): 184/343 kB | 159/804 kB | 36 kB | 36/317 kB | 12/128 kB Progress (5): 184/343 kB | 163/804 kB | 36 kB | 36/317 kB | 12/128 kBProgress (5): 188/343 kB | 163/804 kB | 36 kB | 36/317 kB | 12/128 kBProgress (5): 188/343 kB | 163/804 kB | 36 kB | 40/317 kB | 12/128 kBProgress (5): 192/343 kB | 163/804 kB | 36 kB | 40/317 kB | 12/128 kBProgress (5): 192/343 kB | 163/804 kB | 36 kB | 40/317 kB | 16/128 kBProgress (5): 192/343 kB | 167/804 kB | 36 kB | 40/317 kB | 16/128 kBProgress (5): 196/343 kB | 167/804 kB | 36 kB | 40/317 kB | 16/128 kBProgress (5): 196/343 kB | 167/804 kB | 36 kB | 45/317 kB | 16/128 kBProgress (5): 196/343 kB | 171/804 kB | 36 kB | 45/317 kB | 16/128 kBProgress (5): 196/343 kB | 171/804 kB | 36 kB | 49/317 kB | 16/128 kBProgress (5): 196/343 kB | 176/804 kB | 36 kB | 49/317 kB | 16/128 kBProgress (5): 200/343 kB | 176/804 kB | 36 kB | 49/317 kB | 16/128 kBProgress (5): 200/343 kB | 176/804 kB | 36 kB | 49/317 kB | 20/128 kBProgress (5): 204/343 kB | 176/804 kB | 36 kB | 49/317 kB | 20/128 kBProgress (5): 204/343 kB | 176/804 kB | 36 kB | 53/317 kB | 20/128 kBProgress (5): 204/343 kB | 180/804 kB | 36 kB | 53/317 kB | 20/128 kBProgress (5): 204/343 kB | 180/804 kB | 36 kB | 57/317 kB | 20/128 kBProgress (5): 208/343 kB | 180/804 kB | 36 kB | 57/317 kB | 20/128 kBProgress (5): 208/343 kB | 180/804 kB | 36 kB | 57/317 kB | 24/128 kBProgress (5): 212/343 kB | 180/804 kB | 36 kB | 57/317 kB | 24/128 kBProgress (5): 212/343 kB | 180/804 kB | 36 kB | 61/317 kB | 24/128 kBProgress (5): 212/343 kB | 180/804 kB | 36 kB | 61/317 kB | 28/128 kBProgress (5): 212/343 kB | 184/804 kB | 36 kB | 61/317 kB | 28/128 kBProgress (5): 217/343 kB | 184/804 kB | 36 kB | 61/317 kB | 28/128 kBProgress (5): 217/343 kB | 184/804 kB | 36 kB | 61/317 kB | 32/128 kBProgress (5): 217/343 kB | 184/804 kB | 36 kB | 65/317 kB | 32/128 kBProgress (5): 221/343 kB | 184/804 kB | 36 kB | 65/317 kB | 32/128 kBProgress (5): 221/343 kB | 188/804 kB | 36 kB | 65/317 kB | 32/128 kBProgress (5): 225/343 kB | 188/804 kB | 36 kB | 65/317 kB | 32/128 kBProgress (5): 225/343 kB | 192/804 kB | 36 kB | 65/317 kB | 32/128 kBProgress (5): 229/343 kB | 192/804 kB | 36 kB | 65/317 kB | 32/128 kB                                                                     Downloaded from central: https://repo.maven.apache.org/maven2/org/apache/maven/maven-toolchain/3.0-alpha-2/maven-toolchain-3.0-alpha-2.jar (36 kB at 612 kB/s)
Progress (4): 229/343 kB | 196/804 kB | 65/317 kB | 32/128 kBProgress (4): 229/343 kB | 196/804 kB | 65/317 kB | 36/128 kBProgress (4): 229/343 kB | 196/804 kB | 69/317 kB | 36/128 kBProgress (4): 229/343 kB | 196/804 kB | 69/317 kB | 40/128 kBProgress (4): 233/343 kB | 196/804 kB | 69/317 kB | 40/128 kBProgress (4): 233/343 kB | 200/804 kB | 69/317 kB | 40/128 kB                                                             Downloading from central: https://repo.maven.apache.org/maven2/org/apache/maven/shared/maven-common-artifact-filters/3.1.0/maven-common-artifact-filters-3.1.0.jar
Progress (4): 233/343 kB | 204/804 kB | 69/317 kB | 40/128 kBProgress (4): 237/343 kB | 204/804 kB | 69/317 kB | 40/128 kBProgress (4): 237/343 kB | 204/804 kB | 69/317 kB | 45/128 kBProgress (4): 237/343 kB | 204/804 kB | 73/317 kB | 45/128 kBProgress (4): 237/343 kB | 204/804 kB | 73/317 kB | 49/128 kBProgress (4): 241/343 kB | 204/804 kB | 73/317 kB | 49/128 kBProgress (4): 241/343 kB | 208/804 kB | 73/317 kB | 49/128 kBProgress (4): 245/343 kB | 208/804 kB | 73/317 kB | 49/128 kBProgress (4): 245/343 kB | 208/804 kB | 77/317 kB | 49/128 kBProgress (4): 245/343 kB | 212/804 kB | 77/317 kB | 49/128 kBProgress (4): 245/343 kB | 212/804 kB | 81/317 kB | 49/128 kBProgress (4): 245/343 kB | 212/804 kB | 81/317 kB | 53/128 kBProgress (4): 249/343 kB | 212/804 kB | 81/317 kB | 53/128 kBProgress (4): 249/343 kB | 212/804 kB | 81/317 kB | 57/128 kBProgress (4): 249/343 kB | 217/804 kB | 81/317 kB | 57/128 kBProgress (4): 253/343 kB | 217/804 kB | 81/317 kB | 57/128 kBProgress (4): 253/343 kB | 221/804 kB | 81/317 kB | 57/128 kBProgress (4): 253/343 kB | 221/804 kB | 85/317 kB | 57/128 kBProgress (4): 253/343 kB | 221/804 kB | 85/317 kB | 61/128 kBProgress (4): 253/343 kB | 221/804 kB | 90/317 kB | 61/128 kBProgress (4): 253/343 kB | 225/804 kB | 90/317 kB | 61/128 kBProgress (4): 258/343 kB | 225/804 kB | 90/317 kB | 61/128 kBProgress (4): 258/343 kB | 229/804 kB | 90/317 kB | 61/128 kBProgress (4): 258/343 kB | 229/804 kB | 94/317 kB | 61/128 kBProgress (4): 258/343 kB | 229/804 kB | 94/317 kB | 65/128 kBProgress (4): 258/343 kB | 229/804 kB | 98/317 kB | 65/128 kBProgress (4): 262/343 kB | 229/804 kB | 98/317 kB | 65/128 kBProgress (4): 262/343 kB | 233/804 kB | 98/317 kB | 65/128 kBProgress (4): 262/343 kB | 237/804 kB | 98/317 kB | 65/128 kBProgress (4): 262/343 kB | 241/804 kB | 98/317 kB | 65/128 kBProgress (4): 262/343 kB | 241/804 kB | 102/317 kB | 65/128 kBProgress (4): 266/343 kB | 241/804 kB | 102/317 kB | 65/128 kBProgress (4): 266/343 kB | 245/804 kB | 102/317 kB | 65/128 kBProgress (4): 266/343 kB | 245/804 kB | 102/317 kB | 69/128 kBProgress (5): 266/343 kB | 245/804 kB | 102/317 kB | 69/128 kB | 2.2/61 kBProgress (5): 270/343 kB | 245/804 kB | 102/317 kB | 69/128 kB | 2.2/61 kBProgress (5): 270/343 kB | 245/804 kB | 106/317 kB | 69/128 kB | 2.2/61 kBProgress (5): 270/343 kB | 245/804 kB | 106/317 kB | 69/128 kB | 5.0/61 kBProgress (5): 274/343 kB | 245/804 kB | 106/317 kB | 69/128 kB | 5.0/61 kBProgress (5): 274/343 kB | 249/804 kB | 106/317 kB | 69/128 kB | 5.0/61 kBProgress (5): 274/343 kB | 249/804 kB | 106/317 kB | 73/128 kB | 5.0/61 kBProgress (5): 274/343 kB | 253/804 kB | 106/317 kB | 73/128 kB | 5.0/61 kBProgress (5): 278/343 kB | 253/804 kB | 106/317 kB | 73/128 kB | 5.0/61 kBProgress (5): 278/343 kB | 253/804 kB | 106/317 kB | 73/128 kB | 7.7/61 kBProgress (5): 278/343 kB | 253/804 kB | 110/317 kB | 73/128 kB | 7.7/61 kBProgress (5): 278/343 kB | 253/804 kB | 110/317 kB | 73/128 kB | 10/61 kB Progress (5): 282/343 kB | 253/804 kB | 110/317 kB | 73/128 kB | 10/61 kBProgress (5): 282/343 kB | 258/804 kB | 110/317 kB | 73/128 kB | 10/61 kBProgress (5): 282/343 kB | 258/804 kB | 110/317 kB | 77/128 kB | 10/61 kBProgress (5): 282/343 kB | 262/804 kB | 110/317 kB | 77/128 kB | 10/61 kBProgress (5): 286/343 kB | 262/804 kB | 110/317 kB | 77/128 kB | 10/61 kBProgress (5): 286/343 kB | 262/804 kB | 110/317 kB | 77/128 kB | 13/61 kBProgress (5): 286/343 kB | 262/804 kB | 114/317 kB | 77/128 kB | 13/61 kBProgress (5): 286/343 kB | 262/804 kB | 114/317 kB | 77/128 kB | 16/61 kBProgress (5): 290/343 kB | 262/804 kB | 114/317 kB | 77/128 kB | 16/61 kBProgress (5): 290/343 kB | 262/804 kB | 114/317 kB | 81/128 kB | 16/61 kBProgress (5): 294/343 kB | 262/804 kB | 114/317 kB | 81/128 kB | 16/61 kBProgress (5): 294/343 kB | 262/804 kB | 114/317 kB | 81/128 kB | 19/61 kBProgress (5): 294/343 kB | 266/804 kB | 114/317 kB | 81/128 kB | 19/61 kBProgress (5): 294/343 kB | 266/804 kB | 114/317 kB | 81/128 kB | 21/61 kBProgress (5): 294/343 kB | 266/804 kB | 114/317 kB | 85/128 kB | 21/61 kBProgress (5): 294/343 kB | 266/804 kB | 118/317 kB | 85/128 kB | 21/61 kBProgress (5): 294/343 kB | 266/804 kB | 118/317 kB | 90/128 kB | 21/61 kBProgress (5): 294/343 kB | 266/804 kB | 118/317 kB | 90/128 kB | 24/61 kBProgress (5): 298/343 kB | 266/804 kB | 118/317 kB | 90/128 kB | 24/61 kBProgress (5): 298/343 kB | 270/804 kB | 118/317 kB | 90/128 kB | 24/61 kBProgress (5): 303/343 kB | 270/804 kB | 118/317 kB | 90/128 kB | 24/61 kBProgress (5): 303/343 kB | 270/804 kB | 118/317 kB | 90/128 kB | 27/61 kBProgress (5): 303/343 kB | 270/804 kB | 118/317 kB | 94/128 kB | 27/61 kBProgress (5): 303/343 kB | 270/804 kB | 122/317 kB | 94/128 kB | 27/61 kBProgress (5): 303/343 kB | 270/804 kB | 122/317 kB | 98/128 kB | 27/61 kBProgress (5): 303/343 kB | 270/804 kB | 122/317 kB | 98/128 kB | 30/61 kBProgress (5): 307/343 kB | 270/804 kB | 122/317 kB | 98/128 kB | 30/61 kBProgress (5): 307/343 kB | 274/804 kB | 122/317 kB | 98/128 kB | 30/61 kBProgress (5): 307/343 kB | 274/804 kB | 122/317 kB | 102/128 kB | 30/61 kBProgress (5): 311/343 kB | 274/804 kB | 122/317 kB | 102/128 kB | 30/61 kBProgress (5): 311/343 kB | 274/804 kB | 122/317 kB | 102/128 kB | 32/61 kBProgress (5): 311/343 kB | 274/804 kB | 126/317 kB | 102/128 kB | 32/61 kBProgress (5): 311/343 kB | 274/804 kB | 126/317 kB | 106/128 kB | 32/61 kBProgress (5): 311/343 kB | 278/804 kB | 126/317 kB | 106/128 kB | 32/61 kBProgress (5): 315/343 kB | 278/804 kB | 126/317 kB | 106/128 kB | 32/61 kBProgress (5): 315/343 kB | 278/804 kB | 126/317 kB | 110/128 kB | 32/61 kBProgress (5): 315/343 kB | 278/804 kB | 131/317 kB | 110/128 kB | 32/61 kBProgress (5): 315/343 kB | 278/804 kB | 131/317 kB | 114/128 kB | 32/61 kBProgress (5): 315/343 kB | 282/804 kB | 131/317 kB | 114/128 kB | 32/61 kBProgress (5): 319/343 kB | 282/804 kB | 131/317 kB | 114/128 kB | 32/61 kBProgress (5): 319/343 kB | 282/804 kB | 131/317 kB | 114/128 kB | 36/61 kBProgress (5): 319/343 kB | 282/804 kB | 131/317 kB | 118/128 kB | 36/61 kBProgress (5): 319/343 kB | 282/804 kB | 135/317 kB | 118/128 kB | 36/61 kBProgress (5): 323/343 kB | 282/804 kB | 135/317 kB | 118/128 kB | 36/61 kBProgress (5): 323/343 kB | 286/804 kB | 135/317 kB | 118/128 kB | 36/61 kBProgress (5): 327/343 kB | 286/804 kB | 135/317 kB | 118/128 kB | 36/61 kBProgress (5): 327/343 kB | 286/804 kB | 139/317 kB | 118/128 kB | 36/61 kBProgress (5): 327/343 kB | 286/804 kB | 139/317 kB | 122/128 kB | 36/61 kBProgress (5): 327/343 kB | 286/804 kB | 139/317 kB | 122/128 kB | 40/61 kBProgress (5): 327/343 kB | 286/804 kB | 139/317 kB | 126/128 kB | 40/61 kBProgress (5): 327/343 kB | 286/804 kB | 143/317 kB | 126/128 kB | 40/61 kBProgress (5): 327/343 kB | 290/804 kB | 143/317 kB | 126/128 kB | 40/61 kBProgress (5): 327/343 kB | 290/804 kB | 147/317 kB | 126/128 kB | 40/61 kBProgress (5): 327/343 kB | 290/804 kB | 147/317 kB | 128 kB | 40/61 kB    Progress (5): 327/343 kB | 290/804 kB | 147/317 kB | 128 kB | 45/61 kBProgress (5): 331/343 kB | 290/804 kB | 147/317 kB | 128 kB | 45/61 kBProgress (5): 331/343 kB | 290/804 kB | 151/317 kB | 128 kB | 45/61 kBProgress (5): 331/343 kB | 290/804 kB | 151/317 kB | 128 kB | 49/61 kBProgress (5): 331/343 kB | 294/804 kB | 151/317 kB | 128 kB | 49/61 kBProgress (5): 331/343 kB | 294/804 kB | 155/317 kB | 128 kB | 49/61 kBProgress (5): 335/343 kB | 294/804 kB | 155/317 kB | 128 kB | 49/61 kBProgress (5): 335/343 kB | 294/804 kB | 155/317 kB | 128 kB | 53/61 kBProgress (5): 335/343 kB | 294/804 kB | 159/317 kB | 128 kB | 53/61 kBProgress (5): 335/343 kB | 298/804 kB | 159/317 kB | 128 kB | 53/61 kBProgress (5): 335/343 kB | 298/804 kB | 159/317 kB | 128 kB | 57/61 kBProgress (5): 339/343 kB | 298/804 kB | 159/317 kB | 128 kB | 57/61 kBProgress (5): 339/343 kB | 298/804 kB | 159/317 kB | 128 kB | 61/61 kBProgress (5): 339/343 kB | 303/804 kB | 159/317 kB | 128 kB | 61/61 kBProgress (5): 339/343 kB | 303/804 kB | 163/317 kB | 128 kB | 61/61 kBProgress (5): 339/343 kB | 307/804 kB | 163/317 kB | 128 kB | 61/61 kBProgress (5): 339/343 kB | 307/804 kB | 163/317 kB | 128 kB | 61 kB   Progress (5): 343 kB | 307/804 kB | 163/317 kB | 128 kB | 61 kB    Progress (5): 343 kB | 311/804 kB | 163/317 kB | 128 kB | 61 kBProgress (5): 343 kB | 311/804 kB | 167/317 kB | 128 kB | 61 kBProgress (5): 343 kB | 311/804 kB | 171/317 kB | 128 kB | 61 kBProgress (5): 343 kB | 311/804 kB | 176/317 kB | 128 kB | 61 kBProgress (5): 343 kB | 311/804 kB | 180/317 kB | 128 kB | 61 kBProgress (5): 343 kB | 315/804 kB | 180/317 kB | 128 kB | 61 kBProgress (5): 343 kB | 319/804 kB | 180/317 kB | 128 kB | 61 kBProgress (5): 343 kB | 323/804 kB | 180/317 kB | 128 kB | 61 kBProgress (5): 343 kB | 327/804 kB | 180/317 kB | 128 kB | 61 kBProgress (5): 343 kB | 327/804 kB | 184/317 kB | 128 kB | 61 kB                                                               Downloaded from central: https://repo.maven.apache.org/maven2/org/apache/maven/shared/maven-artifact-transfer/0.11.0/maven-artifact-transfer-0.11.0.jar (128 kB at 1.5 MB/s)
Progress (4): 343 kB | 327/804 kB | 188/317 kB | 61 kBProgress (4): 343 kB | 331/804 kB | 188/317 kB | 61 kB                                                      Downloading from central: https://repo.maven.apache.org/maven2/commons-codec/commons-codec/1.11/commons-codec-1.11.jar
Progress (4): 343 kB | 335/804 kB | 188/317 kB | 61 kBProgress (4): 343 kB | 335/804 kB | 192/317 kB | 61 kBProgress (4): 343 kB | 339/804 kB | 192/317 kB | 61 kBProgress (4): 343 kB | 339/804 kB | 196/317 kB | 61 kBProgress (4): 343 kB | 344/804 kB | 196/317 kB | 61 kBProgress (4): 343 kB | 344/804 kB | 200/317 kB | 61 kBProgress (4): 343 kB | 348/804 kB | 200/317 kB | 61 kBProgress (4): 343 kB | 348/804 kB | 204/317 kB | 61 kB                                                      Downloaded from central: https://repo.maven.apache.org/maven2/org/apache/maven/surefire/surefire-api/3.0.0-M4/surefire-api-3.0.0-M4.jar (343 kB at 3.9 MB/s)
Progress (3): 352/804 kB | 204/317 kB | 61 kB                                             Downloaded from central: https://repo.maven.apache.org/maven2/org/apache/maven/shared/maven-common-artifact-filters/3.1.0/maven-common-artifact-filters-3.1.0.jar (61 kB at 688 kB/s)
Downloading from central: https://repo.maven.apache.org/maven2/org/ow2/asm/asm/7.0/asm-7.0.jar
Progress (2): 356/804 kB | 204/317 kB                                     Downloading from central: https://repo.maven.apache.org/maven2/org/codehaus/plexus/plexus-java/1.0.3/plexus-java-1.0.3.jar
Progress (2): 356/804 kB | 208/317 kBProgress (2): 360/804 kB | 208/317 kBProgress (2): 360/804 kB | 212/317 kBProgress (2): 364/804 kB | 212/317 kBProgress (2): 364/804 kB | 217/317 kBProgress (2): 368/804 kB | 217/317 kBProgress (2): 368/804 kB | 221/317 kBProgress (2): 372/804 kB | 221/317 kBProgress (2): 372/804 kB | 225/317 kBProgress (2): 376/804 kB | 225/317 kBProgress (2): 376/804 kB | 229/317 kBProgress (2): 380/804 kB | 229/317 kBProgress (2): 380/804 kB | 233/317 kBProgress (3): 380/804 kB | 233/317 kB | 4.1/335 kBProgress (3): 380/804 kB | 237/317 kB | 4.1/335 kBProgress (3): 384/804 kB | 237/317 kB | 4.1/335 kBProgress (3): 384/804 kB | 241/317 kB | 4.1/335 kBProgress (3): 384/804 kB | 241/317 kB | 7.7/335 kBProgress (3): 384/804 kB | 245/317 kB | 7.7/335 kBProgress (3): 384/804 kB | 245/317 kB | 12/335 kB Progress (3): 389/804 kB | 245/317 kB | 12/335 kBProgress (3): 389/804 kB | 245/317 kB | 16/335 kBProgress (3): 393/804 kB | 245/317 kB | 16/335 kBProgress (3): 393/804 kB | 249/317 kB | 16/335 kBProgress (3): 393/804 kB | 253/317 kB | 16/335 kBProgress (3): 393/804 kB | 258/317 kB | 16/335 kBProgress (3): 393/804 kB | 258/317 kB | 20/335 kBProgress (3): 397/804 kB | 258/317 kB | 20/335 kBProgress (3): 397/804 kB | 262/317 kB | 20/335 kBProgress (3): 401/804 kB | 262/317 kB | 20/335 kBProgress (3): 401/804 kB | 262/317 kB | 24/335 kBProgress (4): 401/804 kB | 262/317 kB | 24/335 kB | 4.1/114 kBProgress (4): 405/804 kB | 262/317 kB | 24/335 kB | 4.1/114 kBProgress (4): 405/804 kB | 262/317 kB | 24/335 kB | 7.7/114 kBProgress (4): 405/804 kB | 262/317 kB | 28/335 kB | 7.7/114 kBProgress (5): 405/804 kB | 262/317 kB | 28/335 kB | 7.7/114 kB | 4.1/51 kBProgress (5): 405/804 kB | 262/317 kB | 32/335 kB | 7.7/114 kB | 4.1/51 kBProgress (5): 405/804 kB | 262/317 kB | 32/335 kB | 12/114 kB | 4.1/51 kB Progress (5): 409/804 kB | 262/317 kB | 32/335 kB | 12/114 kB | 4.1/51 kBProgress (5): 409/804 kB | 266/317 kB | 32/335 kB | 12/114 kB | 4.1/51 kBProgress (5): 409/804 kB | 266/317 kB | 32/335 kB | 16/114 kB | 4.1/51 kBProgress (5): 409/804 kB | 266/317 kB | 32/335 kB | 16/114 kB | 7.7/51 kBProgress (5): 409/804 kB | 270/317 kB | 32/335 kB | 16/114 kB | 7.7/51 kBProgress (5): 413/804 kB | 270/317 kB | 32/335 kB | 16/114 kB | 7.7/51 kBProgress (5): 413/804 kB | 270/317 kB | 32/335 kB | 16/114 kB | 12/51 kB Progress (5): 413/804 kB | 270/317 kB | 32/335 kB | 20/114 kB | 12/51 kBProgress (5): 413/804 kB | 270/317 kB | 36/335 kB | 20/114 kB | 12/51 kBProgress (5): 413/804 kB | 270/317 kB | 36/335 kB | 24/114 kB | 12/51 kBProgress (5): 413/804 kB | 270/317 kB | 36/335 kB | 24/114 kB | 16/51 kBProgress (5): 417/804 kB | 270/317 kB | 36/335 kB | 24/114 kB | 16/51 kBProgress (5): 417/804 kB | 274/317 kB | 36/335 kB | 24/114 kB | 16/51 kBProgress (5): 421/804 kB | 274/317 kB | 36/335 kB | 24/114 kB | 16/51 kBProgress (5): 421/804 kB | 274/317 kB | 36/335 kB | 24/114 kB | 20/51 kBProgress (5): 421/804 kB | 274/317 kB | 36/335 kB | 28/114 kB | 20/51 kBProgress (5): 421/804 kB | 274/317 kB | 40/335 kB | 28/114 kB | 20/51 kBProgress (5): 421/804 kB | 274/317 kB | 40/335 kB | 32/114 kB | 20/51 kBProgress (5): 421/804 kB | 274/317 kB | 40/335 kB | 32/114 kB | 24/51 kBProgress (5): 425/804 kB | 274/317 kB | 40/335 kB | 32/114 kB | 24/51 kBProgress (5): 425/804 kB | 278/317 kB | 40/335 kB | 32/114 kB | 24/51 kBProgress (5): 425/804 kB | 278/317 kB | 40/335 kB | 32/114 kB | 28/51 kBProgress (5): 425/804 kB | 278/317 kB | 45/335 kB | 32/114 kB | 28/51 kBProgress (5): 425/804 kB | 278/317 kB | 45/335 kB | 32/114 kB | 32/51 kBProgress (5): 425/804 kB | 278/317 kB | 45/335 kB | 36/114 kB | 32/51 kBProgress (5): 425/804 kB | 282/317 kB | 45/335 kB | 36/114 kB | 32/51 kBProgress (5): 425/804 kB | 282/317 kB | 49/335 kB | 36/114 kB | 32/51 kBProgress (5): 425/804 kB | 286/317 kB | 49/335 kB | 36/114 kB | 32/51 kBProgress (5): 425/804 kB | 286/317 kB | 49/335 kB | 40/114 kB | 32/51 kBProgress (5): 430/804 kB | 286/317 kB | 49/335 kB | 40/114 kB | 32/51 kBProgress (5): 430/804 kB | 286/317 kB | 49/335 kB | 45/114 kB | 32/51 kBProgress (5): 430/804 kB | 290/317 kB | 49/335 kB | 45/114 kB | 32/51 kBProgress (5): 430/804 kB | 290/317 kB | 49/335 kB | 45/114 kB | 36/51 kBProgress (5): 430/804 kB | 294/317 kB | 49/335 kB | 45/114 kB | 36/51 kBProgress (5): 430/804 kB | 294/317 kB | 49/335 kB | 49/114 kB | 36/51 kBProgress (5): 430/804 kB | 294/317 kB | 53/335 kB | 49/114 kB | 36/51 kBProgress (5): 434/804 kB | 294/317 kB | 53/335 kB | 49/114 kB | 36/51 kBProgress (5): 434/804 kB | 298/317 kB | 53/335 kB | 49/114 kB | 36/51 kBProgress (5): 434/804 kB | 298/317 kB | 57/335 kB | 49/114 kB | 36/51 kBProgress (5): 434/804 kB | 298/317 kB | 57/335 kB | 49/114 kB | 40/51 kBProgress (5): 434/804 kB | 298/317 kB | 61/335 kB | 49/114 kB | 40/51 kBProgress (5): 434/804 kB | 303/317 kB | 61/335 kB | 49/114 kB | 40/51 kBProgress (5): 434/804 kB | 303/317 kB | 61/335 kB | 53/114 kB | 40/51 kBProgress (5): 438/804 kB | 303/317 kB | 61/335 kB | 53/114 kB | 40/51 kBProgress (5): 438/804 kB | 303/317 kB | 61/335 kB | 57/114 kB | 40/51 kBProgress (5): 438/804 kB | 307/317 kB | 61/335 kB | 57/114 kB | 40/51 kBProgress (5): 438/804 kB | 307/317 kB | 65/335 kB | 57/114 kB | 40/51 kBProgress (5): 438/804 kB | 307/317 kB | 65/335 kB | 57/114 kB | 45/51 kBProgress (5): 438/804 kB | 311/317 kB | 65/335 kB | 57/114 kB | 45/51 kBProgress (5): 438/804 kB | 311/317 kB | 65/335 kB | 61/114 kB | 45/51 kBProgress (5): 442/804 kB | 311/317 kB | 65/335 kB | 61/114 kB | 45/51 kBProgress (5): 442/804 kB | 315/317 kB | 65/335 kB | 61/114 kB | 45/51 kBProgress (5): 442/804 kB | 315/317 kB | 65/335 kB | 65/114 kB | 45/51 kBProgress (5): 442/804 kB | 315/317 kB | 65/335 kB | 65/114 kB | 49/51 kBProgress (5): 442/804 kB | 317 kB | 65/335 kB | 65/114 kB | 49/51 kB    Progress (5): 446/804 kB | 317 kB | 65/335 kB | 65/114 kB | 49/51 kBProgress (5): 446/804 kB | 317 kB | 69/335 kB | 65/114 kB | 49/51 kBProgress (5): 450/804 kB | 317 kB | 69/335 kB | 65/114 kB | 49/51 kBProgress (5): 450/804 kB | 317 kB | 69/335 kB | 69/114 kB | 49/51 kBProgress (5): 450/804 kB | 317 kB | 69/335 kB | 69/114 kB | 51 kB   Progress (5): 450/804 kB | 317 kB | 69/335 kB | 73/114 kB | 51 kBProgress (5): 454/804 kB | 317 kB | 69/335 kB | 73/114 kB | 51 kBProgress (5): 454/804 kB | 317 kB | 73/335 kB | 73/114 kB | 51 kBProgress (5): 458/804 kB | 317 kB | 73/335 kB | 73/114 kB | 51 kBProgress (5): 458/804 kB | 317 kB | 73/335 kB | 77/114 kB | 51 kBProgress (5): 458/804 kB | 317 kB | 77/335 kB | 77/114 kB | 51 kBProgress (5): 458/804 kB | 317 kB | 77/335 kB | 81/114 kB | 51 kBProgress (5): 458/804 kB | 317 kB | 81/335 kB | 81/114 kB | 51 kBProgress (5): 462/804 kB | 317 kB | 81/335 kB | 81/114 kB | 51 kBProgress (5): 466/804 kB | 317 kB | 81/335 kB | 81/114 kB | 51 kBProgress (5): 466/804 kB | 317 kB | 85/335 kB | 81/114 kB | 51 kBProgress (5): 466/804 kB | 317 kB | 85/335 kB | 85/114 kB | 51 kBProgress (5): 466/804 kB | 317 kB | 90/335 kB | 85/114 kB | 51 kBProgress (5): 470/804 kB | 317 kB | 90/335 kB | 85/114 kB | 51 kBProgress (5): 470/804 kB | 317 kB | 94/335 kB | 85/114 kB | 51 kBProgress (5): 470/804 kB | 317 kB | 94/335 kB | 90/114 kB | 51 kBProgress (5): 470/804 kB | 317 kB | 98/335 kB | 90/114 kB | 51 kBProgress (5): 475/804 kB | 317 kB | 98/335 kB | 90/114 kB | 51 kBProgress (5): 475/804 kB | 317 kB | 98/335 kB | 94/114 kB | 51 kBProgress (5): 475/804 kB | 317 kB | 98/335 kB | 98/114 kB | 51 kBProgress (5): 475/804 kB | 317 kB | 102/335 kB | 98/114 kB | 51 kBProgress (5): 479/804 kB | 317 kB | 102/335 kB | 98/114 kB | 51 kBProgress (5): 479/804 kB | 317 kB | 106/335 kB | 98/114 kB | 51 kBProgress (5): 479/804 kB | 317 kB | 106/335 kB | 102/114 kB | 51 kBProgress (5): 483/804 kB | 317 kB | 106/335 kB | 102/114 kB | 51 kB                                                                   Downloaded from central: https://repo.maven.apache.org/maven2/org/apache/maven/surefire/surefire-booter/3.0.0-M4/surefire-booter-3.0.0-M4.jar (317 kB at 2.8 MB/s)
Progress (4): 483/804 kB | 106/335 kB | 106/114 kB | 51 kBProgress (4): 483/804 kB | 110/335 kB | 106/114 kB | 51 kBProgress (4): 483/804 kB | 110/335 kB | 110/114 kB | 51 kB                                                          Downloading from central: https://repo.maven.apache.org/maven2/org/codehaus/plexus/plexus-utils/1.1/plexus-utils-1.1.jar
Progress (4): 487/804 kB | 110/335 kB | 110/114 kB | 51 kB                                                          Downloaded from central: https://repo.maven.apache.org/maven2/org/codehaus/plexus/plexus-java/1.0.3/plexus-java-1.0.3.jar (51 kB at 447 kB/s)
Progress (3): 487/804 kB | 110/335 kB | 114 kBProgress (3): 487/804 kB | 114/335 kB | 114 kBProgress (3): 491/804 kB | 114/335 kB | 114 kBProgress (3): 491/804 kB | 118/335 kB | 114 kBProgress (3): 491/804 kB | 122/335 kB | 114 kBProgress (3): 491/804 kB | 126/335 kB | 114 kBProgress (3): 491/804 kB | 131/335 kB | 114 kBProgress (3): 495/804 kB | 131/335 kB | 114 kBProgress (3): 499/804 kB | 131/335 kB | 114 kBProgress (3): 503/804 kB | 131/335 kB | 114 kBProgress (3): 507/804 kB | 131/335 kB | 114 kBProgress (3): 507/804 kB | 135/335 kB | 114 kBProgress (3): 507/804 kB | 139/335 kB | 114 kBProgress (3): 507/804 kB | 143/335 kB | 114 kBProgress (3): 507/804 kB | 147/335 kB | 114 kBProgress (3): 511/804 kB | 147/335 kB | 114 kBProgress (3): 516/804 kB | 147/335 kB | 114 kBProgress (3): 520/804 kB | 147/335 kB | 114 kBProgress (3): 524/804 kB | 147/335 kB | 114 kBProgress (3): 524/804 kB | 151/335 kB | 114 kBProgress (3): 524/804 kB | 155/335 kB | 114 kBProgress (3): 524/804 kB | 159/335 kB | 114 kBProgress (3): 524/804 kB | 163/335 kB | 114 kBProgress (3): 528/804 kB | 163/335 kB | 114 kBProgress (3): 532/804 kB | 163/335 kB | 114 kBProgress (3): 536/804 kB | 163/335 kB | 114 kBProgress (3): 540/804 kB | 163/335 kB | 114 kBProgress (3): 540/804 kB | 167/335 kB | 114 kBProgress (3): 540/804 kB | 171/335 kB | 114 kBProgress (3): 540/804 kB | 176/335 kB | 114 kBProgress (3): 540/804 kB | 180/335 kB | 114 kBProgress (3): 544/804 kB | 180/335 kB | 114 kBProgress (3): 548/804 kB | 180/335 kB | 114 kBProgress (4): 548/804 kB | 180/335 kB | 114 kB | 4.1/169 kBProgress (4): 552/804 kB | 180/335 kB | 114 kB | 4.1/169 kBProgress (4): 552/804 kB | 180/335 kB | 114 kB | 7.7/169 kBProgress (4): 552/804 kB | 184/335 kB | 114 kB | 7.7/169 kBProgress (4): 557/804 kB | 184/335 kB | 114 kB | 7.7/169 kBProgress (4): 557/804 kB | 188/335 kB | 114 kB | 7.7/169 kBProgress (4): 557/804 kB | 188/335 kB | 114 kB | 12/169 kB Progress (4): 557/804 kB | 192/335 kB | 114 kB | 12/169 kB                                                          Downloaded from central: https://repo.maven.apache.org/maven2/org/ow2/asm/asm/7.0/asm-7.0.jar (114 kB at 932 kB/s)
Progress (3): 557/804 kB | 196/335 kB | 12/169 kBProgress (3): 557/804 kB | 196/335 kB | 16/169 kBProgress (3): 561/804 kB | 196/335 kB | 16/169 kBProgress (3): 565/804 kB | 196/335 kB | 16/169 kBProgress (3): 569/804 kB | 196/335 kB | 16/169 kBProgress (3): 569/804 kB | 200/335 kB | 16/169 kBProgress (3): 573/804 kB | 200/335 kB | 16/169 kBProgress (3): 573/804 kB | 204/335 kB | 16/169 kBProgress (3): 573/804 kB | 208/335 kB | 16/169 kBProgress (3): 573/804 kB | 208/335 kB | 20/169 kBProgress (3): 573/804 kB | 212/335 kB | 20/169 kBProgress (3): 577/804 kB | 212/335 kB | 20/169 kBProgress (3): 577/804 kB | 212/335 kB | 24/169 kBProgress (3): 581/804 kB | 212/335 kB | 24/169 kBProgress (3): 581/804 kB | 212/335 kB | 28/169 kBProgress (3): 581/804 kB | 217/335 kB | 28/169 kBProgress (3): 585/804 kB | 217/335 kB | 28/169 kBProgress (3): 585/804 kB | 221/335 kB | 28/169 kBProgress (3): 585/804 kB | 221/335 kB | 32/169 kBProgress (3): 585/804 kB | 225/335 kB | 32/169 kBProgress (3): 589/804 kB | 225/335 kB | 32/169 kBProgress (3): 589/804 kB | 229/335 kB | 32/169 kBProgress (3): 589/804 kB | 229/335 kB | 36/169 kBProgress (3): 593/804 kB | 229/335 kB | 36/169 kBProgress (3): 593/804 kB | 229/335 kB | 40/169 kBProgress (3): 593/804 kB | 233/335 kB | 40/169 kBProgress (3): 593/804 kB | 233/335 kB | 45/169 kBProgress (3): 597/804 kB | 233/335 kB | 45/169 kBProgress (3): 597/804 kB | 233/335 kB | 49/169 kBProgress (3): 597/804 kB | 237/335 kB | 49/169 kBProgress (3): 602/804 kB | 237/335 kB | 49/169 kBProgress (3): 602/804 kB | 241/335 kB | 49/169 kBProgress (3): 606/804 kB | 241/335 kB | 49/169 kBProgress (3): 606/804 kB | 245/335 kB | 49/169 kBProgress (3): 606/804 kB | 245/335 kB | 53/169 kBProgress (3): 606/804 kB | 245/335 kB | 57/169 kBProgress (3): 610/804 kB | 245/335 kB | 57/169 kBProgress (3): 610/804 kB | 245/335 kB | 61/169 kBProgress (3): 610/804 kB | 249/335 kB | 61/169 kBProgress (3): 610/804 kB | 249/335 kB | 65/169 kBProgress (3): 614/804 kB | 249/335 kB | 65/169 kBProgress (3): 614/804 kB | 253/335 kB | 65/169 kBProgress (3): 618/804 kB | 253/335 kB | 65/169 kBProgress (3): 618/804 kB | 258/335 kB | 65/169 kBProgress (3): 622/804 kB | 258/335 kB | 65/169 kBProgress (3): 622/804 kB | 262/335 kB | 65/169 kBProgress (3): 622/804 kB | 262/335 kB | 69/169 kBProgress (3): 622/804 kB | 262/335 kB | 73/169 kBProgress (3): 626/804 kB | 262/335 kB | 73/169 kBProgress (3): 626/804 kB | 266/335 kB | 73/169 kBProgress (3): 626/804 kB | 266/335 kB | 77/169 kBProgress (3): 626/804 kB | 270/335 kB | 77/169 kBProgress (3): 630/804 kB | 270/335 kB | 77/169 kBProgress (3): 630/804 kB | 274/335 kB | 77/169 kBProgress (3): 630/804 kB | 274/335 kB | 81/169 kBProgress (3): 630/804 kB | 278/335 kB | 81/169 kBProgress (3): 634/804 kB | 278/335 kB | 81/169 kBProgress (3): 638/804 kB | 278/335 kB | 81/169 kBProgress (3): 638/804 kB | 278/335 kB | 85/169 kBProgress (3): 638/804 kB | 282/335 kB | 85/169 kBProgress (3): 638/804 kB | 282/335 kB | 90/169 kBProgress (3): 638/804 kB | 286/335 kB | 90/169 kBProgress (3): 638/804 kB | 286/335 kB | 94/169 kBProgress (3): 638/804 kB | 290/335 kB | 94/169 kBProgress (3): 643/804 kB | 290/335 kB | 94/169 kBProgress (3): 643/804 kB | 294/335 kB | 94/169 kBProgress (3): 643/804 kB | 294/335 kB | 98/169 kBProgress (3): 647/804 kB | 294/335 kB | 98/169 kBProgress (3): 651/804 kB | 294/335 kB | 98/169 kBProgress (3): 655/804 kB | 294/335 kB | 98/169 kBProgress (3): 655/804 kB | 298/335 kB | 98/169 kBProgress (3): 655/804 kB | 298/335 kB | 102/169 kBProgress (3): 655/804 kB | 303/335 kB | 102/169 kBProgress (3): 655/804 kB | 303/335 kB | 106/169 kBProgress (3): 655/804 kB | 307/335 kB | 106/169 kBProgress (3): 659/804 kB | 307/335 kB | 106/169 kBProgress (3): 659/804 kB | 307/335 kB | 110/169 kBProgress (3): 663/804 kB | 307/335 kB | 110/169 kBProgress (3): 663/804 kB | 311/335 kB | 110/169 kBProgress (3): 667/804 kB | 311/335 kB | 110/169 kBProgress (3): 667/804 kB | 311/335 kB | 114/169 kBProgress (3): 671/804 kB | 311/335 kB | 114/169 kBProgress (3): 671/804 kB | 315/335 kB | 114/169 kBProgress (3): 671/804 kB | 319/335 kB | 114/169 kBProgress (3): 671/804 kB | 319/335 kB | 118/169 kBProgress (3): 675/804 kB | 319/335 kB | 118/169 kBProgress (3): 675/804 kB | 323/335 kB | 118/169 kBProgress (3): 679/804 kB | 323/335 kB | 118/169 kBProgress (3): 679/804 kB | 323/335 kB | 122/169 kBProgress (3): 683/804 kB | 323/335 kB | 122/169 kBProgress (3): 683/804 kB | 327/335 kB | 122/169 kBProgress (3): 688/804 kB | 327/335 kB | 122/169 kBProgress (3): 688/804 kB | 327/335 kB | 126/169 kBProgress (3): 688/804 kB | 327/335 kB | 131/169 kBProgress (3): 688/804 kB | 331/335 kB | 131/169 kBProgress (3): 688/804 kB | 335 kB | 131/169 kB    Progress (3): 692/804 kB | 335 kB | 131/169 kBProgress (3): 696/804 kB | 335 kB | 131/169 kBProgress (3): 696/804 kB | 335 kB | 135/169 kBProgress (3): 700/804 kB | 335 kB | 135/169 kBProgress (3): 700/804 kB | 335 kB | 139/169 kBProgress (3): 704/804 kB | 335 kB | 139/169 kBProgress (3): 704/804 kB | 335 kB | 143/169 kBProgress (3): 704/804 kB | 335 kB | 147/169 kBProgress (3): 708/804 kB | 335 kB | 147/169 kBProgress (3): 712/804 kB | 335 kB | 147/169 kBProgress (3): 712/804 kB | 335 kB | 151/169 kBProgress (3): 716/804 kB | 335 kB | 151/169 kBProgress (3): 716/804 kB | 335 kB | 155/169 kBProgress (3): 720/804 kB | 335 kB | 155/169 kBProgress (3): 720/804 kB | 335 kB | 159/169 kBProgress (3): 720/804 kB | 335 kB | 163/169 kBProgress (3): 720/804 kB | 335 kB | 167/169 kBProgress (3): 724/804 kB | 335 kB | 167/169 kBProgress (3): 724/804 kB | 335 kB | 169 kB    Progress (3): 729/804 kB | 335 kB | 169 kBProgress (3): 733/804 kB | 335 kB | 169 kBProgress (3): 737/804 kB | 335 kB | 169 kBProgress (3): 741/804 kB | 335 kB | 169 kBProgress (3): 745/804 kB | 335 kB | 169 kBProgress (3): 749/804 kB | 335 kB | 169 kBProgress (3): 753/804 kB | 335 kB | 169 kBProgress (3): 757/804 kB | 335 kB | 169 kBProgress (3): 761/804 kB | 335 kB | 169 kBProgress (3): 765/804 kB | 335 kB | 169 kB                                          Downloaded from central: https://repo.maven.apache.org/maven2/commons-codec/commons-codec/1.11/commons-codec-1.11.jar (335 kB at 2.3 MB/s)
Progress (2): 770/804 kB | 169 kBProgress (2): 774/804 kB | 169 kBProgress (2): 778/804 kB | 169 kBProgress (2): 782/804 kB | 169 kBProgress (2): 786/804 kB | 169 kBProgress (2): 790/804 kB | 169 kBProgress (2): 794/804 kB | 169 kBProgress (2): 798/804 kB | 169 kBProgress (2): 802/804 kB | 169 kBProgress (2): 804 kB | 169 kB                                 Downloaded from central: https://repo.maven.apache.org/maven2/org/codehaus/plexus/plexus-utils/1.1/plexus-utils-1.1.jar (169 kB at 1.1 MB/s)
Downloaded from central: https://repo.maven.apache.org/maven2/org/apache/maven/surefire/maven-surefire-common/3.0.0-M4/maven-surefire-common-3.0.0-M4.jar (804 kB at 5.3 MB/s)
Downloading from central: https://repo.maven.apache.org/maven2/junit/junit/4.12/junit-4.12.pom
Progress (1): 4.1/24 kBProgress (1): 7.7/24 kBProgress (1): 12/24 kB Progress (1): 16/24 kBProgress (1): 20/24 kBProgress (1): 24 kB                      Downloaded from central: https://repo.maven.apache.org/maven2/junit/junit/4.12/junit-4.12.pom (24 kB at 1.5 MB/s)
Downloading from central: https://repo.maven.apache.org/maven2/com/github/stephenc/jcip/jcip-annotations/1.0-1/jcip-annotations-1.0-1.pom
Progress (1): 2.2/5.4 kBProgress (1): 5.0/5.4 kBProgress (1): 5.4 kB                        Downloaded from central: https://repo.maven.apache.org/maven2/com/github/stephenc/jcip/jcip-annotations/1.0-1/jcip-annotations-1.0-1.pom (5.4 kB at 418 kB/s)
Downloading from central: https://repo.maven.apache.org/maven2/org/hamcrest/hamcrest-library/1.3/hamcrest-library-1.3.pom
Progress (1): 820 B                   Downloaded from central: https://repo.maven.apache.org/maven2/org/hamcrest/hamcrest-library/1.3/hamcrest-library-1.3.pom (820 B at 63 kB/s)
Downloading from central: https://repo.maven.apache.org/maven2/org/easytesting/fest-assert/1.4/fest-assert-1.4.pom
Progress (1): 2.2/2.4 kBProgress (1): 2.4 kB                        Downloaded from central: https://repo.maven.apache.org/maven2/org/easytesting/fest-assert/1.4/fest-assert-1.4.pom (2.4 kB at 216 kB/s)
Downloading from central: https://repo.maven.apache.org/maven2/org/easytesting/fest/1.0.8/fest-1.0.8.pom
Progress (1): 2.2/12 kBProgress (1): 5.0/12 kBProgress (1): 7.8/12 kBProgress (1): 11/12 kB Progress (1): 12 kB                      Downloaded from central: https://repo.maven.apache.org/maven2/org/easytesting/fest/1.0.8/fest-1.0.8.pom (12 kB at 931 kB/s)
Downloading from central: https://repo.maven.apache.org/maven2/org/easytesting/fest-util/1.1.6/fest-util-1.1.6.pom
Progress (1): 1.6 kB                    Downloaded from central: https://repo.maven.apache.org/maven2/org/easytesting/fest-util/1.1.6/fest-util-1.1.6.pom (1.6 kB at 130 kB/s)
[INFO]
[INFO] -------------------------------------------------------
[INFO]  T E S T S
[INFO] -------------------------------------------------------
[WARNING] Corrupted STDOUT by directly writing to native stream in forked JVM 1. See FAQ web page and the dump file <https://builds.apache.org/job/POI-DSL-Maven/ws/sonar/main/target/surefire-reports/2020-01-13T04-07-05_523-jvmRun1.dumpstream>
[INFO]
[INFO] Results:
[INFO]
[INFO] Tests run: 0, Failures: 0, Errors: 0, Skipped: 0
[INFO]
[INFO] ------------------------------------------------------------------------
[INFO] Reactor Summary for Apache POI - the Java API for Microsoft Documents 4.1.2-SNAPSHOT:
[INFO]
[INFO] Apache POI - the Java API for Microsoft Documents .. SUCCESS [  7.762 s]
[INFO] Apache POI Main package ............................ FAILURE [ 33.804 s]
[INFO] Apache POI Scratchpad package ...................... SKIPPED
[INFO] Apache POI - Openxmlformats Schema package ......... SKIPPED
[INFO] Apache POI - Openxmlformats Encryption Schema package SKIPPED
[INFO] Apache POI - Openxmlformats Security-Schema package  SKIPPED
[INFO] Apache POI OOXML package ........................... SKIPPED
[INFO] Apache POI ExcelAnt package ........................ SKIPPED
[INFO] Apache POI Examples package ........................ SKIPPED
[INFO] Apache POI integration test ........................ SKIPPED
[INFO] ------------------------------------------------------------------------
[INFO] BUILD FAILURE
[INFO] ------------------------------------------------------------------------
[INFO] Total time:  41.809 s
[INFO] Finished at: 2020-01-13T04:07:06Z
[INFO] ------------------------------------------------------------------------
[ERROR] Failed to execute goal org.apache.maven.plugins:maven-surefire-plugin:3.0.0-M4:test (default-test) on project poi-main: There are test failures.
[ERROR]
[ERROR] Please refer to <https://builds.apache.org/job/POI-DSL-Maven/ws/sonar/main/target/surefire-reports> for the individual test results.
[ERROR] Please refer to dump files (if any exist) [date].dump, [date]-jvmRun[N].dump and [date].dumpstream.
[ERROR] The forked VM terminated without properly saying goodbye. VM crash or System.exit called?
[ERROR] Command was /bin/sh -c cd <https://builds.apache.org/job/POI-DSL-Maven/ws/sonar/main> && /usr/local/asfpackages/java/jdk1.8.0_191/jre/bin/java -javaagent:<https://builds.apache.org/job/POI-DSL-Maven/ws/.repository/org/jacoco/org.jacoco.agent/0.8.5/org.jacoco.agent-0.8.5-runtime.jar=destfile=/home/jenkins/jenkins-slave/workspace/POI-DSL-Maven/sonar/main/target/jacoco.exec> -Xmx1024m -Duser.language=en -Duser.country=US -Xmx1024m -Djava.io.tmpdir=<https://builds.apache.org/job/POI-DSL-Maven/ws/sonar/main/target/tmp> -XX:-OmitStackTraceInFastThrow -jar <https://builds.apache.org/job/POI-DSL-Maven/ws/sonar/main/target/surefire/surefirebooter3000768194127556077.jar> <https://builds.apache.org/job/POI-DSL-Maven/ws/sonar/main/target/surefire> 2020-01-13T04-07-05_523-jvmRun1 surefire8315948625931563350tmp surefire_06684774173568857318tmp
[ERROR] Error occurred in starting fork, check output in log
[ERROR] Process Exit Code: 1
[ERROR] org.apache.maven.surefire.booter.SurefireBooterForkException: The forked VM terminated without properly saying goodbye. VM crash or System.exit called?
[ERROR] Command was /bin/sh -c cd <https://builds.apache.org/job/POI-DSL-Maven/ws/sonar/main> && /usr/local/asfpackages/java/jdk1.8.0_191/jre/bin/java -javaagent:<https://builds.apache.org/job/POI-DSL-Maven/ws/.repository/org/jacoco/org.jacoco.agent/0.8.5/org.jacoco.agent-0.8.5-runtime.jar=destfile=/home/jenkins/jenkins-slave/workspace/POI-DSL-Maven/sonar/main/target/jacoco.exec> -Xmx1024m -Duser.language=en -Duser.country=US -Xmx1024m -Djava.io.tmpdir=<https://builds.apache.org/job/POI-DSL-Maven/ws/sonar/main/target/tmp> -XX:-OmitStackTraceInFastThrow -jar <https://builds.apache.org/job/POI-DSL-Maven/ws/sonar/main/target/surefire/surefirebooter3000768194127556077.jar> <https://builds.apache.org/job/POI-DSL-Maven/ws/sonar/main/target/surefire> 2020-01-13T04-07-05_523-jvmRun1 surefire8315948625931563350tmp surefire_06684774173568857318tmp
[ERROR] Error occurred in starting fork, check output in log
[ERROR] Process Exit Code: 1
[ERROR] at org.apache.maven.plugin.surefire.booterclient.ForkStarter.fork(ForkStarter.java:690)
[ERROR] at org.apache.maven.plugin.surefire.booterclient.ForkStarter.run(ForkStarter.java:285)
[ERROR] at org.apache.maven.plugin.surefire.booterclient.ForkStarter.run(ForkStarter.java:248)
[ERROR] at org.apache.maven.plugin.surefire.AbstractSurefireMojo.executeProvider(AbstractSurefireMojo.java:1217)
[ERROR] at org.apache.maven.plugin.surefire.AbstractSurefireMojo.executeAfterPreconditionsChecked(AbstractSurefireMojo.java:1063)
[ERROR] at org.apache.maven.plugin.surefire.AbstractSurefireMojo.execute(AbstractSurefireMojo.java:889)
[ERROR] at org.apache.maven.plugin.DefaultBuildPluginManager.executeMojo(DefaultBuildPluginManager.java:137)
[ERROR] at org.apache.maven.lifecycle.internal.MojoExecutor.execute(MojoExecutor.java:210)
[ERROR] at org.apache.maven.lifecycle.internal.MojoExecutor.execute(MojoExecutor.java:156)
[ERROR] at org.apache.maven.lifecycle.internal.MojoExecutor.execute(MojoExecutor.java:148)
[ERROR] at org.apache.maven.lifecycle.internal.LifecycleModuleBuilder.buildProject(LifecycleModuleBuilder.java:117)
[ERROR] at org.apache.maven.lifecycle.internal.LifecycleModuleBuilder.buildProject(LifecycleModuleBuilder.java:81)
[ERROR] at org.apache.maven.lifecycle.internal.builder.singlethreaded.SingleThreadedBuilder.build(SingleThreadedBuilder.java:56)
[ERROR] at org.apache.maven.lifecycle.internal.LifecycleStarter.execute(LifecycleStarter.java:128)
[ERROR] at org.apache.maven.DefaultMaven.doExecute(DefaultMaven.java:305)
[ERROR] at org.apache.maven.DefaultMaven.doExecute(DefaultMaven.java:192)
[ERROR] at org.apache.maven.DefaultMaven.execute(DefaultMaven.java:105)
[ERROR] at org.apache.maven.cli.MavenCli.execute(MavenCli.java:956)
[ERROR] at org.apache.maven.cli.MavenCli.doMain(MavenCli.java:288)
[ERROR] at org.apache.maven.cli.MavenCli.main(MavenCli.java:192)
[ERROR] at sun.reflect.NativeMethodAccessorImpl.invoke0(Native Method)
[ERROR] at sun.reflect.NativeMethodAccessorImpl.invoke(NativeMethodAccessorImpl.java:62)
[ERROR] at sun.reflect.DelegatingMethodAccessorImpl.invoke(DelegatingMethodAccessorImpl.java:43)
[ERROR] at java.lang.reflect.Method.invoke(Method.java:498)
[ERROR] at org.codehaus.plexus.classworlds.launcher.Launcher.launchEnhanced(Launcher.java:282)
[ERROR] at org.codehaus.plexus.classworlds.launcher.Launcher.launch(Launcher.java:225)
[ERROR] at org.codehaus.plexus.classworlds.launcher.Launcher.mainWithExitCode(Launcher.java:406)
[ERROR] at org.codehaus.plexus.classworlds.launcher.Launcher.main(Launcher.java:347)
[ERROR]
[ERROR] -> [Help 1]
[ERROR]
[ERROR] To see the full stack trace of the errors, re-run Maven with the -e switch.
[ERROR] Re-run Maven using the -X switch to enable full debug logging.
[ERROR]
[ERROR] For more information about the errors and possible solutions, please read the following articles:
[ERROR] [Help 1] http://cwiki.apache.org/confluence/display/MAVEN/MojoExecutionException
[ERROR]
[ERROR] After correcting the problems, you can resume the build with the command
[ERROR]   mvn <args> -rf :poi-main
Build step 'Invoke top-level Maven targets' marked build as failure
Recording test results
ERROR: Step ?Publish JUnit test result report? failed: No test report files were found. Configuration error?

---------------------------------------------------------------------
To unsubscribe, e-mail: [hidden email]
For additional commands, e-mail: [hidden email]

Reply | Threaded
Open this post in threaded view
|

Build failed in Jenkins: POI-DSL-Maven #1017

Apache Jenkins Server
See <https://builds.apache.org/job/POI-DSL-Maven/1017/display/redirect?page=changes>

Changes:

[centic] Adjust JavaDoc for stream-based reading of large workbooks


------------------------------------------
[...truncated 371.42 KB...]
AU        src/documentation/content/xdocs/components/slideshow/index.xml
AU        src/documentation/content/xdocs/components/slideshow/ppt-file-format.xml
AU        src/documentation/content/xdocs/components/slideshow/quick-guide.xml
AU        src/documentation/content/xdocs/components/slideshow/xslf-cookbook.xml
A         src/documentation/content/xdocs/components/poifs
AU        src/documentation/content/xdocs/components/poifs/how-to.xml
AU        src/documentation/content/xdocs/components/poifs/design.xml
AU        src/documentation/content/xdocs/components/poifs/embeded.xml
AU        src/documentation/content/xdocs/components/poifs/fileformat.xml
AU        src/documentation/content/xdocs/components/poifs/index.xml
AU        src/documentation/content/xdocs/components/poifs/usecases.xml
AU        src/documentation/content/xdocs/components/poi-jvm-languages.xml
AU        src/documentation/content/xdocs/components/poi-ruby.xml
A         src/documentation/content/xdocs/components/diagram
AU        src/documentation/content/xdocs/components/diagram/index.xml
A         src/documentation/content/xdocs/components/document
AU        src/documentation/content/xdocs/components/document/docoverview.xml
AU        src/documentation/content/xdocs/components/document/index.xml
AU        src/documentation/content/xdocs/components/document/projectplan.xml
AU        src/documentation/content/xdocs/components/document/quick-guide-xwpf.xml
AU        src/documentation/content/xdocs/components/document/quick-guide.xml
A         src/documentation/content/xdocs/components/hmef
AU        src/documentation/content/xdocs/components/hmef/index.xml
A         src/documentation/content/xdocs/components/hpbf
AU        src/documentation/content/xdocs/components/hpbf/file-format.xml
AU        src/documentation/content/xdocs/components/hpbf/index.xml
A         src/documentation/content/xdocs/components/hsmf
AU        src/documentation/content/xdocs/components/hsmf/index.xml
AU        src/documentation/content/xdocs/components/logging.xml
A         src/documentation/content/xdocs/components/oxml4j
AU        src/documentation/content/xdocs/components/oxml4j/index.xml
AU        src/documentation/content/xdocs/site.xml
AU        src/documentation/content/xdocs/download.xml
AU        src/documentation/content/xdocs/index.xml
A         src/documentation/content/xdocs/apidocs
A         src/documentation/content/xdocs/apidocs/index.xml
AU        src/documentation/content/xdocs/encryption.xml
AU        src/documentation/content/xdocs/status.copy_module_from_bugzilla.py
A         src/documentation/content/xdocs/images
A         src/documentation/content/xdocs/images/poweredby-poi.svg
AU        src/documentation/content/xdocs/images/poweredby-poi-logo.png
AU        src/documentation/content/xdocs/images/project-header.png
A         src/documentation/content/xdocs/images/group.svg
AU        src/documentation/content/xdocs/images/add.png
AU        src/documentation/content/xdocs/images/favicon.ico
AU        src/documentation/content/xdocs/images/fix.png
AU        src/documentation/content/xdocs/images/group-logo.png
AU        src/documentation/content/xdocs/images/icon.png
AU        src/documentation/content/xdocs/images/remove.png
AU        src/documentation/content/xdocs/images/update.png
AU        src/documentation/content/xdocs/images/usemap.gif
AU        src/documentation/content/xdocs/legal.xml
AU        src/documentation/content/xdocs/news.xml
AU        src/documentation/content/xdocs/tabs.xml
AU        src/documentation/content/xdocs/text-extraction.xml
A         src/documentation/content/locationmap.xml
A         src/documentation/resources
A         src/documentation/resources/stylesheets
AU        src/documentation/resources/stylesheets/snipplets2document.xsl
AU        src/documentation/resources/stylesheets/changes2document.xsl
A         src/documentation/resources/images
A         src/documentation/resources/images/project-header.svg
AU        src/documentation/resources/images/support-asf.png
AU        src/documentation/resources/images/project-header.xcf
AU        src/documentation/resources/images/pb-poi.cdr
AU        src/documentation/resources/images/logoRussellBeattie4.png
AU        src/documentation/resources/images/logoAndrewClements.png
AU        src/documentation/resources/images/logoRussellBeattie5.png
AU        src/documentation/resources/images/logoGustafsson1.png
AU        src/documentation/resources/images/logoGustafsson2.png
AU        src/documentation/resources/images/logoKarmokar4s.png
AU        src/documentation/resources/images/old-project-logo.gif
AU        src/documentation/resources/images/logoLoicLefevre2.png
AU        src/documentation/resources/images/POIFSAddDocument.gif
AU        src/documentation/resources/images/utilClasses.gif
AU        src/documentation/resources/images/POIFSClassDiagram.gif
AU        src/documentation/resources/images/logoRandyStanard01.png
AU        src/documentation/resources/images/logoRandyStanard02.png
AU        src/documentation/resources/images/POIFSWriteArchive.gif
AU        src/documentation/resources/images/logoRandyStanard03.png
AU        src/documentation/resources/images/logoRandyStanard04.png
AU        src/documentation/resources/images/logoRandyStanard05.png
AU        src/documentation/resources/images/POIFSWriteFilesystem.gif
AU        src/documentation/resources/images/logoRandyStanard06.png
AU        src/documentation/resources/images/logoRandyStanard07.png
AU        src/documentation/resources/images/built-with-forrest-button.png
AU        src/documentation/resources/images/logoRandyStanard08.png
AU        src/documentation/resources/images/timesheet.jpg
AU        src/documentation/resources/images/poi-logo.png
AU        src/documentation/resources/images/unknown.jpg
AU        src/documentation/resources/images/logoKarmokar1s.png
AU        src/documentation/resources/images/POIFSRootPropertyPreWrite.gif
AU        src/documentation/resources/images/logoWendyWise.png
AU        src/documentation/resources/images/POIFSPropertyTablePreWrite.gif
AU        src/documentation/resources/images/logoKarmokar5s.png
AU        src/documentation/resources/images/ss-features.png
AU        src/documentation/resources/images/businessplan.jpg
AU        src/documentation/resources/images/logoJanssen1.png
AU        src/documentation/resources/images/logoJanssen2.png
AU        src/documentation/resources/images/calendar.jpg
AU        src/documentation/resources/images/loancalc.jpg
AU        src/documentation/resources/images/usermodel.gif
AU        src/documentation/resources/images/logoLoicLefevre.png
AU        src/documentation/resources/images/simple-xls-with-function.jpg
AU        src/documentation/resources/images/logoRaPiGmbH1.png
AU        src/documentation/resources/images/PropertySet.jpg
AU        src/documentation/resources/images/logoRaPiGmbH2.png
AU        src/documentation/resources/images/vba-example.jpg
AU        src/documentation/resources/images/logoKarmokar2s.png
AU        src/documentation/resources/images/logoRaPiGmbH5.png
AU        src/documentation/resources/images/logoRaPiGmbH6.png
AU        src/documentation/resources/images/logoKarmokar6s.png
AU        src/documentation/resources/images/logoRaPiGmbH7.png
AU        src/documentation/resources/images/logoRaPiGmbH8.png
AU        src/documentation/resources/images/logoRaPiGmbH9.png
AU        src/documentation/resources/images/logoDanielFernandez.png
AU        src/documentation/resources/images/logoAndrewClements2.png
AU        src/documentation/resources/images/hslf_shapes.gif
AU        src/documentation/resources/images/logoWendyWise2.png
AU        src/documentation/resources/images/POIFSLifeCycle.gif
AU        src/documentation/resources/images/logoAdria1.png
AU        src/documentation/resources/images/logoAdria2.png
AU        src/documentation/resources/images/logoAdria3.png
AU        src/documentation/resources/images/remove.jpg
AU        src/documentation/resources/images/logoKarmokar3s.png
AU        src/documentation/resources/images/logoGlenStampoutlzis.png
AU        src/documentation/resources/images/logoKarmokar1.png
AU        src/documentation/resources/images/POIFSInitialization.gif
AU        src/documentation/resources/images/logoKarmokar2.png
AU        src/documentation/resources/images/logoRaPiGmbH10.png
AU        src/documentation/resources/images/logoKarmokar3.png
AU        src/documentation/resources/images/logoRaPiGmbH11.png
AU        src/documentation/resources/images/logoMichaelMosmann.png
AU        src/documentation/resources/images/logoKarmokar4.png
AU        src/documentation/resources/images/logoRaPiGmbH12.png
AU        src/documentation/resources/images/logoKarmokar5.png
AU        src/documentation/resources/images/logoKarmokar6.png
AU        src/documentation/resources/images/ApacheConEu08.jpg
AU        src/documentation/resources/images/BlockClassDiagram.gif
AU        src/documentation/resources/images/calculatePayment.jpg
AU        src/documentation/resources/images/PropertyTableClassDiagram.gif
AU        src/documentation/resources/images/logoRussellBeattie1.png
AU        src/documentation/resources/images/logoRussellBeattie2.png
AU        src/documentation/resources/images/logoRussellBeattie3.png
A         src/documentation/resources/schema
A         src/documentation/resources/schema/catalog.xcat
AU        src/documentation/resources/schema/changes-poi.dtd
AU        src/documentation/resources/schema/changes-poi.mod
A         src/documentation/sitemap.xmap
AU        src/documentation/skinconf.xml
AU        src/documentation/release-guide.txt
A         src/documentation/cli.xconf
AU        src/documentation/RELEASE-NOTES.txt
AU        src/documentation/README.txt
A         src/documentation/classes
A         src/documentation/classes/CatalogManager.properties
At revision 1872916

At revision 1872916

No changes for https://svn.apache.org/repos/asf/poi/site/forrest.properties since the previous build
No changes for https://svn.apache.org/repos/asf/poi/site/src/documentation since the previous build
[POI-DSL-Maven] $ /bin/bash -xe /tmp/jenkins8447412467837329380.sh
+ svn status
    X   forrest.properties
X       src/documentation

Performing status on external item at 'src/documentation':
+ echo Java-Home: /home/jenkins/tools/java/latest1.8
Java-Home: /home/jenkins/tools/java/latest1.8
+ ls -al /home/jenkins/tools/java/latest1.8/
total 26000
drwxr-xr-x  7 root root     4096 Oct  2 17:13 .
drwxr-xr-x 27 root root     4096 Oct 13 18:30 ..
drwxr-xr-x  2 root root     4096 Oct  2 17:13 bin
-r--r--r--  1 root root     3244 Oct  6  2018 COPYRIGHT
drwxr-xr-x  3 root root     4096 Oct  2 17:13 include
-rw-r--r--  1 root root  5207154 Sep 12  2018 javafx-src.zip
drwxr-xr-x  5 root root     4096 Oct  2 17:13 jre
drwxr-xr-x  5 root root     4096 Oct  2 17:13 lib
-r--r--r--  1 root root       40 Oct  6  2018 LICENSE
drwxr-xr-x  4 root root     4096 Oct  2 17:13 man
-r--r--r--  1 root root      159 Oct  6  2018 README.html
-rw-r--r--  1 root root      424 Oct  6  2018 release
-rw-r--r--  1 root root 21101479 Oct  6  2018 src.zip
-rw-r--r--  1 root root   108062 Sep 12  2018 THIRDPARTYLICENSEREADME-JAVAFX.txt
-r--r--r--  1 root root   155003 Oct  6  2018 THIRDPARTYLICENSEREADME.txt
+ ls -al /home/jenkins/tools/java/latest1.8/bin
total 904
drwxr-xr-x 2 root root   4096 Oct  2 17:13 .
drwxr-xr-x 7 root root   4096 Oct  2 17:13 ..
-rwxr-xr-x 1 root root   8592 Oct  6  2018 appletviewer
lrwxrwxrwx 1 root root      8 Oct  6  2018 ControlPanel -> jcontrol
-rwxr-xr-x 1 root root   8584 Oct  6  2018 extcheck
-rwxr-xr-x 1 root root   8584 Oct  6  2018 idlj
-rwxr-xr-x 1 root root   8584 Oct  6  2018 jar
-rwxr-xr-x 1 root root   8584 Oct  6  2018 jarsigner
-rwxr-xr-x 1 root root   8464 Oct  6  2018 java
-rwxr-xr-x 1 root root   8584 Oct  6  2018 javac
-rwxr-xr-x 1 root root   8584 Oct  6  2018 javadoc
-rwxr-xr-x 1 root root   2293 Sep 12  2018 javafxpackager
-rwxr-xr-x 1 root root   8584 Oct  6  2018 javah
-rwxr-xr-x 1 root root   8584 Oct  6  2018 javap
-rwxr-xr-x 1 root root   2293 Sep 12  2018 javapackager
-rwxr-xr-x 1 root root   1809 Oct  6  2018 java-rmi.cgi
-rwxr-xr-x 1 root root 140248 Oct  6  2018 javaws
-rwxr-xr-x 1 root root   8584 Oct  6  2018 jcmd
-rwxr-xr-x 1 root root   8608 Oct  6  2018 jconsole
-rwxr-xr-x 1 root root   6264 Oct  6  2018 jcontrol
-rwxr-xr-x 1 root root   8600 Oct  6  2018 jdb
-rwxr-xr-x 1 root root   8584 Oct  6  2018 jdeps
-rwxr-xr-x 1 root root   8584 Oct  6  2018 jhat
-rwxr-xr-x 1 root root   8648 Oct  6  2018 jinfo
-rwxr-xr-x 1 root root   8584 Oct  6  2018 jjs
-rwxr-xr-x 1 root root   8648 Oct  6  2018 jmap
-rwxr-xr-x 1 root root  74675 Dec  8  2017 jmc
-rwxr-xr-x 1 root root    402 Dec  8  2017 jmc.ini
-rwxr-xr-x 1 root root   8584 Oct  6  2018 jps
-rwxr-xr-x 1 root root   8592 Oct  6  2018 jrunscript
-rwxr-xr-x 1 root root   8600 Oct  6  2018 jsadebugd
-rwxr-xr-x 1 root root   8648 Oct  6  2018 jstack
-rwxr-xr-x 1 root root   8584 Oct  6  2018 jstat
-rwxr-xr-x 1 root root   8584 Oct  6  2018 jstatd
-rwxr-xr-x 1 root root   5110 Jan 14  2017 jvisualvm
-rwxr-xr-x 1 root root   8584 Oct  6  2018 keytool
-rwxr-xr-x 1 root root   8592 Oct  6  2018 native2ascii
-rwxr-xr-x 1 root root   8656 Oct  6  2018 orbd
-rwxr-xr-x 1 root root   8584 Oct  6  2018 pack200
-rwxr-xr-x 1 root root   8592 Oct  6  2018 policytool
-rwxr-xr-x 1 root root   8584 Oct  6  2018 rmic
-rwxr-xr-x 1 root root   8584 Oct  6  2018 rmid
-rwxr-xr-x 1 root root   8592 Oct  6  2018 rmiregistry
-rwxr-xr-x 1 root root   8584 Oct  6  2018 schemagen
-rwxr-xr-x 1 root root   8584 Oct  6  2018 serialver
-rwxr-xr-x 1 root root   8592 Oct  6  2018 servertool
-rwxr-xr-x 1 root root   8656 Oct  6  2018 tnameserv
-rwxr-xr-x 1 root root 182536 Oct  6  2018 unpack200
-rwxr-xr-x 1 root root   8584 Oct  6  2018 wsgen
-rwxr-xr-x 1 root root   8584 Oct  6  2018 wsimport
-rwxr-xr-x 1 root root   8584 Oct  6  2018 xjc
+ /home/jenkins/tools/java/latest1.8/bin/java -version
#
# There is insufficient memory for the Java Runtime Environment to continue.
# Cannot create GC thread. Out of system resources.
# An error report file with more information is saved as:
# <https://builds.apache.org/job/POI-DSL-Maven/ws/hs_err_pid12780.log>
Build step 'Execute shell' marked build as failure
Recording test results
ERROR: Step ?Publish JUnit test result report? failed: No test report files were found. Configuration error?

---------------------------------------------------------------------
To unsubscribe, e-mail: [hidden email]
For additional commands, e-mail: [hidden email]

Reply | Threaded
Open this post in threaded view
|

Jenkins build is back to normal : POI-DSL-Maven #1018

Apache Jenkins Server
See <https://builds.apache.org/job/POI-DSL-Maven/1018/display/redirect?page=changes>


---------------------------------------------------------------------
To unsubscribe, e-mail: [hidden email]
For additional commands, e-mail: [hidden email]