Build failed in Jenkins: POI-DSL-IBM-JDK #2

classic Classic list List threaded Threaded
1 message Options
Reply | Threaded
Open this post in threaded view
|

Build failed in Jenkins: POI-DSL-IBM-JDK #2

Apache Jenkins Server
See <https://builds.apache.org/job/POI-DSL-IBM-JDK/2/display/redirect>

------------------------------------------
[...truncated 457.74 KB...]
     [java] at org.apache.poi.poifs.crypt.CryptoFunctions.getCipher(CryptoFunctions.java:226)
     [java] at org.apache.poi.poifs.crypt.dsig.SignatureInfo.signDigest(SignatureInfo.java:352)
     [java] at org.apache.poi.poifs.crypt.dsig.SignatureInfo.confirmSignature(SignatureInfo.java:338)
     [java] at org.apache.poi.poifs.crypt.TestSignatureInfo.testCertChain(TestSignatureInfo.java:624)
     [java] at sun.reflect.NativeMethodAccessorImpl.invoke0(Native Method)
     [java] at sun.reflect.NativeMethodAccessorImpl.invoke(NativeMethodAccessorImpl.java:95)
     [java] at sun.reflect.DelegatingMethodAccessorImpl.invoke(DelegatingMethodAccessorImpl.java:55)
     [java] at java.lang.reflect.Method.invoke(Method.java:508)
     [java] at org.junit.runners.model.FrameworkMethod$1.runReflectiveCall(FrameworkMethod.java:50)
     [java] at org.junit.internal.runners.model.ReflectiveCallable.run(ReflectiveCallable.java:12)
     [java] at org.junit.runners.model.FrameworkMethod.invokeExplosively(FrameworkMethod.java:47)
     [java] at org.junit.internal.runners.statements.InvokeMethod.evaluate(InvokeMethod.java:17)
     [java] at org.junit.runners.ParentRunner.runLeaf(ParentRunner.java:325)
     [java] at org.junit.runners.BlockJUnit4ClassRunner.runChild(BlockJUnit4ClassRunner.java:78)
     [java] at org.junit.runners.BlockJUnit4ClassRunner.runChild(BlockJUnit4ClassRunner.java:57)
     [java] at org.junit.runners.ParentRunner$3.run(ParentRunner.java:290)
     [java] at org.junit.runners.ParentRunner$1.schedule(ParentRunner.java:71)
     [java] at org.junit.runners.ParentRunner.runChildren(ParentRunner.java:288)
     [java] at org.junit.runners.ParentRunner.access$000(ParentRunner.java:58)
     [java] at org.junit.runners.ParentRunner$2.evaluate(ParentRunner.java:268)
     [java] at org.junit.internal.runners.statements.RunBefores.evaluate(RunBefores.java:26)
     [java] at org.junit.internal.runners.statements.RunAfters.evaluate(RunAfters.java:27)
     [java] at org.junit.runners.ParentRunner.run(ParentRunner.java:363)
     [java] at org.junit.runners.Suite.runChild(Suite.java:128)
     [java] at org.junit.runners.Suite.runChild(Suite.java:27)
     [java] at org.junit.runners.ParentRunner$3.run(ParentRunner.java:290)
     [java] at org.junit.runners.ParentRunner$1.schedule(ParentRunner.java:71)
     [java] at org.junit.runners.ParentRunner.runChildren(ParentRunner.java:288)
     [java] at org.junit.runners.ParentRunner.access$000(ParentRunner.java:58)
     [java] at org.junit.runners.ParentRunner$2.evaluate(ParentRunner.java:268)
     [java] at org.junit.runners.ParentRunner.run(ParentRunner.java:363)
     [java] at org.junit.runner.JUnitCore.run(JUnitCore.java:137)
     [java] at org.junit.runner.JUnitCore.run(JUnitCore.java:115)
     [java] at org.junit.runner.JUnitCore.run(JUnitCore.java:105)
     [java] at org.junit.runner.JUnitCore.run(JUnitCore.java:94)
     [java] at org.apache.poi.util.OOXMLLite.build(OOXMLLite.java:143)
     [java] at org.apache.poi.util.OOXMLLite.main(OOXMLLite.java:88)
     [java] 18) testManipulation(org.apache.poi.poifs.crypt.TestSignatureInfo)
     [java] org.apache.poi.EncryptedDocumentException: Export Restrictions in place - please install JCE Unlimited Strength Jurisdiction Policy files
     [java] at org.apache.poi.poifs.crypt.CryptoFunctions.getCipher(CryptoFunctions.java:226)
     [java] at org.apache.poi.poifs.crypt.dsig.SignatureInfo.signDigest(SignatureInfo.java:352)
     [java] at org.apache.poi.poifs.crypt.TestSignatureInfo.sign(TestSignatureInfo.java:748)
     [java] at org.apache.poi.poifs.crypt.TestSignatureInfo.testManipulation(TestSignatureInfo.java:352)
     [java] at sun.reflect.NativeMethodAccessorImpl.invoke0(Native Method)
     [java] at sun.reflect.NativeMethodAccessorImpl.invoke(NativeMethodAccessorImpl.java:95)
     [java] at sun.reflect.DelegatingMethodAccessorImpl.invoke(DelegatingMethodAccessorImpl.java:55)
     [java] at java.lang.reflect.Method.invoke(Method.java:508)
     [java] at org.junit.runners.model.FrameworkMethod$1.runReflectiveCall(FrameworkMethod.java:50)
     [java] at org.junit.internal.runners.model.ReflectiveCallable.run(ReflectiveCallable.java:12)
     [java] at org.junit.runners.model.FrameworkMethod.invokeExplosively(FrameworkMethod.java:47)
     [java] at org.junit.internal.runners.statements.InvokeMethod.evaluate(InvokeMethod.java:17)
     [java] at org.junit.runners.ParentRunner.runLeaf(ParentRunner.java:325)
     [java] at org.junit.runners.BlockJUnit4ClassRunner.runChild(BlockJUnit4ClassRunner.java:78)
     [java] at org.junit.runners.BlockJUnit4ClassRunner.runChild(BlockJUnit4ClassRunner.java:57)
     [java] at org.junit.runners.ParentRunner$3.run(ParentRunner.java:290)
     [java] at org.junit.runners.ParentRunner$1.schedule(ParentRunner.java:71)
     [java] at org.junit.runners.ParentRunner.runChildren(ParentRunner.java:288)
     [java] at org.junit.runners.ParentRunner.access$000(ParentRunner.java:58)
     [java] at org.junit.runners.ParentRunner$2.evaluate(ParentRunner.java:268)
     [java] at org.junit.internal.runners.statements.RunBefores.evaluate(RunBefores.java:26)
     [java] at org.junit.internal.runners.statements.RunAfters.evaluate(RunAfters.java:27)
     [java] at org.junit.runners.ParentRunner.run(ParentRunner.java:363)
     [java] at org.junit.runners.Suite.runChild(Suite.java:128)
     [java] at org.junit.runners.Suite.runChild(Suite.java:27)
     [java] at org.junit.runners.ParentRunner$3.run(ParentRunner.java:290)
     [java] at org.junit.runners.ParentRunner$1.schedule(ParentRunner.java:71)
     [java] at org.junit.runners.ParentRunner.runChildren(ParentRunner.java:288)
     [java] at org.junit.runners.ParentRunner.access$000(ParentRunner.java:58)
     [java] at org.junit.runners.ParentRunner$2.evaluate(ParentRunner.java:268)
     [java] at org.junit.runners.ParentRunner.run(ParentRunner.java:363)
     [java] at org.junit.runner.JUnitCore.run(JUnitCore.java:137)
     [java] at org.junit.runner.JUnitCore.run(JUnitCore.java:115)
     [java] at org.junit.runner.JUnitCore.run(JUnitCore.java:105)
     [java] at org.junit.runner.JUnitCore.run(JUnitCore.java:94)
     [java] at org.apache.poi.util.OOXMLLite.build(OOXMLLite.java:143)
     [java] at org.apache.poi.util.OOXMLLite.main(OOXMLLite.java:88)
     [java] 19) testSignSpreadsheet(org.apache.poi.poifs.crypt.TestSignatureInfo)
     [java] org.apache.poi.EncryptedDocumentException: Export Restrictions in place - please install JCE Unlimited Strength Jurisdiction Policy files
     [java] at org.apache.poi.poifs.crypt.CryptoFunctions.getCipher(CryptoFunctions.java:226)
     [java] at org.apache.poi.poifs.crypt.dsig.SignatureInfo.signDigest(SignatureInfo.java:352)
     [java] at org.apache.poi.poifs.crypt.TestSignatureInfo.sign(TestSignatureInfo.java:748)
     [java] at org.apache.poi.poifs.crypt.TestSignatureInfo.testSignSpreadsheet(TestSignatureInfo.java:342)
     [java] at sun.reflect.NativeMethodAccessorImpl.invoke0(Native Method)
     [java] at sun.reflect.NativeMethodAccessorImpl.invoke(NativeMethodAccessorImpl.java:95)
     [java] at sun.reflect.DelegatingMethodAccessorImpl.invoke(DelegatingMethodAccessorImpl.java:55)
     [java] at java.lang.reflect.Method.invoke(Method.java:508)
     [java] at org.junit.runners.model.FrameworkMethod$1.runReflectiveCall(FrameworkMethod.java:50)
     [java] at org.junit.internal.runners.model.ReflectiveCallable.run(ReflectiveCallable.java:12)
     [java] at org.junit.runners.model.FrameworkMethod.invokeExplosively(FrameworkMethod.java:47)
     [java] at org.junit.internal.runners.statements.InvokeMethod.evaluate(InvokeMethod.java:17)
     [java] at org.junit.runners.ParentRunner.runLeaf(ParentRunner.java:325)
     [java] at org.junit.runners.BlockJUnit4ClassRunner.runChild(BlockJUnit4ClassRunner.java:78)
     [java] at org.junit.runners.BlockJUnit4ClassRunner.runChild(BlockJUnit4ClassRunner.java:57)
     [java] at org.junit.runners.ParentRunner$3.run(ParentRunner.java:290)
     [java] at org.junit.runners.ParentRunner$1.schedule(ParentRunner.java:71)
     [java] at org.junit.runners.ParentRunner.runChildren(ParentRunner.java:288)
     [java] at org.junit.runners.ParentRunner.access$000(ParentRunner.java:58)
     [java] at org.junit.runners.ParentRunner$2.evaluate(ParentRunner.java:268)
     [java] at org.junit.internal.runners.statements.RunBefores.evaluate(RunBefores.java:26)
     [java] at org.junit.internal.runners.statements.RunAfters.evaluate(RunAfters.java:27)
     [java] at org.junit.runners.ParentRunner.run(ParentRunner.java:363)
     [java] at org.junit.runners.Suite.runChild(Suite.java:128)
     [java] at org.junit.runners.Suite.runChild(Suite.java:27)
     [java] at org.junit.runners.ParentRunner$3.run(ParentRunner.java:290)
     [java] at org.junit.runners.ParentRunner$1.schedule(ParentRunner.java:71)
     [java] at org.junit.runners.ParentRunner.runChildren(ParentRunner.java:288)
     [java] at org.junit.runners.ParentRunner.access$000(ParentRunner.java:58)
     [java] at org.junit.runners.ParentRunner$2.evaluate(ParentRunner.java:268)
     [java] at org.junit.runners.ParentRunner.run(ParentRunner.java:363)
     [java] at org.junit.runner.JUnitCore.run(JUnitCore.java:137)
     [java] at org.junit.runner.JUnitCore.run(JUnitCore.java:115)
     [java] at org.junit.runner.JUnitCore.run(JUnitCore.java:105)
     [java] at org.junit.runner.JUnitCore.run(JUnitCore.java:94)
     [java] at org.apache.poi.util.OOXMLLite.build(OOXMLLite.java:143)
     [java] at org.apache.poi.util.OOXMLLite.main(OOXMLLite.java:88)
     [java] 20) testSignSpreadsheetWithSignatureInfo(org.apache.poi.poifs.crypt.TestSignatureInfo)
     [java] org.apache.poi.EncryptedDocumentException: Export Restrictions in place - please install JCE Unlimited Strength Jurisdiction Policy files
     [java] at org.apache.poi.poifs.crypt.CryptoFunctions.getCipher(CryptoFunctions.java:226)
     [java] at org.apache.poi.poifs.crypt.dsig.SignatureInfo.signDigest(SignatureInfo.java:352)
     [java] at org.apache.poi.poifs.crypt.dsig.SignatureInfo.confirmSignature(SignatureInfo.java:338)
     [java] at org.apache.poi.poifs.crypt.TestSignatureInfo.testSignSpreadsheetWithSignatureInfo(TestSignatureInfo.java:386)
     [java] at sun.reflect.NativeMethodAccessorImpl.invoke0(Native Method)
     [java] at sun.reflect.NativeMethodAccessorImpl.invoke(NativeMethodAccessorImpl.java:95)
     [java] at sun.reflect.DelegatingMethodAccessorImpl.invoke(DelegatingMethodAccessorImpl.java:55)
     [java] at java.lang.reflect.Method.invoke(Method.java:508)
     [java] at org.junit.runners.model.FrameworkMethod$1.runReflectiveCall(FrameworkMethod.java:50)
     [java] at org.junit.internal.runners.model.ReflectiveCallable.run(ReflectiveCallable.java:12)
     [java] at org.junit.runners.model.FrameworkMethod.invokeExplosively(FrameworkMethod.java:47)
     [java] at org.junit.internal.runners.statements.InvokeMethod.evaluate(InvokeMethod.java:17)
     [java] at org.junit.runners.ParentRunner.runLeaf(ParentRunner.java:325)
     [java] at org.junit.runners.BlockJUnit4ClassRunner.runChild(BlockJUnit4ClassRunner.java:78)
     [java] at org.junit.runners.BlockJUnit4ClassRunner.runChild(BlockJUnit4ClassRunner.java:57)
     [java] at org.junit.runners.ParentRunner$3.run(ParentRunner.java:290)
     [java] at org.junit.runners.ParentRunner$1.schedule(ParentRunner.java:71)
     [java] at org.junit.runners.ParentRunner.runChildren(ParentRunner.java:288)
     [java] at org.junit.runners.ParentRunner.access$000(ParentRunner.java:58)
     [java] at org.junit.runners.ParentRunner$2.evaluate(ParentRunner.java:268)
     [java] at org.junit.internal.runners.statements.RunBefores.evaluate(RunBefores.java:26)
     [java] at org.junit.internal.runners.statements.RunAfters.evaluate(RunAfters.java:27)
     [java] at org.junit.runners.ParentRunner.run(ParentRunner.java:363)
     [java] at org.junit.runners.Suite.runChild(Suite.java:128)
     [java] at org.junit.runners.Suite.runChild(Suite.java:27)
     [java] at org.junit.runners.ParentRunner$3.run(ParentRunner.java:290)
     [java] at org.junit.runners.ParentRunner$1.schedule(ParentRunner.java:71)
     [java] at org.junit.runners.ParentRunner.runChildren(ParentRunner.java:288)
     [java] at org.junit.runners.ParentRunner.access$000(ParentRunner.java:58)
     [java] at org.junit.runners.ParentRunner$2.evaluate(ParentRunner.java:268)
     [java] at org.junit.runners.ParentRunner.run(ParentRunner.java:363)
     [java] at org.junit.runner.JUnitCore.run(JUnitCore.java:137)
     [java] at org.junit.runner.JUnitCore.run(JUnitCore.java:115)
     [java] at org.junit.runner.JUnitCore.run(JUnitCore.java:105)
     [java] at org.junit.runner.JUnitCore.run(JUnitCore.java:94)
     [java] at org.apache.poi.util.OOXMLLite.build(OOXMLLite.java:143)
     [java] at org.apache.poi.util.OOXMLLite.main(OOXMLLite.java:88)
     [java] 21) testSignEnvelopingDocument(org.apache.poi.poifs.crypt.TestSignatureInfo)
     [java] org.apache.poi.EncryptedDocumentException: Export Restrictions in place - please install JCE Unlimited Strength Jurisdiction Policy files
     [java] at org.apache.poi.poifs.crypt.CryptoFunctions.getCipher(CryptoFunctions.java:226)
     [java] at org.apache.poi.poifs.crypt.dsig.SignatureInfo.signDigest(SignatureInfo.java:352)
     [java] at org.apache.poi.poifs.crypt.dsig.SignatureInfo.confirmSignature(SignatureInfo.java:338)
     [java] at org.apache.poi.poifs.crypt.TestSignatureInfo.testSignEnvelopingDocument(TestSignatureInfo.java:488)
     [java] at sun.reflect.NativeMethodAccessorImpl.invoke0(Native Method)
     [java] at sun.reflect.NativeMethodAccessorImpl.invoke(NativeMethodAccessorImpl.java:95)
     [java] at sun.reflect.DelegatingMethodAccessorImpl.invoke(DelegatingMethodAccessorImpl.java:55)
     [java] at java.lang.reflect.Method.invoke(Method.java:508)
     [java] at org.junit.runners.model.FrameworkMethod$1.runReflectiveCall(FrameworkMethod.java:50)
     [java] at org.junit.internal.runners.model.ReflectiveCallable.run(ReflectiveCallable.java:12)
     [java] at org.junit.runners.model.FrameworkMethod.invokeExplosively(FrameworkMethod.java:47)
     [java] at org.junit.internal.runners.statements.InvokeMethod.evaluate(InvokeMethod.java:17)
     [java] at org.junit.runners.ParentRunner.runLeaf(ParentRunner.java:325)
     [java] at org.junit.runners.BlockJUnit4ClassRunner.runChild(BlockJUnit4ClassRunner.java:78)
     [java] at org.junit.runners.BlockJUnit4ClassRunner.runChild(BlockJUnit4ClassRunner.java:57)
     [java] at org.junit.runners.ParentRunner$3.run(ParentRunner.java:290)
     [java] at org.junit.runners.ParentRunner$1.schedule(ParentRunner.java:71)
     [java] at org.junit.runners.ParentRunner.runChildren(ParentRunner.java:288)
     [java] at org.junit.runners.ParentRunner.access$000(ParentRunner.java:58)
     [java] at org.junit.runners.ParentRunner$2.evaluate(ParentRunner.java:268)
     [java] at org.junit.internal.runners.statements.RunBefores.evaluate(RunBefores.java:26)
     [java] at org.junit.internal.runners.statements.RunAfters.evaluate(RunAfters.java:27)
     [java] at org.junit.runners.ParentRunner.run(ParentRunner.java:363)
     [java] at org.junit.runners.Suite.runChild(Suite.java:128)
     [java] at org.junit.runners.Suite.runChild(Suite.java:27)
     [java] at org.junit.runners.ParentRunner$3.run(ParentRunner.java:290)
     [java] at org.junit.runners.ParentRunner$1.schedule(ParentRunner.java:71)
     [java] at org.junit.runners.ParentRunner.runChildren(ParentRunner.java:288)
     [java] at org.junit.runners.ParentRunner.access$000(ParentRunner.java:58)
     [java] at org.junit.runners.ParentRunner$2.evaluate(ParentRunner.java:268)
     [java] at org.junit.runners.ParentRunner.run(ParentRunner.java:363)
     [java] at org.junit.runner.JUnitCore.run(JUnitCore.java:137)
     [java] at org.junit.runner.JUnitCore.run(JUnitCore.java:115)
     [java] at org.junit.runner.JUnitCore.run(JUnitCore.java:105)
     [java] at org.junit.runner.JUnitCore.run(JUnitCore.java:94)
     [java] at org.apache.poi.util.OOXMLLite.build(OOXMLLite.java:143)
     [java] at org.apache.poi.util.OOXMLLite.main(OOXMLLite.java:88)
     [java] 22) testNonSha1(org.apache.poi.poifs.crypt.TestSignatureInfo)
     [java] org.apache.poi.EncryptedDocumentException: Export Restrictions in place - please install JCE Unlimited Strength Jurisdiction Policy files
     [java] at org.apache.poi.poifs.crypt.CryptoFunctions.getCipher(CryptoFunctions.java:226)
     [java] at org.apache.poi.poifs.crypt.dsig.SignatureInfo.signDigest(SignatureInfo.java:352)
     [java] at org.apache.poi.poifs.crypt.dsig.SignatureInfo.confirmSignature(SignatureInfo.java:338)
     [java] at org.apache.poi.poifs.crypt.TestSignatureInfo.testNonSha1(TestSignatureInfo.java:659)
     [java] at sun.reflect.NativeMethodAccessorImpl.invoke0(Native Method)
     [java] at sun.reflect.NativeMethodAccessorImpl.invoke(NativeMethodAccessorImpl.java:95)
     [java] at sun.reflect.DelegatingMethodAccessorImpl.invoke(DelegatingMethodAccessorImpl.java:55)
     [java] at java.lang.reflect.Method.invoke(Method.java:508)
     [java] at org.junit.runners.model.FrameworkMethod$1.runReflectiveCall(FrameworkMethod.java:50)
     [java] at org.junit.internal.runners.model.ReflectiveCallable.run(ReflectiveCallable.java:12)
     [java] at org.junit.runners.model.FrameworkMethod.invokeExplosively(FrameworkMethod.java:47)
     [java] at org.junit.internal.runners.statements.InvokeMethod.evaluate(InvokeMethod.java:17)
     [java] at org.junit.runners.ParentRunner.runLeaf(ParentRunner.java:325)
     [java] at org.junit.runners.BlockJUnit4ClassRunner.runChild(BlockJUnit4ClassRunner.java:78)
     [java] at org.junit.runners.BlockJUnit4ClassRunner.runChild(BlockJUnit4ClassRunner.java:57)
     [java] at org.junit.runners.ParentRunner$3.run(ParentRunner.java:290)
     [java] at org.junit.runners.ParentRunner$1.schedule(ParentRunner.java:71)
     [java] at org.junit.runners.ParentRunner.runChildren(ParentRunner.java:288)
     [java] at org.junit.runners.ParentRunner.access$000(ParentRunner.java:58)
     [java] at org.junit.runners.ParentRunner$2.evaluate(ParentRunner.java:268)
     [java] at org.junit.internal.runners.statements.RunBefores.evaluate(RunBefores.java:26)
     [java] at org.junit.internal.runners.statements.RunAfters.evaluate(RunAfters.java:27)
     [java] at org.junit.runners.ParentRunner.run(ParentRunner.java:363)
     [java] at org.junit.runners.Suite.runChild(Suite.java:128)
     [java] at org.junit.runners.Suite.runChild(Suite.java:27)
     [java] at org.junit.runners.ParentRunner$3.run(ParentRunner.java:290)
     [java] at org.junit.runners.ParentRunner$1.schedule(ParentRunner.java:71)
     [java] at org.junit.runners.ParentRunner.runChildren(ParentRunner.java:288)
     [java] at org.junit.runners.ParentRunner.access$000(ParentRunner.java:58)
     [java] at org.junit.runners.ParentRunner$2.evaluate(ParentRunner.java:268)
     [java] at org.junit.runners.ParentRunner.run(ParentRunner.java:363)
     [java] at org.junit.runner.JUnitCore.run(JUnitCore.java:137)
     [java] at org.junit.runner.JUnitCore.run(JUnitCore.java:115)
     [java] at org.junit.runner.JUnitCore.run(JUnitCore.java:105)
     [java] at org.junit.runner.JUnitCore.run(JUnitCore.java:94)
     [java] at org.apache.poi.util.OOXMLLite.build(OOXMLLite.java:143)
     [java] at org.apache.poi.util.OOXMLLite.main(OOXMLLite.java:88)
     [java]
     [java] FAILURES!!!
     [java] Tests run: 2255,  Failures: 22
     [java]

BUILD FAILED
<https://builds.apache.org/job/POI-DSL-IBM-JDK/ws/build.xml>:1681: Java returned: 1

Total time: 6 minutes 52 seconds
Build step 'Invoke Ant' marked build as failure
Skipping publisher since build result is FAILURE
Archiving artifacts
[Fast Archiver] No prior successful build to compare, so performing full copy of artifacts
Skipping publisher since build result is FAILURE
Recording test results
ERROR: Step ‘Publish JUnit test result report’ failed: No test report files were found. Configuration error?


---------------------------------------------------------------------
To unsubscribe, e-mail: [hidden email]
For additional commands, e-mail: [hidden email]