Build failed in Jenkins: POI-DSL-Github-PullRequests #1

classic Classic list List threaded Threaded
5 messages Options
Reply | Threaded
Open this post in threaded view
|

Build failed in Jenkins: POI-DSL-Github-PullRequests #1

Apache Jenkins Server
See <https://builds.apache.org/job/POI-DSL-Github-PullRequests/1/display/redirect>

------------------------------------------
[...truncated 123.53 KB...]
    [junit] Running org.apache.poi.hwpf.model.TestCHPBinTable
    [junit] Tests run: 1, Failures: 0, Errors: 0, Skipped: 0, Time elapsed: 0.001 sec
    [junit] Running org.apache.poi.hwpf.model.TestDocumentProperties
    [junit] Tests run: 1, Failures: 0, Errors: 0, Skipped: 0, Time elapsed: 0.003 sec
    [junit] Running org.apache.poi.hwpf.model.TestFileInformationBlock
    [junit] Tests run: 1, Failures: 0, Errors: 0, Skipped: 0, Time elapsed: 0.002 sec
    [junit] Running org.apache.poi.hwpf.model.TestFontTable
    [junit] Tests run: 1, Failures: 0, Errors: 0, Skipped: 0, Time elapsed: 0 sec
    [junit] Running org.apache.poi.hwpf.model.TestListTables
    [junit] Tests run: 1, Failures: 0, Errors: 0, Skipped: 0, Time elapsed: 0.001 sec
    [junit] Running org.apache.poi.hwpf.model.TestNotesTables
    [junit] Tests run: 1, Failures: 0, Errors: 0, Skipped: 0, Time elapsed: 0.001 sec
    [junit] Running org.apache.poi.hwpf.model.TestPAPBinTable
    [junit] Tests run: 2, Failures: 0, Errors: 0, Skipped: 0, Time elapsed: 0.007 sec
    [junit] Running org.apache.poi.hwpf.model.TestPlexOfCps
    [junit] Tests run: 1, Failures: 0, Errors: 0, Skipped: 0, Time elapsed: 0.002 sec
    [junit] Running org.apache.poi.hwpf.model.TestRevisionMarkAuthorTable
    [junit] Tests run: 3, Failures: 0, Errors: 0, Skipped: 0, Time elapsed: 0.004 sec
    [junit] Running org.apache.poi.hwpf.model.TestSavedByTable
    [junit] Tests run: 1, Failures: 0, Errors: 0, Skipped: 0, Time elapsed: 0.013 sec
    [junit] Running org.apache.poi.hwpf.model.TestSectionTable
    [junit] Tests run: 1, Failures: 0, Errors: 0, Skipped: 0, Time elapsed: 0.002 sec
    [junit] Running org.apache.poi.hwpf.model.TestStyleSheet
    [junit] Tests run: 2, Failures: 0, Errors: 0, Skipped: 0, Time elapsed: 0.002 sec
    [junit] Running org.apache.poi.hwpf.model.TestTextPieceTable
    [junit] Tests run: 4, Failures: 0, Errors: 0, Skipped: 0, Time elapsed: 0.008 sec
    [junit] Running org.apache.poi.hwpf.sprm.TestSprms
    [junit] Tests run: 2, Failures: 0, Errors: 0, Skipped: 0, Time elapsed: 0.004 sec
    [junit] Running org.apache.poi.hwpf.usermodel.TestBorderCode
    [junit] Tests run: 1, Failures: 0, Errors: 0, Skipped: 0, Time elapsed: 0.002 sec
    [junit] Running org.apache.poi.hwpf.usermodel.TestBug46610
    [junit] Tests run: 3, Failures: 0, Errors: 0, Skipped: 0, Time elapsed: 0.006 sec
    [junit] Running org.apache.poi.hwpf.usermodel.TestBug47563
    [junit] Tests run: 1, Failures: 0, Errors: 0, Skipped: 0, Time elapsed: 0.031 sec
    [junit] Running org.apache.poi.hwpf.usermodel.TestBug49820
    [junit] Tests run: 1, Failures: 0, Errors: 0, Skipped: 0, Time elapsed: 0.001 sec
    [junit] Running org.apache.poi.hwpf.usermodel.TestBug50075
    [junit] Tests run: 1, Failures: 0, Errors: 0, Skipped: 0, Time elapsed: 0.001 sec
    [junit] Running org.apache.poi.hwpf.usermodel.TestBugs
    [junit] Tests run: 39, Failures: 0, Errors: 0, Skipped: 0, Time elapsed: 0.387 sec
    [junit] Running org.apache.poi.hwpf.usermodel.TestHWPFOldDocument
    [junit] Tests run: 14, Failures: 0, Errors: 0, Skipped: 0, Time elapsed: 0.048 sec
    [junit] Running org.apache.poi.hwpf.usermodel.TestHWPFWrite
    [junit] Tests run: 5, Failures: 0, Errors: 0, Skipped: 0, Time elapsed: 0.037 sec
    [junit] Running org.apache.poi.hwpf.usermodel.TestHeaderStories
    [junit] Tests run: 8, Failures: 0, Errors: 0, Skipped: 0, Time elapsed: 0.02 sec
    [junit] Running org.apache.poi.hwpf.usermodel.TestLists
    [junit] Tests run: 7, Failures: 0, Errors: 0, Skipped: 0, Time elapsed: 0.006 sec
    [junit] Running org.apache.poi.hwpf.usermodel.TestOfficeDrawings
    [junit] Tests run: 1, Failures: 0, Errors: 0, Skipped: 0, Time elapsed: 0.002 sec
    [junit] Running org.apache.poi.hwpf.usermodel.TestPictures
    [junit] Tests run: 16, Failures: 0, Errors: 0, Skipped: 2, Time elapsed: 0.055 sec
    [junit] Running org.apache.poi.hwpf.usermodel.TestProblems
    [junit] Tests run: 10, Failures: 0, Errors: 0, Skipped: 0, Time elapsed: 0.012 sec
    [junit] Running org.apache.poi.hwpf.usermodel.TestRange
    [junit] Tests run: 2, Failures: 0, Errors: 0, Skipped: 0, Time elapsed: 0.002 sec
    [junit] Running org.apache.poi.hwpf.usermodel.TestRangeDelete
    [junit] Tests run: 4, Failures: 0, Errors: 0, Skipped: 0, Time elapsed: 0.003 sec
    [junit] Running org.apache.poi.hwpf.usermodel.TestRangeInsertion
    [junit] Tests run: 3, Failures: 0, Errors: 0, Skipped: 0, Time elapsed: 0.002 sec
    [junit] Running org.apache.poi.hwpf.usermodel.TestRangeProperties
    [junit] Tests run: 5, Failures: 0, Errors: 0, Skipped: 0, Time elapsed: 0.005 sec
    [junit] Running org.apache.poi.hwpf.usermodel.TestRangeReplacement
    [junit] Tests run: 4, Failures: 0, Errors: 0, Skipped: 0, Time elapsed: 0.003 sec
    [junit] Running org.apache.poi.hwpf.usermodel.TestRangeSymbols
    [junit] Tests run: 2, Failures: 0, Errors: 0, Skipped: 0, Time elapsed: 0.002 sec
    [junit] Running org.apache.poi.hwpf.usermodel.TestTableRow
    [junit] Tests run: 2, Failures: 0, Errors: 0, Skipped: 0, Time elapsed: 0.002 sec

-test-scratchpad-write-testfile:

-test-ooxml-check:

-ooxml-lite-agent:
      [jar] Building jar: <https://builds.apache.org/job/POI-DSL-Github-PullRequests/ws/build/ooxml-lite-agent.jar>

test-ooxml:
[jacoco:coverage] Enhancing junit with coverage
    [junit] Running org.apache.poi.TestDetectAsOOXML
    [junit] Tests run: 3, Failures: 0, Errors: 0, Skipped: 0, Time elapsed: 0.44 sec
    [junit] Running org.apache.poi.TestEmbedded
    [junit] Tests run: 3, Failures: 0, Errors: 0, Skipped: 0, Time elapsed: 1.461 sec
    [junit] Running org.apache.poi.TestXMLPropertiesTextExtractor
    [junit] Tests run: 5, Failures: 0, Errors: 0, Skipped: 0, Time elapsed: 0.451 sec
    [junit] Running org.apache.poi.extractor.ooxml.TestExtractorFactory
    [junit] Tests run: 15, Failures: 0, Errors: 0, Skipped: 0, Time elapsed: 2.549 sec
    [junit] Running org.apache.poi.ooxml.TestPOIXMLDocument
    [junit] Tests run: 11, Failures: 0, Errors: 0, Skipped: 0, Time elapsed: 2.47 sec
    [junit] Running org.apache.poi.ooxml.TestPOIXMLProperties
    [junit] Tests run: 7, Failures: 0, Errors: 0, Skipped: 1, Time elapsed: 0.157 sec
    [junit] Running org.apache.poi.ooxml.util.TestDocumentHelper
    [junit] Tests run: 2, Failures: 0, Errors: 0, Skipped: 0, Time elapsed: 0.002 sec
    [junit] Running org.apache.poi.ooxml.util.TestSAXHelper
    [junit] Tests run: 1, Failures: 0, Errors: 0, Skipped: 0, Time elapsed: 0.002 sec
    [junit] Running org.apache.poi.openxml4j.opc.TestContentType
    [junit] Tests run: 7, Failures: 0, Errors: 0, Skipped: 0, Time elapsed: 0.035 sec
    [junit] Running org.apache.poi.openxml4j.opc.TestFileHelper
    [junit] Tests run: 1, Failures: 0, Errors: 0, Skipped: 0, Time elapsed: 0.001 sec
    [junit] Running org.apache.poi.openxml4j.opc.TestListParts
    [junit] Tests run: 1, Failures: 0, Errors: 0, Skipped: 0, Time elapsed: 0.004 sec
    [junit] Running org.apache.poi.openxml4j.opc.TestPackage
    [junit] Tests run: 38, Failures: 0, Errors: 0, Skipped: 1, Time elapsed: 1.304 sec
    [junit] Running org.apache.poi.openxml4j.opc.TestPackageCoreProperties
    [junit] Tests run: 7, Failures: 0, Errors: 0, Skipped: 0, Time elapsed: 0.095 sec
    [junit] Running org.apache.poi.openxml4j.opc.TestPackagePartName
    [junit] Tests run: 1, Failures: 0, Errors: 0, Skipped: 0, Time elapsed: 0.001 sec
    [junit] Running org.apache.poi.openxml4j.opc.TestPackageThumbnail
    [junit] Tests run: 1, Failures: 0, Errors: 0, Skipped: 0, Time elapsed: 0.013 sec
    [junit] Running org.apache.poi.openxml4j.opc.TestPackagingURIHelper
    [junit] Tests run: 5, Failures: 0, Errors: 0, Skipped: 0, Time elapsed: 0.002 sec
    [junit] Running org.apache.poi.openxml4j.opc.TestRelationships
    [junit] Tests run: 9, Failures: 0, Errors: 0, Skipped: 0, Time elapsed: 0.075 sec
    [junit] Running org.apache.poi.openxml4j.opc.compliance.TestOPCComplianceCoreProperties
    [junit] Tests run: 11, Failures: 0, Errors: 0, Skipped: 0, Time elapsed: 0.082 sec
    [junit] Running org.apache.poi.openxml4j.opc.compliance.TestOPCCompliancePackageModel
    [junit] Tests run: 5, Failures: 0, Errors: 0, Skipped: 0, Time elapsed: 0.005 sec
    [junit] Running org.apache.poi.openxml4j.opc.compliance.TestOPCCompliancePartName
    [junit] Tests run: 10, Failures: 0, Errors: 0, Skipped: 0, Time elapsed: 0.005 sec
    [junit] Running org.apache.poi.openxml4j.opc.internal.TestContentTypeManager
    [junit] Tests run: 4, Failures: 0, Errors: 0, Skipped: 2, Time elapsed: 0.007 sec
    [junit] Running org.apache.poi.openxml4j.opc.internal.marshallers.TestZipPackagePropertiesMarshaller
    [junit] Tests run: 4, Failures: 0, Errors: 0, Skipped: 0, Time elapsed: 0.003 sec
    [junit] Running org.apache.poi.openxml4j.util.TestZipSecureFile
    [junit] Tests run: 1, Failures: 0, Errors: 0, Skipped: 0, Time elapsed: 0.002 sec
    [junit] Running org.apache.poi.poifs.crypt.TestAgileEncryptionParameters
    [junit] Tests run: 60, Failures: 0, Errors: 0, Skipped: 0, Time elapsed: 11.589 sec
    [junit] Running org.apache.poi.poifs.crypt.TestCertificateEncryption
    [junit] Tests run: 1, Failures: 0, Errors: 0, Skipped: 0, Time elapsed: 0.111 sec
    [junit] Running org.apache.poi.poifs.crypt.TestDecryptor
    [junit] Tests run: 7, Failures: 0, Errors: 0, Skipped: 0, Time elapsed: 0.318 sec
    [junit] Running org.apache.poi.poifs.crypt.TestEncryptionInfo
    [junit] Tests run: 2, Failures: 0, Errors: 0, Skipped: 0, Time elapsed: 0.003 sec
    [junit] Running org.apache.poi.poifs.crypt.TestEncryptor
    [junit] Tests run: 6, Failures: 0, Errors: 0, Skipped: 1, Time elapsed: 0.734 sec
    [junit] Running org.apache.poi.poifs.crypt.TestHxxFEncryption
    [junit] Tests run: 20, Failures: 0, Errors: 0, Skipped: 0, Time elapsed: 0.918 sec
    [junit] Running org.apache.poi.poifs.crypt.TestSecureTempZip
    [junit] Tests run: 2, Failures: 0, Errors: 0, Skipped: 0, Time elapsed: 0.195 sec
    [junit] Running org.apache.poi.poifs.crypt.dsig.TestSignatureConfig
    [junit] Tests run: 2, Failures: 0, Errors: 0, Skipped: 1, Time elapsed: 0.003 sec
    [junit] Running org.apache.poi.sl.TestFonts
    [junit] Tests run: 2, Failures: 0, Errors: 0, Skipped: 0, Time elapsed: 0.416 sec
    [junit] Running org.apache.poi.sl.TestHeadersFooters
    [junit] Tests run: 1, Failures: 0, Errors: 0, Skipped: 0, Time elapsed: 0.026 sec
    [junit] Running org.apache.poi.sl.TestOleShape
    [junit] Tests run: 6, Failures: 0, Errors: 0, Skipped: 0, Time elapsed: 0.33 sec
    [junit] Running org.apache.poi.sl.TestSlide
    [junit] Tests run: 2, Failures: 0, Errors: 0, Skipped: 0, Time elapsed: 0.074 sec
    [junit] Running org.apache.poi.sl.TestTable
    [junit] Tests run: 4, Failures: 0, Errors: 0, Skipped: 0, Time elapsed: 0.139 sec
    [junit] Running org.apache.poi.sl.draw.TestDrawPictureShape
    [junit] Tests run: 2, Failures: 0, Errors: 0, Skipped: 0, Time elapsed: 0.066 sec
    [junit] Running org.apache.poi.ss.TestWorkbookFactory
    [junit] Tests run: 11, Failures: 0, Errors: 0, Skipped: 0, Time elapsed: 0.291 sec
    [junit] Running org.apache.poi.ss.extractor.TestEmbeddedExtractor
    [junit] Tests run: 3, Failures: 0, Errors: 0, Skipped: 0, Time elapsed: 0.262 sec
    [junit] Running org.apache.poi.ss.format.TestCellFormatPart
    [junit] Tests run: 8, Failures: 0, Errors: 0, Skipped: 0, Time elapsed: 0.499 sec
    [junit] Running org.apache.poi.ss.formula.TestFormulaParser
    [junit] Tests run: 9, Failures: 0, Errors: 0, Skipped: 0, Time elapsed: 0.1 sec
    [junit] Running org.apache.poi.ss.formula.TestStructuredReferences
    [junit] Tests run: 2, Failures: 0, Errors: 0, Skipped: 0, Time elapsed: 0.186 sec
    [junit] Running org.apache.poi.ss.formula.eval.TestXSSFCircularReferences
    [junit] Tests run: 4, Failures: 0, Errors: 0, Skipped: 0, Time elapsed: 0.026 sec
    [junit] Running org.apache.poi.ss.formula.functions.TestProper
    [junit] Tests run: 4, Failures: 0, Errors: 0, Skipped: 0, Time elapsed: 1.457 sec
    [junit] Running org.apache.poi.ss.formula.functions.TestSumifsXSSF
    [junit] Tests run: 1, Failures: 0, Errors: 0, Skipped: 0, Time elapsed: 0.02 sec
    [junit] Running org.apache.poi.ss.formula.functions.TestVlookup
    [junit] Tests run: 1, Failures: 0, Errors: 0, Skipped: 0, Time elapsed: 22.612 sec
    [junit] Running org.apache.poi.ss.usermodel.TestEmbedOLEPackage
    [junit] Tests run: 2, Failures: 0, Errors: 0, Skipped: 0, Time elapsed: 0.15 sec
    [junit] Running org.apache.poi.ss.usermodel.TestXSSFBorderStyle
    [junit] Tests run: 1, Failures: 0, Errors: 0, Skipped: 0, Time elapsed: 0.019 sec
    [junit] Running org.apache.poi.ss.usermodel.TestXSSFRangeCopier
    [junit] Tests run: 5, Failures: 0, Errors: 0, Skipped: 0, Time elapsed: 0.09 sec
    [junit] Running org.apache.poi.ss.util.TestSXSSFCellUtil
    [junit] Tests run: 13, Failures: 0, Errors: 0, Skipped: 0, Time elapsed: 0.134 sec
    [junit] Running org.apache.poi.ss.util.TestXSSFCellUtil
    [junit] Tests run: 13, Failures: 0, Errors: 0, Skipped: 0, Time elapsed: 0.071 sec
    [junit] Running org.apache.poi.ss.util.TestXSSFPropertyTemplate
    [junit] Tests run: 2, Failures: 0, Errors: 0, Skipped: 0, Time elapsed: 0.172 sec
    [junit] Running org.apache.poi.util.TestIdentifierManager
    [junit] Tests run: 5, Failures: 0, Errors: 0, Skipped: 0, Time elapsed: 0.003 sec
    [junit] Running org.apache.poi.util.TestTempFileThreaded
    [junit] Tests run: 1, Failures: 0, Errors: 0, Skipped: 0, Time elapsed: 3.995 sec
    [junit] Running org.apache.poi.xddf.usermodel.TestNecessaryOOXMLClasses
    [junit] Tests run: 1, Failures: 0, Errors: 0, Skipped: 0, Time elapsed: 0.093 sec
    [junit] Running org.apache.poi.xddf.usermodel.TestXDDFColor
    [junit] Tests run: 5, Failures: 0, Errors: 0, Skipped: 0, Time elapsed: 0.055 sec
    [junit] Running org.apache.poi.xddf.usermodel.chart.TestXDDFChart
    [junit] Tests run: 1, Failures: 0, Errors: 0, Skipped: 0, Time elapsed: 0.019 sec
    [junit] Running org.apache.poi.xddf.usermodel.chart.TestXDDFChartExtensionList
    [junit] Tests run: 1, Failures: 0, Errors: 0, Skipped: 0, Time elapsed: 0.003 sec
    [junit] Running org.apache.poi.xddf.usermodel.chart.TestXDDFDataSourcesFactory
    [junit] Tests run: 6, Failures: 0, Errors: 0, Skipped: 0, Time elapsed: 0.013 sec
    [junit] Running org.apache.poi.xddf.usermodel.text.TestXDDFTextBodyProperties
    [junit] Tests run: 1, Failures: 0, Errors: 0, Skipped: 0, Time elapsed: 0.008 sec
    [junit] Running org.apache.poi.xddf.usermodel.text.TestXDDFTextRun
    [junit] Tests run: 2, Failures: 0, Errors: 0, Skipped: 0, Time elapsed: 0.046 sec
    [junit] Running org.apache.poi.xdgf.extractor.TestXDGFVisioExtractor
    [junit] Tests run: 3, Failures: 0, Errors: 0, Skipped: 0, Time elapsed: 0.211 sec
    [junit] Running org.apache.poi.xslf.TestNecessaryOOXMLClasses
    [junit] Tests run: 1, Failures: 0, Errors: 0, Skipped: 0, Time elapsed: 0.005 sec
    [junit] Running org.apache.poi.xslf.TestXSLFBugs
    [junit] Tests run: 29, Failures: 0, Errors: 0, Skipped: 2, Time elapsed: 1.901 sec
    [junit] Running org.apache.poi.xslf.TestXSLFSlideShow
    [junit] Tests run: 5, Failures: 0, Errors: 0, Skipped: 0, Time elapsed: 0.081 sec
    [junit] Running org.apache.poi.xslf.extractor.TestXSLFPowerPointExtractor
    [junit] Tests run: 8, Failures: 0, Errors: 0, Skipped: 0, Time elapsed: 0.636 sec
    [junit] Running org.apache.poi.xslf.geom.TestFormulaParser
    [junit] Tests run: 1, Failures: 0, Errors: 0, Skipped: 0, Time elapsed: 0.013 sec
    [junit] Running org.apache.poi.xslf.usermodel.TestPPTX2PNG
    [junit] Tests run: 13, Failures: 0, Errors: 0, Skipped: 0, Time elapsed: 26.116 sec
    [junit] Running org.apache.poi.xslf.usermodel.TestXMLSlideShow
    [junit] Tests run: 11, Failures: 0, Errors: 0, Skipped: 0, Time elapsed: 0.369 sec
    [junit] Running org.apache.poi.xslf.usermodel.TestXSLFAutoShape
    [junit] Tests run: 4, Failures: 0, Errors: 0, Skipped: 0, Time elapsed: 0.077 sec
    [junit] Running org.apache.poi.xslf.usermodel.TestXSLFBackground
    [junit] Tests run: 4, Failures: 0, Errors: 0, Skipped: 0, Time elapsed: 0.143 sec
    [junit] Running org.apache.poi.xslf.usermodel.TestXSLFChart
    [junit] Tests run: 5, Failures: 0, Errors: 0, Skipped: 0, Time elapsed: 0.242 sec
    [junit] Running org.apache.poi.xslf.usermodel.TestXSLFColor
    [junit] Tests run: 6, Failures: 0, Errors: 0, Skipped: 0, Time elapsed: 0.034 sec
    [junit] Running org.apache.poi.xslf.usermodel.TestXSLFConnectorShape
    [junit] Tests run: 2, Failures: 0, Errors: 0, Skipped: 0, Time elapsed: 0.036 sec
    [junit] Running org.apache.poi.xslf.usermodel.TestXSLFFreeformShape
    [junit] Tests run: 2, Failures: 0, Errors: 0, Skipped: 0, Time elapsed: 0.096 sec
    [junit] Running org.apache.poi.xslf.usermodel.TestXSLFGroupShape
    [junit] Tests run: 2, Failures: 0, Errors: 0, Skipped: 0, Time elapsed: 0.037 sec
    [junit] Running org.apache.poi.xslf.usermodel.TestXSLFHyperlink
    [junit] Tests run: 3, Failures: 0, Errors: 0, Skipped: 0, Time elapsed: 0.081 sec
    [junit] Running org.apache.poi.xslf.usermodel.TestXSLFNotes
    [junit] Tests run: 3, Failures: 0, Errors: 0, Skipped: 0, Time elapsed: 0.073 sec
    [junit] Running org.apache.poi.xslf.usermodel.TestXSLFPictureShape
    [junit] Tests run: 7, Failures: 0, Errors: 1, Skipped: 0, Time elapsed: 0.261 sec

BUILD FAILED
<https://builds.apache.org/job/POI-DSL-Github-PullRequests/ws/build.xml>:1611: The following error occurred while executing this line:
<https://builds.apache.org/job/POI-DSL-Github-PullRequests/ws/build.xml>:1577: The following error occurred while executing this line:
<https://builds.apache.org/job/POI-DSL-Github-PullRequests/ws/build.xml>:1223: Tests failed

Total time: 6 minutes 22 seconds
Build step 'Invoke Ant' marked build as failure
Skipping publisher since build result is FAILURE
Archiving artifacts
[Fast Archiver] No prior successful build to compare, so performing full copy of artifacts
Skipping publisher since build result is FAILURE
Recording test results

---------------------------------------------------------------------
To unsubscribe, e-mail: [hidden email]
For additional commands, e-mail: [hidden email]

Reply | Threaded
Open this post in threaded view
|

Build failed in Jenkins: POI-DSL-Github-PullRequests #2

Apache Jenkins Server
See <https://builds.apache.org/job/POI-DSL-Github-PullRequests/2/display/redirect>

------------------------------------------
[...truncated 592.68 KB...]
  [javadoc] <https://builds.apache.org/job/POI-DSL-Github-PullRequests/ws/src/ooxml/java/org/apache/poi/xslf/usermodel/XSLFTextParagraph.java>:314: error: bad use of '>'
  [javadoc]      * If bulletSize >= 0, then bulletSize is a percentage of the font size.
  [javadoc]                      ^
  [javadoc] <https://builds.apache.org/job/POI-DSL-Github-PullRequests/ws/src/ooxml/java/org/apache/poi/xslf/usermodel/XSLFTextParagraph.java>:315: error: malformed HTML
  [javadoc]      * If bulletSize < 0, then it specifies the size in points
  [javadoc]                      ^
  [javadoc] <https://builds.apache.org/job/POI-DSL-Github-PullRequests/ws/src/ooxml/java/org/apache/poi/xslf/usermodel/XSLFTextParagraph.java>:343: error: bad use of '>'
  [javadoc]      * If bulletSize >= 0, then bulletSize is a percentage of the font size.
  [javadoc]                      ^
  [javadoc] <https://builds.apache.org/job/POI-DSL-Github-PullRequests/ws/src/ooxml/java/org/apache/poi/xslf/usermodel/XSLFTextParagraph.java>:344: error: malformed HTML
  [javadoc]      * If bulletSize < 0, then it specifies the size in points
  [javadoc]                      ^
  [javadoc] <https://builds.apache.org/job/POI-DSL-Github-PullRequests/ws/src/ooxml/java/org/apache/poi/xssf/eventusermodel/ReadOnlySharedStringsTable.java>:50: error: bad use of '>'
  [javadoc] &lt;?xml version="1.0" encoding="UTF-8" standalone="yes" ?>
  [javadoc]                                                           ^
  [javadoc] <https://builds.apache.org/job/POI-DSL-Github-PullRequests/ws/src/ooxml/java/org/apache/poi/xssf/eventusermodel/ReadOnlySharedStringsTable.java>:51: error: bad use of '>'
  [javadoc] &lt;sst xmlns="http://schemas.openxmlformats.org/spreadsheetml/2006/main" count="2" uniqueCount="2">
  [javadoc]                                                                                                    ^
  [javadoc] <https://builds.apache.org/job/POI-DSL-Github-PullRequests/ws/src/ooxml/java/org/apache/poi/xssf/eventusermodel/ReadOnlySharedStringsTable.java>:52: error: bad use of '>'
  [javadoc]  &lt;si>
  [javadoc]        ^
  [javadoc] <https://builds.apache.org/job/POI-DSL-Github-PullRequests/ws/src/ooxml/java/org/apache/poi/xssf/eventusermodel/ReadOnlySharedStringsTable.java>:53: error: bad use of '>'
  [javadoc]    &lt;r>
  [javadoc]         ^
  [javadoc] <https://builds.apache.org/job/POI-DSL-Github-PullRequests/ws/src/ooxml/java/org/apache/poi/xssf/eventusermodel/ReadOnlySharedStringsTable.java>:54: error: bad use of '>'
  [javadoc]      &lt;rPr>
  [javadoc]             ^
  [javadoc] <https://builds.apache.org/job/POI-DSL-Github-PullRequests/ws/src/ooxml/java/org/apache/poi/xssf/eventusermodel/ReadOnlySharedStringsTable.java>:55: error: bad use of '>'
  [javadoc]        &lt;b />
  [javadoc]               ^
  [javadoc] <https://builds.apache.org/job/POI-DSL-Github-PullRequests/ws/src/ooxml/java/org/apache/poi/xssf/eventusermodel/ReadOnlySharedStringsTable.java>:56: error: bad use of '>'
  [javadoc]        &lt;sz val="11" />
  [javadoc]                         ^
  [javadoc] <https://builds.apache.org/job/POI-DSL-Github-PullRequests/ws/src/ooxml/java/org/apache/poi/xssf/eventusermodel/ReadOnlySharedStringsTable.java>:57: error: bad use of '>'
  [javadoc]        &lt;color theme="1" />
  [javadoc]                             ^
  [javadoc] <https://builds.apache.org/job/POI-DSL-Github-PullRequests/ws/src/ooxml/java/org/apache/poi/xssf/eventusermodel/ReadOnlySharedStringsTable.java>:58: error: bad use of '>'
  [javadoc]        &lt;rFont val="Calibri" />
  [javadoc]                                 ^
  [javadoc] <https://builds.apache.org/job/POI-DSL-Github-PullRequests/ws/src/ooxml/java/org/apache/poi/xssf/eventusermodel/ReadOnlySharedStringsTable.java>:59: error: bad use of '>'
  [javadoc]        &lt;family val="2" />
  [javadoc]                            ^
  [javadoc] <https://builds.apache.org/job/POI-DSL-Github-PullRequests/ws/src/ooxml/java/org/apache/poi/xssf/eventusermodel/ReadOnlySharedStringsTable.java>:60: error: bad use of '>'
  [javadoc]        &lt;scheme val="minor" />
  [javadoc]                                ^
  [javadoc] <https://builds.apache.org/job/POI-DSL-Github-PullRequests/ws/src/ooxml/java/org/apache/poi/xssf/eventusermodel/ReadOnlySharedStringsTable.java>:61: error: bad use of '>'
  [javadoc]      &lt;/rPr>
  [javadoc]              ^
  [javadoc] <https://builds.apache.org/job/POI-DSL-Github-PullRequests/ws/src/ooxml/java/org/apache/poi/xssf/eventusermodel/ReadOnlySharedStringsTable.java>:62: error: bad use of '>'
  [javadoc]      &lt;t>This:&lt;/t>
  [javadoc]           ^
  [javadoc] <https://builds.apache.org/job/POI-DSL-Github-PullRequests/ws/src/ooxml/java/org/apache/poi/xssf/eventusermodel/ReadOnlySharedStringsTable.java>:62: error: bad use of '>'
  [javadoc]      &lt;t>This:&lt;/t>
  [javadoc]                       ^
  [javadoc] <https://builds.apache.org/job/POI-DSL-Github-PullRequests/ws/src/ooxml/java/org/apache/poi/xssf/eventusermodel/ReadOnlySharedStringsTable.java>:63: error: bad use of '>'
  [javadoc]    &lt;/r>
  [javadoc]          ^
  [javadoc] <https://builds.apache.org/job/POI-DSL-Github-PullRequests/ws/src/ooxml/java/org/apache/poi/xssf/eventusermodel/ReadOnlySharedStringsTable.java>:64: error: bad use of '>'
  [javadoc]    &lt;r>
  [javadoc]         ^
  [javadoc] <https://builds.apache.org/job/POI-DSL-Github-PullRequests/ws/src/ooxml/java/org/apache/poi/xssf/eventusermodel/ReadOnlySharedStringsTable.java>:65: error: bad use of '>'
  [javadoc]      &lt;rPr>
  [javadoc]             ^
  [javadoc] <https://builds.apache.org/job/POI-DSL-Github-PullRequests/ws/src/ooxml/java/org/apache/poi/xssf/eventusermodel/ReadOnlySharedStringsTable.java>:66: error: bad use of '>'
  [javadoc]        &lt;sz val="11" />
  [javadoc]                         ^
  [javadoc] <https://builds.apache.org/job/POI-DSL-Github-PullRequests/ws/src/ooxml/java/org/apache/poi/xssf/eventusermodel/ReadOnlySharedStringsTable.java>:67: error: bad use of '>'
  [javadoc]        &lt;color theme="1" />
  [javadoc]                             ^
  [javadoc] <https://builds.apache.org/job/POI-DSL-Github-PullRequests/ws/src/ooxml/java/org/apache/poi/xssf/eventusermodel/ReadOnlySharedStringsTable.java>:68: error: bad use of '>'
  [javadoc]        &lt;rFont val="Calibri" />
  [javadoc]                                 ^
  [javadoc] <https://builds.apache.org/job/POI-DSL-Github-PullRequests/ws/src/ooxml/java/org/apache/poi/xssf/eventusermodel/ReadOnlySharedStringsTable.java>:69: error: bad use of '>'
  [javadoc]        &lt;family val="2" />
  [javadoc]                            ^
  [javadoc] <https://builds.apache.org/job/POI-DSL-Github-PullRequests/ws/src/ooxml/java/org/apache/poi/xssf/eventusermodel/ReadOnlySharedStringsTable.java>:70: error: bad use of '>'
  [javadoc]        &lt;scheme val="minor" />
  [javadoc]                                ^
  [javadoc] <https://builds.apache.org/job/POI-DSL-Github-PullRequests/ws/src/ooxml/java/org/apache/poi/xssf/eventusermodel/ReadOnlySharedStringsTable.java>:71: error: bad use of '>'
  [javadoc]      &lt;/rPr>
  [javadoc]              ^
  [javadoc] <https://builds.apache.org/job/POI-DSL-Github-PullRequests/ws/src/ooxml/java/org/apache/poi/xssf/eventusermodel/ReadOnlySharedStringsTable.java>:72: error: bad use of '>'
  [javadoc]      &lt;t xml:space="preserve">Causes Problems&lt;/t>
  [javadoc]                                ^
  [javadoc] <https://builds.apache.org/job/POI-DSL-Github-PullRequests/ws/src/ooxml/java/org/apache/poi/xssf/eventusermodel/ReadOnlySharedStringsTable.java>:72: error: bad use of '>'
  [javadoc]      &lt;t xml:space="preserve">Causes Problems&lt;/t>
  [javadoc]                                                      ^
  [javadoc] <https://builds.apache.org/job/POI-DSL-Github-PullRequests/ws/src/ooxml/java/org/apache/poi/xssf/eventusermodel/ReadOnlySharedStringsTable.java>:73: error: bad use of '>'
  [javadoc]    &lt;/r>
  [javadoc]          ^
  [javadoc] <https://builds.apache.org/job/POI-DSL-Github-PullRequests/ws/src/ooxml/java/org/apache/poi/xssf/eventusermodel/ReadOnlySharedStringsTable.java>:74: error: bad use of '>'
  [javadoc]  &lt;/si>
  [javadoc]         ^
  [javadoc] <https://builds.apache.org/job/POI-DSL-Github-PullRequests/ws/src/ooxml/java/org/apache/poi/xssf/eventusermodel/ReadOnlySharedStringsTable.java>:75: error: bad use of '>'
  [javadoc]  &lt;si>
  [javadoc]        ^
  [javadoc] <https://builds.apache.org/job/POI-DSL-Github-PullRequests/ws/src/ooxml/java/org/apache/poi/xssf/eventusermodel/ReadOnlySharedStringsTable.java>:76: error: bad use of '>'
  [javadoc]    &lt;t>This does not&lt;/t>
  [javadoc]         ^
  [javadoc] <https://builds.apache.org/job/POI-DSL-Github-PullRequests/ws/src/ooxml/java/org/apache/poi/xssf/eventusermodel/ReadOnlySharedStringsTable.java>:76: error: bad use of '>'
  [javadoc]    &lt;t>This does not&lt;/t>
  [javadoc]                             ^
  [javadoc] <https://builds.apache.org/job/POI-DSL-Github-PullRequests/ws/src/ooxml/java/org/apache/poi/xssf/eventusermodel/ReadOnlySharedStringsTable.java>:77: error: bad use of '>'
  [javadoc]  &lt;/si>
  [javadoc]         ^
  [javadoc] <https://builds.apache.org/job/POI-DSL-Github-PullRequests/ws/src/ooxml/java/org/apache/poi/xssf/eventusermodel/ReadOnlySharedStringsTable.java>:78: error: bad use of '>'
  [javadoc] &lt;/sst>
  [javadoc]         ^
  [javadoc] <https://builds.apache.org/job/POI-DSL-Github-PullRequests/ws/src/ooxml/java/org/apache/poi/xssf/model/StylesTable.java>:92: error: malformed HTML
  [javadoc]      * @throws IllegalArgumentException if <code>num</code> < 0
  [javadoc]                                                             ^
  [javadoc] <https://builds.apache.org/job/POI-DSL-Github-PullRequests/ws/src/ooxml/java/org/apache/poi/xssf/model/StylesTable.java>:93: error: malformed HTML
  [javadoc]      * @throws IllegalStateException if <code>num</code> < current number of data formats in the style table.
  [javadoc]                                                          ^
  [javadoc] <https://builds.apache.org/job/POI-DSL-Github-PullRequests/ws/src/ooxml/java/org/apache/poi/xssf/streaming/SXSSFRow.java>:118: error: malformed HTML
  [javadoc]      * @throws IllegalArgumentException if columnIndex < 0 or greater than the maximum number of supported columns
  [javadoc]                                                        ^
  [javadoc] <https://builds.apache.org/job/POI-DSL-Github-PullRequests/ws/src/ooxml/java/org/apache/poi/xssf/streaming/SXSSFRow.java>:135: error: malformed HTML
  [javadoc]      * @throws IllegalArgumentException if columnIndex < 0 or greater than a maximum number of supported columns
  [javadoc]                                                        ^
  [javadoc] <https://builds.apache.org/job/POI-DSL-Github-PullRequests/ws/src/ooxml/java/org/apache/poi/xssf/streaming/SXSSFRow.java>:193: error: malformed HTML
  [javadoc]      * @throws IllegalArgumentException if rowNum < 0
  [javadoc]                                                   ^
  [javadoc] <https://builds.apache.org/job/POI-DSL-Github-PullRequests/ws/src/ooxml/java/org/apache/poi/xssf/streaming/SXSSFRow.java>:232: error: malformed HTML
  [javadoc]      * @throws IllegalArgumentException if cellnum < 0 or the specified MissingCellPolicy is invalid
  [javadoc]                                                    ^
  [javadoc] <https://builds.apache.org/job/POI-DSL-Github-PullRequests/ws/src/ooxml/java/org/apache/poi/xssf/usermodel/XSSFSheet.java>:4083: error: unterminated signature
  [javadoc]      * @deprecated Use {@link #createTable(AreaReference))} instead
  [javadoc]                        ^
  [javadoc] <https://builds.apache.org/job/POI-DSL-Github-PullRequests/ws/src/ooxml/java/org/apache/poi/xssf/usermodel/XSSFColor.java>:267: error: unknown tag: clrScheme
  [javadoc]      * Index into the <clrScheme> collection, referencing a particular <sysClr> or
  [javadoc]                       ^
  [javadoc] <https://builds.apache.org/job/POI-DSL-Github-PullRequests/ws/src/ooxml/java/org/apache/poi/xssf/usermodel/XSSFColor.java>:267: error: unknown tag: sysClr
  [javadoc]      * Index into the <clrScheme> collection, referencing a particular <sysClr> or
  [javadoc]                                                                        ^
  [javadoc] <https://builds.apache.org/job/POI-DSL-Github-PullRequests/ws/src/ooxml/java/org/apache/poi/xssf/usermodel/XSSFColor.java>:268: error: unknown tag: srgbClr
  [javadoc]      *  <srgbClr> value expressed in the Theme part.
  [javadoc]         ^
  [javadoc] <https://builds.apache.org/job/POI-DSL-Github-PullRequests/ws/src/ooxml/java/org/apache/poi/xssf/usermodel/XSSFColor.java>:276: error: unknown tag: clrScheme
  [javadoc]      * Index into the <clrScheme> collection, referencing a particular <sysClr> or
  [javadoc]                       ^
  [javadoc] <https://builds.apache.org/job/POI-DSL-Github-PullRequests/ws/src/ooxml/java/org/apache/poi/xssf/usermodel/XSSFColor.java>:276: error: unknown tag: sysClr
  [javadoc]      * Index into the <clrScheme> collection, referencing a particular <sysClr> or
  [javadoc]                                                                        ^
  [javadoc] <https://builds.apache.org/job/POI-DSL-Github-PullRequests/ws/src/ooxml/java/org/apache/poi/xssf/usermodel/XSSFColor.java>:277: error: unknown tag: srgbClr
  [javadoc]      *  <srgbClr> value expressed in the Theme part.
  [javadoc]         ^
  [javadoc] <https://builds.apache.org/job/POI-DSL-Github-PullRequests/ws/src/ooxml/java/org/apache/poi/xssf/usermodel/XSSFDxfStyleProvider.java>:42: error: bad use of '>'
  [javadoc]      * @param stripeSize 0 for non-stripe styles, > 1 for stripes
  [javadoc]                                                   ^
  [javadoc] <https://builds.apache.org/job/POI-DSL-Github-PullRequests/ws/src/ooxml/java/org/apache/poi/xssf/usermodel/XSSFName.java>:146: error: tag not allowed here: <blockquote>
  [javadoc]      * <pre><blockquote>
  [javadoc]             ^
  [javadoc] <https://builds.apache.org/job/POI-DSL-Github-PullRequests/ws/src/ooxml/java/org/apache/poi/xssf/usermodel/XSSFName.java>:165: error: unexpected end tag: </p>
  [javadoc]     * </p>
  [javadoc]       ^
  [javadoc] <https://builds.apache.org/job/POI-DSL-Github-PullRequests/ws/src/ooxml/java/org/apache/poi/xssf/usermodel/XSSFName.java>:36: error: tag not allowed here: <blockquote>
  [javadoc]  * <pre><blockquote>
  [javadoc]         ^
  [javadoc] <https://builds.apache.org/job/POI-DSL-Github-PullRequests/ws/src/ooxml/java/org/apache/poi/xssf/usermodel/XSSFName.java>:86: error: tag not allowed here: <li>
  [javadoc]      * <li> this defined name refers to a range to which an advanced filter has been
  [javadoc]        ^
  [javadoc] <https://builds.apache.org/job/POI-DSL-Github-PullRequests/ws/src/ooxml/java/org/apache/poi/xssf/usermodel/XSSFName.java>:88: error: tag not allowed here: <li>
  [javadoc]      * <li> This defined name refers to a range to which an AutoFilter has been
  [javadoc]        ^
  [javadoc] <https://builds.apache.org/job/POI-DSL-Github-PullRequests/ws/src/ooxml/java/org/apache/poi/xssf/usermodel/XSSFRichTextString.java>:431: error: bad use of '>'
  [javadoc]      * CTRPrElt --> CTFont adapter
  [javadoc]                   ^
  [javadoc] <https://builds.apache.org/job/POI-DSL-Github-PullRequests/ws/src/ooxml/java/org/apache/poi/xssf/usermodel/XSSFRow.java>:105: error: unknown tag: Cell
  [javadoc]      * for (Iterator<Cell> it = row.cellIterator(); it.hasNext(); ) {
  [javadoc]                     ^
  [javadoc] <https://builds.apache.org/job/POI-DSL-Github-PullRequests/ws/src/ooxml/java/org/apache/poi/xssf/usermodel/XSSFRow.java>:192: error: malformed HTML
  [javadoc]      * @throws IllegalArgumentException if columnIndex < 0 or greater than 16384,
  [javadoc]                                                        ^
  [javadoc] <https://builds.apache.org/job/POI-DSL-Github-PullRequests/ws/src/ooxml/java/org/apache/poi/xssf/usermodel/XSSFRow.java>:206: error: malformed HTML
  [javadoc]      * @throws IllegalArgumentException if the specified cell type is invalid, columnIndex < 0
  [javadoc]                                                                                            ^
  [javadoc] <https://builds.apache.org/job/POI-DSL-Github-PullRequests/ws/src/ooxml/java/org/apache/poi/xssf/usermodel/XSSFRow.java>:385: error: malformed HTML
  [javadoc]      * @throws IllegalArgumentException if rowNum < 0 or greater than 1048575
  [javadoc]                                                   ^
  [javadoc] <https://builds.apache.org/job/POI-DSL-Github-PullRequests/ws/src/ooxml/java/org/apache/poi/xssf/usermodel/XSSFSheetConditionalFormatting.java>:70: error: unexpected end tag: </p>
  [javadoc]      * </p>
  [javadoc]        ^
  [javadoc] <https://builds.apache.org/job/POI-DSL-Github-PullRequests/ws/src/ooxml/java/org/apache/poi/xssf/usermodel/XSSFTableColumn.java>:78: error: invalid use of @return
  [javadoc]      * @return the column id
  [javadoc]        ^
  [javadoc] 100 errors
  [javadoc] 100 warnings
      [jar] Building jar: <https://builds.apache.org/job/POI-DSL-Github-PullRequests/ws/build/dist/maven/poi-ooxml/poi-ooxml-4.1.0-javadoc.jar>

assemble:
      [zip] Building zip: <https://builds.apache.org/job/POI-DSL-Github-PullRequests/ws/build/dist/poi-bin-4.1.0-20181228.zip>
      [tar] Building tar: <https://builds.apache.org/job/POI-DSL-Github-PullRequests/2/artifact/build/dist/poi-bin-4.1.0-20181228.tar.gz>
      [zip] Building zip: <https://builds.apache.org/job/POI-DSL-Github-PullRequests/ws/build/dist/poi-src-4.1.0-20181228.zip>
      [tar] Building tar: <https://builds.apache.org/job/POI-DSL-Github-PullRequests/2/artifact/build/dist/poi-src-4.1.0-20181228.tar.gz>
     [echo] Creating Maven POMs

maven-poms:
     [copy] Copying 6 files to <https://builds.apache.org/job/POI-DSL-Github-PullRequests/ws/build/dist/maven>
     [echo] Maven POMs are located in <https://builds.apache.org/job/POI-DSL-Github-PullRequests/ws/build/dist>
     [echo] Use ant dist-nexus to deploy the artifacts in the remote repository
     [echo] Distribution located in <https://builds.apache.org/job/POI-DSL-Github-PullRequests/ws/build/dist>
     [echo] Use "ant dist-checksum" to create sha256/sha512 checksums and GPG signatures

findbugs:
      [get] Getting: https://downloads.sourceforge.net/project/findbugs/findbugs/3.0.1/findbugs-noUpdateChecks-3.0.1.zip?download=
      [get] To: <https://builds.apache.org/job/POI-DSL-Github-PullRequests/ws/lib/findbugs-noUpdateChecks-3.0.1.zip>
      [get] https://downloads.sourceforge.net/project/findbugs/findbugs/3.0.1/findbugs-noUpdateChecks-3.0.1.zip?download= moved to https://superb-dca2.dl.sourceforge.net/project/findbugs/findbugs/3.0.1/findbugs-noUpdateChecks-3.0.1.zip
    [unzip] Expanding: <https://builds.apache.org/job/POI-DSL-Github-PullRequests/ws/lib/findbugs-noUpdateChecks-3.0.1.zip> into <https://builds.apache.org/job/POI-DSL-Github-PullRequests/ws/build/findbugs>
 [findbugs] Executing findbugs FindBugsTask from ant task
 [findbugs] Running FindBugs...
 [findbugs] The following classes needed for analysis were missing:
 [findbugs]   org.apache.batik.bridge.UserAgent
 [findbugs]   org.apache.batik.bridge.DocumentLoader
 [findbugs]   org.apache.batik.bridge.BridgeContext
 [findbugs]   org.apache.batik.ext.awt.RenderingHintsKeyExt
 [findbugs]   org.apache.batik.ext.awt.image.renderable.Filter
 [findbugs]   org.apache.batik.bridge.GVTBuilder
 [findbugs]   org.apache.batik.util.XMLResourceDescriptor
 [findbugs]   org.apache.batik.anim.dom.SAXSVGDocumentFactory
 [findbugs]   org.apache.batik.bridge.UserAgentAdapter
 [findbugs]   org.apache.batik.gvt.GraphicsNode
 [findbugs]   org.apache.batik.ext.awt.image.renderable.ClipRable8Bit
 [findbugs]   org.apache.batik.ext.awt.image.renderable.ClipRable
 [findbugs] Warnings generated: 121
 [findbugs] Missing classes: 9
 [findbugs] Calculating exit code...
 [findbugs] Setting 'missing class' flag (2)
 [findbugs] Setting 'bugs found' flag (1)
 [findbugs] Exit code set to: 3
 [findbugs] Java Result: 3
 [findbugs] Classes needed for analysis were missing
 [findbugs] Output saved to build/findbugs.xml
     [xslt] Transforming into <https://builds.apache.org/job/POI-DSL-Github-PullRequests/ws/build>
     [xslt] Processing <https://builds.apache.org/job/POI-DSL-Github-PullRequests/ws/build/findbugs.xml> to <https://builds.apache.org/job/POI-DSL-Github-PullRequests/2/artifact/build/findbugs.html>
     [xslt] Loading stylesheet jar:<https://builds.apache.org/job/POI-DSL-Github-PullRequests/ws/build/findbugs/lib/findbugs.jar!/fancy-hist.xsl>

release-notes:

BUILD FAILED
<https://builds.apache.org/job/POI-DSL-Github-PullRequests/ws/build.xml>:1995: Warning: Could not find file <https://builds.apache.org/job/POI-DSL-Github-PullRequests/ws/src/documentation/RELEASE-NOTES.txt> to copy.

Total time: 22 minutes 21 seconds
Build step 'Invoke Ant' marked build as failure
Skipping publisher since build result is FAILURE
Archiving artifacts
[Fast Archiver] No prior successful build to compare, so performing full copy of artifacts
Skipping publisher since build result is FAILURE
Recording test results

---------------------------------------------------------------------
To unsubscribe, e-mail: [hidden email]
For additional commands, e-mail: [hidden email]

Reply | Threaded
Open this post in threaded view
|

Build failed in Jenkins: POI-DSL-Github-PullRequests #3

Apache Jenkins Server
See <https://builds.apache.org/job/POI-DSL-Github-PullRequests/3/display/redirect>

------------------------------------------
[...truncated 592.18 KB...]
  [javadoc]      * @throws InvalidFormatException
  [javadoc]                ^
  [javadoc] <https://builds.apache.org/job/POI-DSL-Github-PullRequests/ws/src/ooxml/java/org/apache/poi/xslf/usermodel/XSLFTextParagraph.java>:314: error: bad use of '>'
  [javadoc]      * If bulletSize >= 0, then bulletSize is a percentage of the font size.
  [javadoc]                      ^
  [javadoc] <https://builds.apache.org/job/POI-DSL-Github-PullRequests/ws/src/ooxml/java/org/apache/poi/xslf/usermodel/XSLFTextParagraph.java>:315: error: malformed HTML
  [javadoc]      * If bulletSize < 0, then it specifies the size in points
  [javadoc]                      ^
  [javadoc] <https://builds.apache.org/job/POI-DSL-Github-PullRequests/ws/src/ooxml/java/org/apache/poi/xslf/usermodel/XSLFTextParagraph.java>:343: error: bad use of '>'
  [javadoc]      * If bulletSize >= 0, then bulletSize is a percentage of the font size.
  [javadoc]                      ^
  [javadoc] <https://builds.apache.org/job/POI-DSL-Github-PullRequests/ws/src/ooxml/java/org/apache/poi/xslf/usermodel/XSLFTextParagraph.java>:344: error: malformed HTML
  [javadoc]      * If bulletSize < 0, then it specifies the size in points
  [javadoc]                      ^
  [javadoc] <https://builds.apache.org/job/POI-DSL-Github-PullRequests/ws/src/ooxml/java/org/apache/poi/xssf/eventusermodel/ReadOnlySharedStringsTable.java>:50: error: bad use of '>'
  [javadoc] &lt;?xml version="1.0" encoding="UTF-8" standalone="yes" ?>
  [javadoc]                                                           ^
  [javadoc] <https://builds.apache.org/job/POI-DSL-Github-PullRequests/ws/src/ooxml/java/org/apache/poi/xssf/eventusermodel/ReadOnlySharedStringsTable.java>:51: error: bad use of '>'
  [javadoc] &lt;sst xmlns="http://schemas.openxmlformats.org/spreadsheetml/2006/main" count="2" uniqueCount="2">
  [javadoc]                                                                                                    ^
  [javadoc] <https://builds.apache.org/job/POI-DSL-Github-PullRequests/ws/src/ooxml/java/org/apache/poi/xssf/eventusermodel/ReadOnlySharedStringsTable.java>:52: error: bad use of '>'
  [javadoc]  &lt;si>
  [javadoc]        ^
  [javadoc] <https://builds.apache.org/job/POI-DSL-Github-PullRequests/ws/src/ooxml/java/org/apache/poi/xssf/eventusermodel/ReadOnlySharedStringsTable.java>:53: error: bad use of '>'
  [javadoc]    &lt;r>
  [javadoc]         ^
  [javadoc] <https://builds.apache.org/job/POI-DSL-Github-PullRequests/ws/src/ooxml/java/org/apache/poi/xssf/eventusermodel/ReadOnlySharedStringsTable.java>:54: error: bad use of '>'
  [javadoc]      &lt;rPr>
  [javadoc]             ^
  [javadoc] <https://builds.apache.org/job/POI-DSL-Github-PullRequests/ws/src/ooxml/java/org/apache/poi/xssf/eventusermodel/ReadOnlySharedStringsTable.java>:55: error: bad use of '>'
  [javadoc]        &lt;b />
  [javadoc]               ^
  [javadoc] <https://builds.apache.org/job/POI-DSL-Github-PullRequests/ws/src/ooxml/java/org/apache/poi/xssf/eventusermodel/ReadOnlySharedStringsTable.java>:56: error: bad use of '>'
  [javadoc]        &lt;sz val="11" />
  [javadoc]                         ^
  [javadoc] <https://builds.apache.org/job/POI-DSL-Github-PullRequests/ws/src/ooxml/java/org/apache/poi/xssf/eventusermodel/ReadOnlySharedStringsTable.java>:57: error: bad use of '>'
  [javadoc]        &lt;color theme="1" />
  [javadoc]                             ^
  [javadoc] <https://builds.apache.org/job/POI-DSL-Github-PullRequests/ws/src/ooxml/java/org/apache/poi/xssf/eventusermodel/ReadOnlySharedStringsTable.java>:58: error: bad use of '>'
  [javadoc]        &lt;rFont val="Calibri" />
  [javadoc]                                 ^
  [javadoc] <https://builds.apache.org/job/POI-DSL-Github-PullRequests/ws/src/ooxml/java/org/apache/poi/xssf/eventusermodel/ReadOnlySharedStringsTable.java>:59: error: bad use of '>'
  [javadoc]        &lt;family val="2" />
  [javadoc]                            ^
  [javadoc] <https://builds.apache.org/job/POI-DSL-Github-PullRequests/ws/src/ooxml/java/org/apache/poi/xssf/eventusermodel/ReadOnlySharedStringsTable.java>:60: error: bad use of '>'
  [javadoc]        &lt;scheme val="minor" />
  [javadoc]                                ^
  [javadoc] <https://builds.apache.org/job/POI-DSL-Github-PullRequests/ws/src/ooxml/java/org/apache/poi/xssf/eventusermodel/ReadOnlySharedStringsTable.java>:61: error: bad use of '>'
  [javadoc]      &lt;/rPr>
  [javadoc]              ^
  [javadoc] <https://builds.apache.org/job/POI-DSL-Github-PullRequests/ws/src/ooxml/java/org/apache/poi/xssf/eventusermodel/ReadOnlySharedStringsTable.java>:62: error: bad use of '>'
  [javadoc]      &lt;t>This:&lt;/t>
  [javadoc]           ^
  [javadoc] <https://builds.apache.org/job/POI-DSL-Github-PullRequests/ws/src/ooxml/java/org/apache/poi/xssf/eventusermodel/ReadOnlySharedStringsTable.java>:62: error: bad use of '>'
  [javadoc]      &lt;t>This:&lt;/t>
  [javadoc]                       ^
  [javadoc] <https://builds.apache.org/job/POI-DSL-Github-PullRequests/ws/src/ooxml/java/org/apache/poi/xssf/eventusermodel/ReadOnlySharedStringsTable.java>:63: error: bad use of '>'
  [javadoc]    &lt;/r>
  [javadoc]          ^
  [javadoc] <https://builds.apache.org/job/POI-DSL-Github-PullRequests/ws/src/ooxml/java/org/apache/poi/xssf/eventusermodel/ReadOnlySharedStringsTable.java>:64: error: bad use of '>'
  [javadoc]    &lt;r>
  [javadoc]         ^
  [javadoc] <https://builds.apache.org/job/POI-DSL-Github-PullRequests/ws/src/ooxml/java/org/apache/poi/xssf/eventusermodel/ReadOnlySharedStringsTable.java>:65: error: bad use of '>'
  [javadoc]      &lt;rPr>
  [javadoc]             ^
  [javadoc] <https://builds.apache.org/job/POI-DSL-Github-PullRequests/ws/src/ooxml/java/org/apache/poi/xssf/eventusermodel/ReadOnlySharedStringsTable.java>:66: error: bad use of '>'
  [javadoc]        &lt;sz val="11" />
  [javadoc]                         ^
  [javadoc] <https://builds.apache.org/job/POI-DSL-Github-PullRequests/ws/src/ooxml/java/org/apache/poi/xssf/eventusermodel/ReadOnlySharedStringsTable.java>:67: error: bad use of '>'
  [javadoc]        &lt;color theme="1" />
  [javadoc]                             ^
  [javadoc] <https://builds.apache.org/job/POI-DSL-Github-PullRequests/ws/src/ooxml/java/org/apache/poi/xssf/eventusermodel/ReadOnlySharedStringsTable.java>:68: error: bad use of '>'
  [javadoc]        &lt;rFont val="Calibri" />
  [javadoc]                                 ^
  [javadoc] <https://builds.apache.org/job/POI-DSL-Github-PullRequests/ws/src/ooxml/java/org/apache/poi/xssf/eventusermodel/ReadOnlySharedStringsTable.java>:69: error: bad use of '>'
  [javadoc]        &lt;family val="2" />
  [javadoc]                            ^
  [javadoc] <https://builds.apache.org/job/POI-DSL-Github-PullRequests/ws/src/ooxml/java/org/apache/poi/xssf/eventusermodel/ReadOnlySharedStringsTable.java>:70: error: bad use of '>'
  [javadoc]        &lt;scheme val="minor" />
  [javadoc]                                ^
  [javadoc] <https://builds.apache.org/job/POI-DSL-Github-PullRequests/ws/src/ooxml/java/org/apache/poi/xssf/eventusermodel/ReadOnlySharedStringsTable.java>:71: error: bad use of '>'
  [javadoc]      &lt;/rPr>
  [javadoc]              ^
  [javadoc] <https://builds.apache.org/job/POI-DSL-Github-PullRequests/ws/src/ooxml/java/org/apache/poi/xssf/eventusermodel/ReadOnlySharedStringsTable.java>:72: error: bad use of '>'
  [javadoc]      &lt;t xml:space="preserve">Causes Problems&lt;/t>
  [javadoc]                                ^
  [javadoc] <https://builds.apache.org/job/POI-DSL-Github-PullRequests/ws/src/ooxml/java/org/apache/poi/xssf/eventusermodel/ReadOnlySharedStringsTable.java>:72: error: bad use of '>'
  [javadoc]      &lt;t xml:space="preserve">Causes Problems&lt;/t>
  [javadoc]                                                      ^
  [javadoc] <https://builds.apache.org/job/POI-DSL-Github-PullRequests/ws/src/ooxml/java/org/apache/poi/xssf/eventusermodel/ReadOnlySharedStringsTable.java>:73: error: bad use of '>'
  [javadoc]    &lt;/r>
  [javadoc]          ^
  [javadoc] <https://builds.apache.org/job/POI-DSL-Github-PullRequests/ws/src/ooxml/java/org/apache/poi/xssf/eventusermodel/ReadOnlySharedStringsTable.java>:74: error: bad use of '>'
  [javadoc]  &lt;/si>
  [javadoc]         ^
  [javadoc] <https://builds.apache.org/job/POI-DSL-Github-PullRequests/ws/src/ooxml/java/org/apache/poi/xssf/eventusermodel/ReadOnlySharedStringsTable.java>:75: error: bad use of '>'
  [javadoc]  &lt;si>
  [javadoc]        ^
  [javadoc] <https://builds.apache.org/job/POI-DSL-Github-PullRequests/ws/src/ooxml/java/org/apache/poi/xssf/eventusermodel/ReadOnlySharedStringsTable.java>:76: error: bad use of '>'
  [javadoc]    &lt;t>This does not&lt;/t>
  [javadoc]         ^
  [javadoc] <https://builds.apache.org/job/POI-DSL-Github-PullRequests/ws/src/ooxml/java/org/apache/poi/xssf/eventusermodel/ReadOnlySharedStringsTable.java>:76: error: bad use of '>'
  [javadoc]    &lt;t>This does not&lt;/t>
  [javadoc]                             ^
  [javadoc] <https://builds.apache.org/job/POI-DSL-Github-PullRequests/ws/src/ooxml/java/org/apache/poi/xssf/eventusermodel/ReadOnlySharedStringsTable.java>:77: error: bad use of '>'
  [javadoc]  &lt;/si>
  [javadoc]         ^
  [javadoc] <https://builds.apache.org/job/POI-DSL-Github-PullRequests/ws/src/ooxml/java/org/apache/poi/xssf/eventusermodel/ReadOnlySharedStringsTable.java>:78: error: bad use of '>'
  [javadoc] &lt;/sst>
  [javadoc]         ^
  [javadoc] <https://builds.apache.org/job/POI-DSL-Github-PullRequests/ws/src/ooxml/java/org/apache/poi/xssf/model/StylesTable.java>:92: error: malformed HTML
  [javadoc]      * @throws IllegalArgumentException if <code>num</code> < 0
  [javadoc]                                                             ^
  [javadoc] <https://builds.apache.org/job/POI-DSL-Github-PullRequests/ws/src/ooxml/java/org/apache/poi/xssf/model/StylesTable.java>:93: error: malformed HTML
  [javadoc]      * @throws IllegalStateException if <code>num</code> < current number of data formats in the style table.
  [javadoc]                                                          ^
  [javadoc] <https://builds.apache.org/job/POI-DSL-Github-PullRequests/ws/src/ooxml/java/org/apache/poi/xssf/streaming/SXSSFRow.java>:118: error: malformed HTML
  [javadoc]      * @throws IllegalArgumentException if columnIndex < 0 or greater than the maximum number of supported columns
  [javadoc]                                                        ^
  [javadoc] <https://builds.apache.org/job/POI-DSL-Github-PullRequests/ws/src/ooxml/java/org/apache/poi/xssf/streaming/SXSSFRow.java>:135: error: malformed HTML
  [javadoc]      * @throws IllegalArgumentException if columnIndex < 0 or greater than a maximum number of supported columns
  [javadoc]                                                        ^
  [javadoc] <https://builds.apache.org/job/POI-DSL-Github-PullRequests/ws/src/ooxml/java/org/apache/poi/xssf/streaming/SXSSFRow.java>:193: error: malformed HTML
  [javadoc]      * @throws IllegalArgumentException if rowNum < 0
  [javadoc]                                                   ^
  [javadoc] <https://builds.apache.org/job/POI-DSL-Github-PullRequests/ws/src/ooxml/java/org/apache/poi/xssf/streaming/SXSSFRow.java>:232: error: malformed HTML
  [javadoc]      * @throws IllegalArgumentException if cellnum < 0 or the specified MissingCellPolicy is invalid
  [javadoc]                                                    ^
  [javadoc] <https://builds.apache.org/job/POI-DSL-Github-PullRequests/ws/src/ooxml/java/org/apache/poi/xssf/usermodel/XSSFSheet.java>:4083: error: unterminated signature
  [javadoc]      * @deprecated Use {@link #createTable(AreaReference))} instead
  [javadoc]                        ^
  [javadoc] <https://builds.apache.org/job/POI-DSL-Github-PullRequests/ws/src/ooxml/java/org/apache/poi/xssf/usermodel/XSSFColor.java>:267: error: unknown tag: clrScheme
  [javadoc]      * Index into the <clrScheme> collection, referencing a particular <sysClr> or
  [javadoc]                       ^
  [javadoc] <https://builds.apache.org/job/POI-DSL-Github-PullRequests/ws/src/ooxml/java/org/apache/poi/xssf/usermodel/XSSFColor.java>:267: error: unknown tag: sysClr
  [javadoc]      * Index into the <clrScheme> collection, referencing a particular <sysClr> or
  [javadoc]                                                                        ^
  [javadoc] <https://builds.apache.org/job/POI-DSL-Github-PullRequests/ws/src/ooxml/java/org/apache/poi/xssf/usermodel/XSSFColor.java>:268: error: unknown tag: srgbClr
  [javadoc]      *  <srgbClr> value expressed in the Theme part.
  [javadoc]         ^
  [javadoc] <https://builds.apache.org/job/POI-DSL-Github-PullRequests/ws/src/ooxml/java/org/apache/poi/xssf/usermodel/XSSFColor.java>:276: error: unknown tag: clrScheme
  [javadoc]      * Index into the <clrScheme> collection, referencing a particular <sysClr> or
  [javadoc]                       ^
  [javadoc] <https://builds.apache.org/job/POI-DSL-Github-PullRequests/ws/src/ooxml/java/org/apache/poi/xssf/usermodel/XSSFColor.java>:276: error: unknown tag: sysClr
  [javadoc]      * Index into the <clrScheme> collection, referencing a particular <sysClr> or
  [javadoc]                                                                        ^
  [javadoc] <https://builds.apache.org/job/POI-DSL-Github-PullRequests/ws/src/ooxml/java/org/apache/poi/xssf/usermodel/XSSFColor.java>:277: error: unknown tag: srgbClr
  [javadoc]      *  <srgbClr> value expressed in the Theme part.
  [javadoc]         ^
  [javadoc] <https://builds.apache.org/job/POI-DSL-Github-PullRequests/ws/src/ooxml/java/org/apache/poi/xssf/usermodel/XSSFDxfStyleProvider.java>:42: error: bad use of '>'
  [javadoc]      * @param stripeSize 0 for non-stripe styles, > 1 for stripes
  [javadoc]                                                   ^
  [javadoc] <https://builds.apache.org/job/POI-DSL-Github-PullRequests/ws/src/ooxml/java/org/apache/poi/xssf/usermodel/XSSFName.java>:146: error: tag not allowed here: <blockquote>
  [javadoc]      * <pre><blockquote>
  [javadoc]             ^
  [javadoc] <https://builds.apache.org/job/POI-DSL-Github-PullRequests/ws/src/ooxml/java/org/apache/poi/xssf/usermodel/XSSFName.java>:165: error: unexpected end tag: </p>
  [javadoc]     * </p>
  [javadoc]       ^
  [javadoc] <https://builds.apache.org/job/POI-DSL-Github-PullRequests/ws/src/ooxml/java/org/apache/poi/xssf/usermodel/XSSFName.java>:36: error: tag not allowed here: <blockquote>
  [javadoc]  * <pre><blockquote>
  [javadoc]         ^
  [javadoc] <https://builds.apache.org/job/POI-DSL-Github-PullRequests/ws/src/ooxml/java/org/apache/poi/xssf/usermodel/XSSFName.java>:86: error: tag not allowed here: <li>
  [javadoc]      * <li> this defined name refers to a range to which an advanced filter has been
  [javadoc]        ^
  [javadoc] <https://builds.apache.org/job/POI-DSL-Github-PullRequests/ws/src/ooxml/java/org/apache/poi/xssf/usermodel/XSSFName.java>:88: error: tag not allowed here: <li>
  [javadoc]      * <li> This defined name refers to a range to which an AutoFilter has been
  [javadoc]        ^
  [javadoc] <https://builds.apache.org/job/POI-DSL-Github-PullRequests/ws/src/ooxml/java/org/apache/poi/xssf/usermodel/XSSFRichTextString.java>:431: error: bad use of '>'
  [javadoc]      * CTRPrElt --> CTFont adapter
  [javadoc]                   ^
  [javadoc] <https://builds.apache.org/job/POI-DSL-Github-PullRequests/ws/src/ooxml/java/org/apache/poi/xssf/usermodel/XSSFRow.java>:105: error: unknown tag: Cell
  [javadoc]      * for (Iterator<Cell> it = row.cellIterator(); it.hasNext(); ) {
  [javadoc]                     ^
  [javadoc] <https://builds.apache.org/job/POI-DSL-Github-PullRequests/ws/src/ooxml/java/org/apache/poi/xssf/usermodel/XSSFRow.java>:192: error: malformed HTML
  [javadoc]      * @throws IllegalArgumentException if columnIndex < 0 or greater than 16384,
  [javadoc]                                                        ^
  [javadoc] <https://builds.apache.org/job/POI-DSL-Github-PullRequests/ws/src/ooxml/java/org/apache/poi/xssf/usermodel/XSSFRow.java>:206: error: malformed HTML
  [javadoc]      * @throws IllegalArgumentException if the specified cell type is invalid, columnIndex < 0
  [javadoc]                                                                                            ^
  [javadoc] <https://builds.apache.org/job/POI-DSL-Github-PullRequests/ws/src/ooxml/java/org/apache/poi/xssf/usermodel/XSSFRow.java>:385: error: malformed HTML
  [javadoc]      * @throws IllegalArgumentException if rowNum < 0 or greater than 1048575
  [javadoc]                                                   ^
  [javadoc] <https://builds.apache.org/job/POI-DSL-Github-PullRequests/ws/src/ooxml/java/org/apache/poi/xssf/usermodel/XSSFSheetConditionalFormatting.java>:70: error: unexpected end tag: </p>
  [javadoc]      * </p>
  [javadoc]        ^
  [javadoc] <https://builds.apache.org/job/POI-DSL-Github-PullRequests/ws/src/ooxml/java/org/apache/poi/xssf/usermodel/XSSFTableColumn.java>:78: error: invalid use of @return
  [javadoc]      * @return the column id
  [javadoc]        ^
  [javadoc] 100 errors
  [javadoc] 100 warnings
      [jar] Building jar: <https://builds.apache.org/job/POI-DSL-Github-PullRequests/ws/build/dist/maven/poi-ooxml/poi-ooxml-4.1.0-javadoc.jar>

assemble:
      [zip] Building zip: <https://builds.apache.org/job/POI-DSL-Github-PullRequests/ws/build/dist/poi-bin-4.1.0-20181228.zip>
      [tar] Building tar: <https://builds.apache.org/job/POI-DSL-Github-PullRequests/3/artifact/build/dist/poi-bin-4.1.0-20181228.tar.gz>
      [zip] Building zip: <https://builds.apache.org/job/POI-DSL-Github-PullRequests/ws/build/dist/poi-src-4.1.0-20181228.zip>
      [tar] Building tar: <https://builds.apache.org/job/POI-DSL-Github-PullRequests/3/artifact/build/dist/poi-src-4.1.0-20181228.tar.gz>
     [echo] Creating Maven POMs

maven-poms:
     [copy] Copying 6 files to <https://builds.apache.org/job/POI-DSL-Github-PullRequests/ws/build/dist/maven>
     [echo] Maven POMs are located in <https://builds.apache.org/job/POI-DSL-Github-PullRequests/ws/build/dist>
     [echo] Use ant dist-nexus to deploy the artifacts in the remote repository
     [echo] Distribution located in <https://builds.apache.org/job/POI-DSL-Github-PullRequests/ws/build/dist>
     [echo] Use "ant dist-checksum" to create sha256/sha512 checksums and GPG signatures

findbugs:
      [get] Destination already exists (skipping): <https://builds.apache.org/job/POI-DSL-Github-PullRequests/ws/lib/findbugs-noUpdateChecks-3.0.1.zip>
    [unzip] Expanding: <https://builds.apache.org/job/POI-DSL-Github-PullRequests/ws/lib/findbugs-noUpdateChecks-3.0.1.zip> into <https://builds.apache.org/job/POI-DSL-Github-PullRequests/ws/build/findbugs>
 [findbugs] Executing findbugs FindBugsTask from ant task
 [findbugs] Running FindBugs...
 [findbugs] The following classes needed for analysis were missing:
 [findbugs]   org.apache.batik.bridge.UserAgent
 [findbugs]   org.apache.batik.bridge.DocumentLoader
 [findbugs]   org.apache.batik.bridge.BridgeContext
 [findbugs]   org.apache.batik.ext.awt.RenderingHintsKeyExt
 [findbugs]   org.apache.batik.ext.awt.image.renderable.Filter
 [findbugs]   org.apache.batik.bridge.GVTBuilder
 [findbugs]   org.apache.batik.util.XMLResourceDescriptor
 [findbugs]   org.apache.batik.anim.dom.SAXSVGDocumentFactory
 [findbugs]   org.apache.batik.bridge.UserAgentAdapter
 [findbugs]   org.apache.batik.gvt.GraphicsNode
 [findbugs]   org.apache.batik.ext.awt.image.renderable.ClipRable8Bit
 [findbugs]   org.apache.batik.ext.awt.image.renderable.ClipRable
 [findbugs] Warnings generated: 124
 [findbugs] Missing classes: 9
 [findbugs] Calculating exit code...
 [findbugs] Setting 'missing class' flag (2)
 [findbugs] Setting 'bugs found' flag (1)
 [findbugs] Exit code set to: 3
 [findbugs] Java Result: 3
 [findbugs] Classes needed for analysis were missing
 [findbugs] Output saved to build/findbugs.xml
     [xslt] Transforming into <https://builds.apache.org/job/POI-DSL-Github-PullRequests/ws/build>
     [xslt] Processing <https://builds.apache.org/job/POI-DSL-Github-PullRequests/ws/build/findbugs.xml> to <https://builds.apache.org/job/POI-DSL-Github-PullRequests/3/artifact/build/findbugs.html>
     [xslt] Loading stylesheet jar:<https://builds.apache.org/job/POI-DSL-Github-PullRequests/ws/build/findbugs/lib/findbugs.jar!/fancy-hist.xsl>

release-notes:

BUILD FAILED
<https://builds.apache.org/job/POI-DSL-Github-PullRequests/ws/build.xml>:1995: Warning: Could not find file <https://builds.apache.org/job/POI-DSL-Github-PullRequests/ws/src/documentation/RELEASE-NOTES.txt> to copy.

Total time: 22 minutes 3 seconds
Build step 'Invoke Ant' marked build as failure
Skipping publisher since build result is FAILURE
Archiving artifacts
[Fast Archiver] No prior successful build to compare, so performing full copy of artifacts
Skipping publisher since build result is FAILURE
Recording test results

---------------------------------------------------------------------
To unsubscribe, e-mail: [hidden email]
For additional commands, e-mail: [hidden email]

Reply | Threaded
Open this post in threaded view
|

Build failed in Jenkins: POI-DSL-Github-PullRequests #4

Apache Jenkins Server
See <https://builds.apache.org/job/POI-DSL-Github-PullRequests/4/display/redirect>

------------------------------------------
[...truncated 108.17 KB...]
    [junit] Running org.apache.poi.hslf.usermodel.TestRichTextRun
    [junit] Tests run: 11, Failures: 0, Errors: 0, Skipped: 0, Time elapsed: 0.139 sec
    [junit] Running org.apache.poi.hslf.usermodel.TestSheetText
    [junit] Tests run: 1, Failures: 0, Errors: 0, Skipped: 0, Time elapsed: 0.002 sec
    [junit] Running org.apache.poi.hslf.usermodel.TestSlideOrdering
    [junit] Tests run: 3, Failures: 0, Errors: 0, Skipped: 0, Time elapsed: 0.023 sec
    [junit] Running org.apache.poi.hslf.usermodel.TestSoundData
    [junit] Tests run: 1, Failures: 0, Errors: 0, Skipped: 0, Time elapsed: 0.003 sec
    [junit] Running org.apache.poi.hslf.usermodel.TestTable
    [junit] Tests run: 3, Failures: 0, Errors: 0, Skipped: 0, Time elapsed: 0.017 sec
    [junit] Running org.apache.poi.hslf.usermodel.TestTextRun
    [junit] Tests run: 14, Failures: 0, Errors: 0, Skipped: 0, Time elapsed: 0.027 sec
    [junit] Running org.apache.poi.hslf.usermodel.TestTextShape
    [junit] Tests run: 6, Failures: 0, Errors: 0, Skipped: 0, Time elapsed: 0.013 sec
    [junit] Running org.apache.poi.hslf.util.TestSystemTimeUtils
    [junit] Tests run: 4, Failures: 0, Errors: 0, Skipped: 0, Time elapsed: 0.002 sec
    [junit] Running org.apache.poi.hsmf.TestBasics
    [junit] Tests run: 9, Failures: 0, Errors: 0, Skipped: 0, Time elapsed: 0.018 sec
    [junit] Running org.apache.poi.hsmf.TestBlankFileRead
    [junit] Tests run: 7, Failures: 0, Errors: 0, Skipped: 0, Time elapsed: 0.002 sec
    [junit] Running org.apache.poi.hsmf.TestExtractEmbeddedMSG
    [junit] Tests run: 1, Failures: 0, Errors: 0, Skipped: 0, Time elapsed: 0.009 sec
    [junit] Running org.apache.poi.hsmf.TestFileWithAttachmentsRead
    [junit] Tests run: 4, Failures: 0, Errors: 0, Skipped: 0, Time elapsed: 0.019 sec
    [junit] Running org.apache.poi.hsmf.TestFixedSizedProperties
    [junit] Tests run: 7, Failures: 0, Errors: 0, Skipped: 0, Time elapsed: 0.067 sec
    [junit] Running org.apache.poi.hsmf.TestMessageSubmissionChunk
    [junit] Tests run: 2, Failures: 0, Errors: 0, Skipped: 0, Time elapsed: 0.001 sec
    [junit] Running org.apache.poi.hsmf.TestMessageSubmissionChunkY2KRead
    [junit] Tests run: 3, Failures: 0, Errors: 0, Skipped: 0, Time elapsed: 0.002 sec
    [junit] Running org.apache.poi.hsmf.TestOutlook30FileRead
    [junit] Tests run: 9, Failures: 0, Errors: 0, Skipped: 0, Time elapsed: 0.005 sec
    [junit] Running org.apache.poi.hsmf.TestSimpleFileRead
    [junit] Tests run: 9, Failures: 0, Errors: 0, Skipped: 0, Time elapsed: 0.025 sec
    [junit] Running org.apache.poi.hsmf.datatypes.TestChunkData
    [junit] Tests run: 6, Failures: 0, Errors: 0, Skipped: 0, Time elapsed: 0.002 sec
    [junit] Running org.apache.poi.hsmf.datatypes.TestMAPIProperty
    [junit] Tests run: 3, Failures: 0, Errors: 0, Skipped: 0, Time elapsed: 0.002 sec
    [junit] Running org.apache.poi.hsmf.datatypes.TestSorters
    [junit] Tests run: 2, Failures: 0, Errors: 0, Skipped: 0, Time elapsed: 0.001 sec
    [junit] Running org.apache.poi.hsmf.datatypes.TestTypes
    [junit] Tests run: 3, Failures: 0, Errors: 0, Skipped: 0, Time elapsed: 0.001 sec
    [junit] Running org.apache.poi.hsmf.extractor.TestOutlookTextExtractor
    [junit] Tests run: 8, Failures: 0, Errors: 0, Skipped: 0, Time elapsed: 0.097 sec
    [junit] Running org.apache.poi.hsmf.parsers.TestPOIFSChunkParser
    [junit] Tests run: 6, Failures: 0, Errors: 0, Skipped: 0, Time elapsed: 0.113 sec
    [junit] Running org.apache.poi.hssf.converter.TestExcelConverterSuite
    [junit] Tests run: 748, Failures: 0, Errors: 0, Skipped: 0, Time elapsed: 13.644 sec
    [junit] Running org.apache.poi.hssf.usermodel.TestHSSFChart
    [junit] Tests run: 7, Failures: 0, Errors: 0, Skipped: 0, Time elapsed: 0.091 sec
    [junit] Running org.apache.poi.hwmf.TestHwmfParsing
    [junit] Tests run: 7, Failures: 0, Errors: 0, Skipped: 5, Time elapsed: 0.082 sec
    [junit] Running org.apache.poi.hwpf.TestFieldsTables
    [junit] Tests run: 1, Failures: 0, Errors: 0, Skipped: 0, Time elapsed: 0.004 sec
    [junit] Running org.apache.poi.hwpf.TestHWPFPictures
    [junit] Tests run: 6, Failures: 0, Errors: 0, Skipped: 0, Time elapsed: 0.109 sec
    [junit] Running org.apache.poi.hwpf.TestHWPFRangeParts
    [junit] Tests run: 2, Failures: 0, Errors: 0, Skipped: 0, Time elapsed: 0.013 sec
    [junit] Running org.apache.poi.hwpf.converter.TestNumberFormatter
    [junit] Tests run: 2, Failures: 0, Errors: 0, Skipped: 0, Time elapsed: 0.111 sec
    [junit] Running org.apache.poi.hwpf.converter.TestWordToConverterSuite
    [junit] Tests run: 405, Failures: 0, Errors: 0, Skipped: 0, Time elapsed: 3.707 sec
    [junit] Running org.apache.poi.hwpf.converter.TestWordToFoConverter
    [junit] Tests run: 8, Failures: 0, Errors: 0, Skipped: 0, Time elapsed: 0.011 sec
    [junit] Running org.apache.poi.hwpf.converter.TestWordToHtmlConverter
    [junit] Tests run: 21, Failures: 0, Errors: 0, Skipped: 0, Time elapsed: 0.1 sec
    [junit] Running org.apache.poi.hwpf.converter.TestWordToTextConverter
    [junit] Tests run: 3, Failures: 0, Errors: 0, Skipped: 0, Time elapsed: 0.038 sec
    [junit] Running org.apache.poi.hwpf.dev.TestHWPFLister
    [junit] Tests run: 2, Failures: 0, Errors: 0, Skipped: 0, Time elapsed: 0.04 sec
    [junit] Running org.apache.poi.hwpf.extractor.TestDifferentRoutes
    [junit] Tests run: 2, Failures: 0, Errors: 0, Skipped: 0, Time elapsed: 0.002 sec
    [junit] Running org.apache.poi.hwpf.extractor.TestWordExtractor
    [junit] Tests run: 18, Failures: 0, Errors: 0, Skipped: 0, Time elapsed: 0.048 sec
    [junit] Running org.apache.poi.hwpf.extractor.TestWordExtractorBugs
    [junit] Tests run: 3, Failures: 0, Errors: 0, Skipped: 0, Time elapsed: 0.11 sec
    [junit] Running org.apache.poi.hwpf.model.TestBookmarksTables
    [junit] Tests run: 5, Failures: 0, Errors: 0, Skipped: 0, Time elapsed: 0.004 sec
    [junit] Running org.apache.poi.hwpf.model.TestCHPBinTable
    [junit] Tests run: 1, Failures: 0, Errors: 0, Skipped: 0, Time elapsed: 0.002 sec
    [junit] Running org.apache.poi.hwpf.model.TestDocumentProperties
    [junit] Tests run: 1, Failures: 0, Errors: 0, Skipped: 0, Time elapsed: 0.003 sec
    [junit] Running org.apache.poi.hwpf.model.TestFileInformationBlock
    [junit] Tests run: 1, Failures: 0, Errors: 0, Skipped: 0, Time elapsed: 0.001 sec
    [junit] Running org.apache.poi.hwpf.model.TestFontTable
    [junit] Tests run: 1, Failures: 0, Errors: 0, Skipped: 0, Time elapsed: 0.001 sec
    [junit] Running org.apache.poi.hwpf.model.TestListTables
    [junit] Tests run: 1, Failures: 0, Errors: 0, Skipped: 0, Time elapsed: 0.001 sec
    [junit] Running org.apache.poi.hwpf.model.TestNotesTables
    [junit] Tests run: 1, Failures: 0, Errors: 0, Skipped: 0, Time elapsed: 0.001 sec
    [junit] Running org.apache.poi.hwpf.model.TestPAPBinTable
    [junit] Tests run: 2, Failures: 0, Errors: 0, Skipped: 0, Time elapsed: 0.007 sec
    [junit] Running org.apache.poi.hwpf.model.TestPlexOfCps
    [junit] Tests run: 1, Failures: 0, Errors: 0, Skipped: 0, Time elapsed: 0.002 sec
    [junit] Running org.apache.poi.hwpf.model.TestRevisionMarkAuthorTable
    [junit] Tests run: 3, Failures: 0, Errors: 0, Skipped: 0, Time elapsed: 0.003 sec
    [junit] Running org.apache.poi.hwpf.model.TestSavedByTable
    [junit] Tests run: 1, Failures: 0, Errors: 0, Skipped: 0, Time elapsed: 0.012 sec
    [junit] Running org.apache.poi.hwpf.model.TestSectionTable
    [junit] Tests run: 1, Failures: 0, Errors: 0, Skipped: 0, Time elapsed: 0.001 sec
    [junit] Running org.apache.poi.hwpf.model.TestStyleSheet
    [junit] Tests run: 2, Failures: 0, Errors: 0, Skipped: 0, Time elapsed: 0.002 sec
    [junit] Running org.apache.poi.hwpf.model.TestTextPieceTable
    [junit] Tests run: 4, Failures: 0, Errors: 0, Skipped: 0, Time elapsed: 0.007 sec
    [junit] Running org.apache.poi.hwpf.sprm.TestSprms
    [junit] Tests run: 2, Failures: 0, Errors: 0, Skipped: 0, Time elapsed: 0.005 sec
    [junit] Running org.apache.poi.hwpf.usermodel.TestBorderCode
    [junit] Tests run: 1, Failures: 0, Errors: 0, Skipped: 0, Time elapsed: 0.001 sec
    [junit] Running org.apache.poi.hwpf.usermodel.TestBug46610
    [junit] Tests run: 3, Failures: 0, Errors: 0, Skipped: 0, Time elapsed: 0.006 sec
    [junit] Running org.apache.poi.hwpf.usermodel.TestBug47563
    [junit] Tests run: 1, Failures: 0, Errors: 0, Skipped: 0, Time elapsed: 0.022 sec
    [junit] Running org.apache.poi.hwpf.usermodel.TestBug49820
    [junit] Tests run: 1, Failures: 0, Errors: 0, Skipped: 0, Time elapsed: 0.001 sec
    [junit] Running org.apache.poi.hwpf.usermodel.TestBug50075
    [junit] Tests run: 1, Failures: 0, Errors: 0, Skipped: 0, Time elapsed: 0.001 sec
    [junit] Running org.apache.poi.hwpf.usermodel.TestBugs
    [junit] Tests run: 39, Failures: 0, Errors: 0, Skipped: 0, Time elapsed: 0.37 sec
    [junit] Running org.apache.poi.hwpf.usermodel.TestHWPFOldDocument
    [junit] Tests run: 14, Failures: 0, Errors: 0, Skipped: 0, Time elapsed: 0.05 sec
    [junit] Running org.apache.poi.hwpf.usermodel.TestHWPFWrite
    [junit] Tests run: 5, Failures: 0, Errors: 0, Skipped: 0, Time elapsed: 0.012 sec
    [junit] Running org.apache.poi.hwpf.usermodel.TestHeaderStories
    [junit] Tests run: 8, Failures: 0, Errors: 0, Skipped: 0, Time elapsed: 0.021 sec
    [junit] Running org.apache.poi.hwpf.usermodel.TestLists
    [junit] Tests run: 7, Failures: 0, Errors: 0, Skipped: 0, Time elapsed: 0.006 sec
    [junit] Running org.apache.poi.hwpf.usermodel.TestOfficeDrawings
    [junit] Tests run: 1, Failures: 0, Errors: 0, Skipped: 0, Time elapsed: 0.001 sec
    [junit] Running org.apache.poi.hwpf.usermodel.TestPictures
    [junit] Tests run: 16, Failures: 0, Errors: 0, Skipped: 2, Time elapsed: 0.031 sec
    [junit] Running org.apache.poi.hwpf.usermodel.TestProblems
    [junit] Tests run: 10, Failures: 0, Errors: 0, Skipped: 0, Time elapsed: 0.02 sec
    [junit] Running org.apache.poi.hwpf.usermodel.TestRange
    [junit] Tests run: 2, Failures: 0, Errors: 0, Skipped: 0, Time elapsed: 0.002 sec
    [junit] Running org.apache.poi.hwpf.usermodel.TestRangeDelete
    [junit] Tests run: 4, Failures: 0, Errors: 0, Skipped: 0, Time elapsed: 0.003 sec
    [junit] Running org.apache.poi.hwpf.usermodel.TestRangeInsertion
    [junit] Tests run: 3, Failures: 0, Errors: 0, Skipped: 0, Time elapsed: 0.002 sec
    [junit] Running org.apache.poi.hwpf.usermodel.TestRangeProperties
    [junit] Tests run: 5, Failures: 0, Errors: 0, Skipped: 0, Time elapsed: 0.004 sec
    [junit] Running org.apache.poi.hwpf.usermodel.TestRangeReplacement
    [junit] Tests run: 4, Failures: 0, Errors: 0, Skipped: 0, Time elapsed: 0.003 sec
    [junit] Running org.apache.poi.hwpf.usermodel.TestRangeSymbols
    [junit] Tests run: 2, Failures: 0, Errors: 0, Skipped: 0, Time elapsed: 0.002 sec
    [junit] Running org.apache.poi.hwpf.usermodel.TestTableRow
    [junit] Tests run: 2, Failures: 0, Errors: 0, Skipped: 0, Time elapsed: 0.002 sec

-test-scratchpad-write-testfile:

-test-ooxml-check:

-ooxml-lite-agent:
      [jar] Building jar: <https://builds.apache.org/job/POI-DSL-Github-PullRequests/ws/build/ooxml-lite-agent.jar>

test-ooxml:
[jacoco:coverage] Enhancing junit with coverage
    [junit] Running org.apache.poi.TestDetectAsOOXML
    [junit] Tests run: 3, Failures: 0, Errors: 0, Skipped: 0, Time elapsed: 0.477 sec
    [junit] Running org.apache.poi.TestEmbedded
    [junit] Tests run: 3, Failures: 0, Errors: 0, Skipped: 0, Time elapsed: 1.344 sec
    [junit] Running org.apache.poi.TestXMLPropertiesTextExtractor
    [junit] Tests run: 5, Failures: 0, Errors: 0, Skipped: 0, Time elapsed: 0.435 sec
    [junit] Running org.apache.poi.extractor.ooxml.TestExtractorFactory
    [junit] Tests run: 15, Failures: 0, Errors: 0, Skipped: 0, Time elapsed: 2.281 sec
    [junit] Running org.apache.poi.ooxml.TestPOIXMLDocument
    [junit] Tests run: 11, Failures: 0, Errors: 0, Skipped: 0, Time elapsed: 2.542 sec
    [junit] Running org.apache.poi.ooxml.TestPOIXMLProperties
    [junit] Tests run: 7, Failures: 0, Errors: 0, Skipped: 1, Time elapsed: 0.163 sec
    [junit] Running org.apache.poi.ooxml.util.TestDocumentHelper
    [junit] Tests run: 2, Failures: 0, Errors: 0, Skipped: 0, Time elapsed: 0.003 sec
    [junit] Running org.apache.poi.ooxml.util.TestSAXHelper
    [junit] Tests run: 1, Failures: 0, Errors: 0, Skipped: 0, Time elapsed: 0.003 sec
    [junit] Running org.apache.poi.openxml4j.opc.TestContentType
    [junit] Tests run: 7, Failures: 0, Errors: 0, Skipped: 0, Time elapsed: 0.018 sec
    [junit] Running org.apache.poi.openxml4j.opc.TestFileHelper
    [junit] Tests run: 1, Failures: 0, Errors: 0, Skipped: 0, Time elapsed: 0.002 sec
    [junit] Running org.apache.poi.openxml4j.opc.TestListParts
    [junit] Tests run: 1, Failures: 0, Errors: 0, Skipped: 0, Time elapsed: 0.004 sec
    [junit] Running org.apache.poi.openxml4j.opc.TestPackage
    [junit] Tests run: 38, Failures: 0, Errors: 0, Skipped: 1, Time elapsed: 1.312 sec
    [junit] Running org.apache.poi.openxml4j.opc.TestPackageCoreProperties
    [junit] Tests run: 7, Failures: 0, Errors: 0, Skipped: 0, Time elapsed: 0.11 sec
    [junit] Running org.apache.poi.openxml4j.opc.TestPackagePartName
    [junit] Tests run: 1, Failures: 0, Errors: 0, Skipped: 0, Time elapsed: 0.002 sec
    [junit] Running org.apache.poi.openxml4j.opc.TestPackageThumbnail
    [junit] Tests run: 1, Failures: 0, Errors: 0, Skipped: 0, Time elapsed: 0.017 sec
    [junit] Running org.apache.poi.openxml4j.opc.TestPackagingURIHelper
    [junit] Tests run: 5, Failures: 0, Errors: 0, Skipped: 0, Time elapsed: 0.003 sec
    [junit] Running org.apache.poi.openxml4j.opc.TestRelationships
    [junit] Tests run: 9, Failures: 0, Errors: 0, Skipped: 0, Time elapsed: 0.049 sec
    [junit] Running org.apache.poi.openxml4j.opc.compliance.TestOPCComplianceCoreProperties
    [junit] Tests run: 11, Failures: 0, Errors: 0, Skipped: 0, Time elapsed: 0.057 sec
    [junit] Running org.apache.poi.openxml4j.opc.compliance.TestOPCCompliancePackageModel
    [junit] Tests run: 5, Failures: 0, Errors: 0, Skipped: 0, Time elapsed: 0.006 sec
    [junit] Running org.apache.poi.openxml4j.opc.compliance.TestOPCCompliancePartName
    [junit] Tests run: 10, Failures: 0, Errors: 0, Skipped: 0, Time elapsed: 0.005 sec
    [junit] Running org.apache.poi.openxml4j.opc.internal.TestContentTypeManager
    [junit] Tests run: 5, Failures: 0, Errors: 0, Skipped: 1, Time elapsed: 0.159 sec
    [junit] Running org.apache.poi.openxml4j.opc.internal.marshallers.TestZipPackagePropertiesMarshaller
    [junit] Tests run: 4, Failures: 0, Errors: 0, Skipped: 0, Time elapsed: 0.005 sec
    [junit] Running org.apache.poi.openxml4j.util.TestZipSecureFile
    [junit] Tests run: 1, Failures: 0, Errors: 0, Skipped: 0, Time elapsed: 0.002 sec
    [junit] Running org.apache.poi.poifs.crypt.TestAgileEncryptionParameters
    [junit] Tests run: 60, Failures: 0, Errors: 0, Skipped: 0, Time elapsed: 10.179 sec
    [junit] Running org.apache.poi.poifs.crypt.TestCertificateEncryption
    [junit] Tests run: 1, Failures: 0, Errors: 0, Skipped: 0, Time elapsed: 0.115 sec
    [junit] Running org.apache.poi.poifs.crypt.TestDecryptor
    [junit] Tests run: 7, Failures: 0, Errors: 0, Skipped: 0, Time elapsed: 0.317 sec
    [junit] Running org.apache.poi.poifs.crypt.TestEncryptionInfo
    [junit] Tests run: 2, Failures: 0, Errors: 0, Skipped: 0, Time elapsed: 0.003 sec
    [junit] Running org.apache.poi.poifs.crypt.TestEncryptor
    [junit] Tests run: 6, Failures: 0, Errors: 0, Skipped: 1, Time elapsed: 0.731 sec
    [junit] Running org.apache.poi.poifs.crypt.TestHxxFEncryption
    [junit] Tests run: 20, Failures: 0, Errors: 0, Skipped: 0, Time elapsed: 1 sec
    [junit] Running org.apache.poi.poifs.crypt.TestSecureTempZip
    [junit] Tests run: 2, Failures: 0, Errors: 0, Skipped: 0, Time elapsed: 0.272 sec
    [junit] Running org.apache.poi.poifs.crypt.dsig.TestSignatureConfig
    [junit] Tests run: 2, Failures: 0, Errors: 0, Skipped: 1, Time elapsed: 0.004 sec
    [junit] Running org.apache.poi.sl.TestFonts
    [junit] Tests run: 2, Failures: 0, Errors: 0, Skipped: 0, Time elapsed: 0.359 sec
    [junit] Running org.apache.poi.sl.TestHeadersFooters
    [junit] Tests run: 1, Failures: 0, Errors: 0, Skipped: 0, Time elapsed: 0.027 sec
    [junit] Running org.apache.poi.sl.TestOleShape
    [junit] Tests run: 6, Failures: 0, Errors: 0, Skipped: 0, Time elapsed: 0.335 sec
    [junit] Running org.apache.poi.sl.TestSlide
    [junit] Tests run: 2, Failures: 0, Errors: 0, Skipped: 0, Time elapsed: 0.087 sec
    [junit] Running org.apache.poi.sl.TestTable
    [junit] Tests run: 4, Failures: 0, Errors: 0, Skipped: 0, Time elapsed: 0.157 sec
    [junit] Running org.apache.poi.sl.draw.TestDrawPictureShape
    [junit] Tests run: 2, Failures: 0, Errors: 0, Skipped: 0, Time elapsed: 0.071 sec
    [junit] Running org.apache.poi.ss.TestWorkbookFactory
    [junit] Tests run: 11, Failures: 0, Errors: 0, Skipped: 0, Time elapsed: 0.316 sec
    [junit] Running org.apache.poi.ss.extractor.TestEmbeddedExtractor
    [junit] Tests run: 3, Failures: 0, Errors: 0, Skipped: 0, Time elapsed: 0.27 sec
    [junit] Running org.apache.poi.ss.format.TestCellFormatPart
    [junit] Tests run: 8, Failures: 1, Errors: 1, Skipped: 0, Time elapsed: 0.393 sec

BUILD FAILED
<https://builds.apache.org/job/POI-DSL-Github-PullRequests/ws/build.xml>:1611: The following error occurred while executing this line:
<https://builds.apache.org/job/POI-DSL-Github-PullRequests/ws/build.xml>:1577: The following error occurred while executing this line:
<https://builds.apache.org/job/POI-DSL-Github-PullRequests/ws/build.xml>:1223: Tests failed

Total time: 4 minutes 54 seconds
Build step 'Invoke Ant' marked build as failure
Skipping publisher since build result is FAILURE
Archiving artifacts
[Fast Archiver] No prior successful build to compare, so performing full copy of artifacts
Skipping publisher since build result is FAILURE
Recording test results

---------------------------------------------------------------------
To unsubscribe, e-mail: [hidden email]
For additional commands, e-mail: [hidden email]

Reply | Threaded
Open this post in threaded view
|

Build failed in Jenkins: POI-DSL-Github-PullRequests #5

Apache Jenkins Server
See <https://builds.apache.org/job/POI-DSL-Github-PullRequests/5/display/redirect>

------------------------------------------
[...truncated 123.50 KB...]
    [junit] Running org.apache.poi.hwpf.model.TestCHPBinTable
    [junit] Tests run: 1, Failures: 0, Errors: 0, Skipped: 0, Time elapsed: 0.001 sec
    [junit] Running org.apache.poi.hwpf.model.TestDocumentProperties
    [junit] Tests run: 1, Failures: 0, Errors: 0, Skipped: 0, Time elapsed: 0.002 sec
    [junit] Running org.apache.poi.hwpf.model.TestFileInformationBlock
    [junit] Tests run: 1, Failures: 0, Errors: 0, Skipped: 0, Time elapsed: 0.001 sec
    [junit] Running org.apache.poi.hwpf.model.TestFontTable
    [junit] Tests run: 1, Failures: 0, Errors: 0, Skipped: 0, Time elapsed: 0 sec
    [junit] Running org.apache.poi.hwpf.model.TestListTables
    [junit] Tests run: 1, Failures: 0, Errors: 0, Skipped: 0, Time elapsed: 0.001 sec
    [junit] Running org.apache.poi.hwpf.model.TestNotesTables
    [junit] Tests run: 1, Failures: 0, Errors: 0, Skipped: 0, Time elapsed: 0 sec
    [junit] Running org.apache.poi.hwpf.model.TestPAPBinTable
    [junit] Tests run: 2, Failures: 0, Errors: 0, Skipped: 0, Time elapsed: 0.005 sec
    [junit] Running org.apache.poi.hwpf.model.TestPlexOfCps
    [junit] Tests run: 1, Failures: 0, Errors: 0, Skipped: 0, Time elapsed: 0.001 sec
    [junit] Running org.apache.poi.hwpf.model.TestRevisionMarkAuthorTable
    [junit] Tests run: 3, Failures: 0, Errors: 0, Skipped: 0, Time elapsed: 0.003 sec
    [junit] Running org.apache.poi.hwpf.model.TestSavedByTable
    [junit] Tests run: 1, Failures: 0, Errors: 0, Skipped: 0, Time elapsed: 0.008 sec
    [junit] Running org.apache.poi.hwpf.model.TestSectionTable
    [junit] Tests run: 1, Failures: 0, Errors: 0, Skipped: 0, Time elapsed: 0.001 sec
    [junit] Running org.apache.poi.hwpf.model.TestStyleSheet
    [junit] Tests run: 2, Failures: 0, Errors: 0, Skipped: 0, Time elapsed: 0.002 sec
    [junit] Running org.apache.poi.hwpf.model.TestTextPieceTable
    [junit] Tests run: 4, Failures: 0, Errors: 0, Skipped: 0, Time elapsed: 0.005 sec
    [junit] Running org.apache.poi.hwpf.sprm.TestSprms
    [junit] Tests run: 2, Failures: 0, Errors: 0, Skipped: 0, Time elapsed: 0.004 sec
    [junit] Running org.apache.poi.hwpf.usermodel.TestBorderCode
    [junit] Tests run: 1, Failures: 0, Errors: 0, Skipped: 0, Time elapsed: 0.001 sec
    [junit] Running org.apache.poi.hwpf.usermodel.TestBug46610
    [junit] Tests run: 3, Failures: 0, Errors: 0, Skipped: 0, Time elapsed: 0.004 sec
    [junit] Running org.apache.poi.hwpf.usermodel.TestBug47563
    [junit] Tests run: 1, Failures: 0, Errors: 0, Skipped: 0, Time elapsed: 0.016 sec
    [junit] Running org.apache.poi.hwpf.usermodel.TestBug49820
    [junit] Tests run: 1, Failures: 0, Errors: 0, Skipped: 0, Time elapsed: 0 sec
    [junit] Running org.apache.poi.hwpf.usermodel.TestBug50075
    [junit] Tests run: 1, Failures: 0, Errors: 0, Skipped: 0, Time elapsed: 0.002 sec
    [junit] Running org.apache.poi.hwpf.usermodel.TestBugs
    [junit] Tests run: 39, Failures: 0, Errors: 0, Skipped: 0, Time elapsed: 0.321 sec
    [junit] Running org.apache.poi.hwpf.usermodel.TestHWPFOldDocument
    [junit] Tests run: 14, Failures: 0, Errors: 0, Skipped: 0, Time elapsed: 0.043 sec
    [junit] Running org.apache.poi.hwpf.usermodel.TestHWPFWrite
    [junit] Tests run: 5, Failures: 0, Errors: 0, Skipped: 0, Time elapsed: 0.011 sec
    [junit] Running org.apache.poi.hwpf.usermodel.TestHeaderStories
    [junit] Tests run: 8, Failures: 0, Errors: 0, Skipped: 0, Time elapsed: 0.029 sec
    [junit] Running org.apache.poi.hwpf.usermodel.TestLists
    [junit] Tests run: 7, Failures: 0, Errors: 0, Skipped: 0, Time elapsed: 0.006 sec
    [junit] Running org.apache.poi.hwpf.usermodel.TestOfficeDrawings
    [junit] Tests run: 1, Failures: 0, Errors: 0, Skipped: 0, Time elapsed: 0.002 sec
    [junit] Running org.apache.poi.hwpf.usermodel.TestPictures
    [junit] Tests run: 16, Failures: 0, Errors: 0, Skipped: 2, Time elapsed: 0.023 sec
    [junit] Running org.apache.poi.hwpf.usermodel.TestProblems
    [junit] Tests run: 10, Failures: 0, Errors: 0, Skipped: 0, Time elapsed: 0.015 sec
    [junit] Running org.apache.poi.hwpf.usermodel.TestRange
    [junit] Tests run: 2, Failures: 0, Errors: 0, Skipped: 0, Time elapsed: 0.002 sec
    [junit] Running org.apache.poi.hwpf.usermodel.TestRangeDelete
    [junit] Tests run: 4, Failures: 0, Errors: 0, Skipped: 0, Time elapsed: 0.003 sec
    [junit] Running org.apache.poi.hwpf.usermodel.TestRangeInsertion
    [junit] Tests run: 3, Failures: 0, Errors: 0, Skipped: 0, Time elapsed: 0.002 sec
    [junit] Running org.apache.poi.hwpf.usermodel.TestRangeProperties
    [junit] Tests run: 5, Failures: 0, Errors: 0, Skipped: 0, Time elapsed: 0.004 sec
    [junit] Running org.apache.poi.hwpf.usermodel.TestRangeReplacement
    [junit] Tests run: 4, Failures: 0, Errors: 0, Skipped: 0, Time elapsed: 0.002 sec
    [junit] Running org.apache.poi.hwpf.usermodel.TestRangeSymbols
    [junit] Tests run: 2, Failures: 0, Errors: 0, Skipped: 0, Time elapsed: 0.002 sec
    [junit] Running org.apache.poi.hwpf.usermodel.TestTableRow
    [junit] Tests run: 2, Failures: 0, Errors: 0, Skipped: 0, Time elapsed: 0.002 sec

-test-scratchpad-write-testfile:

-test-ooxml-check:

-ooxml-lite-agent:
      [jar] Building jar: <https://builds.apache.org/job/POI-DSL-Github-PullRequests/ws/build/ooxml-lite-agent.jar>

test-ooxml:
[jacoco:coverage] Enhancing junit with coverage
    [junit] Running org.apache.poi.TestDetectAsOOXML
    [junit] Tests run: 3, Failures: 0, Errors: 0, Skipped: 0, Time elapsed: 0.278 sec
    [junit] Running org.apache.poi.TestEmbedded
    [junit] Tests run: 3, Failures: 0, Errors: 0, Skipped: 0, Time elapsed: 0.964 sec
    [junit] Running org.apache.poi.TestXMLPropertiesTextExtractor
    [junit] Tests run: 5, Failures: 0, Errors: 0, Skipped: 0, Time elapsed: 0.252 sec
    [junit] Running org.apache.poi.extractor.ooxml.TestExtractorFactory
    [junit] Tests run: 15, Failures: 0, Errors: 0, Skipped: 0, Time elapsed: 1.704 sec
    [junit] Running org.apache.poi.ooxml.TestPOIXMLDocument
    [junit] Tests run: 11, Failures: 0, Errors: 0, Skipped: 0, Time elapsed: 1.85 sec
    [junit] Running org.apache.poi.ooxml.TestPOIXMLProperties
    [junit] Tests run: 7, Failures: 0, Errors: 0, Skipped: 1, Time elapsed: 0.12 sec
    [junit] Running org.apache.poi.ooxml.util.TestDocumentHelper
    [junit] Tests run: 2, Failures: 0, Errors: 0, Skipped: 0, Time elapsed: 0.002 sec
    [junit] Running org.apache.poi.ooxml.util.TestSAXHelper
    [junit] Tests run: 1, Failures: 0, Errors: 0, Skipped: 0, Time elapsed: 0.004 sec
    [junit] Running org.apache.poi.openxml4j.opc.TestContentType
    [junit] Tests run: 7, Failures: 0, Errors: 0, Skipped: 0, Time elapsed: 0.058 sec
    [junit] Running org.apache.poi.openxml4j.opc.TestFileHelper
    [junit] Tests run: 1, Failures: 0, Errors: 0, Skipped: 0, Time elapsed: 0.001 sec
    [junit] Running org.apache.poi.openxml4j.opc.TestListParts
    [junit] Tests run: 1, Failures: 0, Errors: 0, Skipped: 0, Time elapsed: 0.004 sec
    [junit] Running org.apache.poi.openxml4j.opc.TestPackage
    [junit] Tests run: 38, Failures: 0, Errors: 0, Skipped: 1, Time elapsed: 0.838 sec
    [junit] Running org.apache.poi.openxml4j.opc.TestPackageCoreProperties
    [junit] Tests run: 7, Failures: 0, Errors: 0, Skipped: 0, Time elapsed: 0.048 sec
    [junit] Running org.apache.poi.openxml4j.opc.TestPackagePartName
    [junit] Tests run: 1, Failures: 0, Errors: 0, Skipped: 0, Time elapsed: 0 sec
    [junit] Running org.apache.poi.openxml4j.opc.TestPackageThumbnail
    [junit] Tests run: 1, Failures: 0, Errors: 0, Skipped: 0, Time elapsed: 0.008 sec
    [junit] Running org.apache.poi.openxml4j.opc.TestPackagingURIHelper
    [junit] Tests run: 5, Failures: 0, Errors: 0, Skipped: 0, Time elapsed: 0.003 sec
    [junit] Running org.apache.poi.openxml4j.opc.TestRelationships
    [junit] Tests run: 9, Failures: 0, Errors: 0, Skipped: 0, Time elapsed: 0.034 sec
    [junit] Running org.apache.poi.openxml4j.opc.compliance.TestOPCComplianceCoreProperties
    [junit] Tests run: 11, Failures: 0, Errors: 0, Skipped: 0, Time elapsed: 0.049 sec
    [junit] Running org.apache.poi.openxml4j.opc.compliance.TestOPCCompliancePackageModel
    [junit] Tests run: 5, Failures: 0, Errors: 0, Skipped: 0, Time elapsed: 0.005 sec
    [junit] Running org.apache.poi.openxml4j.opc.compliance.TestOPCCompliancePartName
    [junit] Tests run: 10, Failures: 0, Errors: 0, Skipped: 0, Time elapsed: 0.006 sec
    [junit] Running org.apache.poi.openxml4j.opc.internal.TestContentTypeManager
    [junit] Tests run: 4, Failures: 0, Errors: 0, Skipped: 2, Time elapsed: 0.006 sec
    [junit] Running org.apache.poi.openxml4j.opc.internal.marshallers.TestZipPackagePropertiesMarshaller
    [junit] Tests run: 4, Failures: 0, Errors: 0, Skipped: 0, Time elapsed: 0.003 sec
    [junit] Running org.apache.poi.openxml4j.util.TestZipSecureFile
    [junit] Tests run: 1, Failures: 0, Errors: 0, Skipped: 0, Time elapsed: 0.002 sec
    [junit] Running org.apache.poi.poifs.crypt.TestAgileEncryptionParameters
    [junit] Tests run: 60, Failures: 0, Errors: 0, Skipped: 0, Time elapsed: 6.541 sec
    [junit] Running org.apache.poi.poifs.crypt.TestCertificateEncryption
    [junit] Tests run: 1, Failures: 0, Errors: 0, Skipped: 0, Time elapsed: 0.077 sec
    [junit] Running org.apache.poi.poifs.crypt.TestDecryptor
    [junit] Tests run: 7, Failures: 0, Errors: 0, Skipped: 0, Time elapsed: 0.227 sec
    [junit] Running org.apache.poi.poifs.crypt.TestEncryptionInfo
    [junit] Tests run: 2, Failures: 0, Errors: 0, Skipped: 0, Time elapsed: 0.003 sec
    [junit] Running org.apache.poi.poifs.crypt.TestEncryptor
    [junit] Tests run: 6, Failures: 0, Errors: 0, Skipped: 1, Time elapsed: 0.491 sec
    [junit] Running org.apache.poi.poifs.crypt.TestHxxFEncryption
    [junit] Tests run: 20, Failures: 0, Errors: 0, Skipped: 0, Time elapsed: 0.592 sec
    [junit] Running org.apache.poi.poifs.crypt.TestSecureTempZip
    [junit] Tests run: 2, Failures: 0, Errors: 0, Skipped: 0, Time elapsed: 0.133 sec
    [junit] Running org.apache.poi.poifs.crypt.dsig.TestSignatureConfig
    [junit] Tests run: 2, Failures: 0, Errors: 0, Skipped: 1, Time elapsed: 0.002 sec
    [junit] Running org.apache.poi.sl.TestFonts
    [junit] Tests run: 2, Failures: 0, Errors: 0, Skipped: 0, Time elapsed: 0.37 sec
    [junit] Running org.apache.poi.sl.TestHeadersFooters
    [junit] Tests run: 1, Failures: 0, Errors: 0, Skipped: 0, Time elapsed: 0.021 sec
    [junit] Running org.apache.poi.sl.TestOleShape
    [junit] Tests run: 6, Failures: 0, Errors: 0, Skipped: 0, Time elapsed: 0.23 sec
    [junit] Running org.apache.poi.sl.TestSlide
    [junit] Tests run: 2, Failures: 0, Errors: 0, Skipped: 0, Time elapsed: 0.054 sec
    [junit] Running org.apache.poi.sl.TestTable
    [junit] Tests run: 4, Failures: 0, Errors: 0, Skipped: 0, Time elapsed: 0.11 sec
    [junit] Running org.apache.poi.sl.draw.TestDrawPictureShape
    [junit] Tests run: 2, Failures: 0, Errors: 0, Skipped: 0, Time elapsed: 0.053 sec
    [junit] Running org.apache.poi.ss.TestWorkbookFactory
    [junit] Tests run: 11, Failures: 0, Errors: 0, Skipped: 0, Time elapsed: 0.255 sec
    [junit] Running org.apache.poi.ss.extractor.TestEmbeddedExtractor
    [junit] Tests run: 3, Failures: 0, Errors: 0, Skipped: 0, Time elapsed: 0.22 sec
    [junit] Running org.apache.poi.ss.format.TestCellFormatPart
    [junit] Tests run: 8, Failures: 0, Errors: 0, Skipped: 0, Time elapsed: 0.38 sec
    [junit] Running org.apache.poi.ss.formula.TestFormulaParser
    [junit] Tests run: 9, Failures: 0, Errors: 0, Skipped: 0, Time elapsed: 0.092 sec
    [junit] Running org.apache.poi.ss.formula.TestStructuredReferences
    [junit] Tests run: 2, Failures: 0, Errors: 0, Skipped: 0, Time elapsed: 0.167 sec
    [junit] Running org.apache.poi.ss.formula.eval.TestXSSFCircularReferences
    [junit] Tests run: 4, Failures: 0, Errors: 0, Skipped: 0, Time elapsed: 0.018 sec
    [junit] Running org.apache.poi.ss.formula.functions.TestProper
    [junit] Tests run: 4, Failures: 0, Errors: 0, Skipped: 0, Time elapsed: 1.217 sec
    [junit] Running org.apache.poi.ss.formula.functions.TestSumifsXSSF
    [junit] Tests run: 1, Failures: 0, Errors: 0, Skipped: 0, Time elapsed: 0.012 sec
    [junit] Running org.apache.poi.ss.formula.functions.TestVlookup
    [junit] Tests run: 1, Failures: 0, Errors: 0, Skipped: 0, Time elapsed: 17.496 sec
    [junit] Running org.apache.poi.ss.usermodel.TestEmbedOLEPackage
    [junit] Tests run: 2, Failures: 0, Errors: 0, Skipped: 0, Time elapsed: 0.107 sec
    [junit] Running org.apache.poi.ss.usermodel.TestXSSFBorderStyle
    [junit] Tests run: 1, Failures: 0, Errors: 0, Skipped: 0, Time elapsed: 0.008 sec
    [junit] Running org.apache.poi.ss.usermodel.TestXSSFRangeCopier
    [junit] Tests run: 5, Failures: 0, Errors: 0, Skipped: 0, Time elapsed: 0.052 sec
    [junit] Running org.apache.poi.ss.util.TestSXSSFCellUtil
    [junit] Tests run: 13, Failures: 0, Errors: 0, Skipped: 0, Time elapsed: 0.085 sec
    [junit] Running org.apache.poi.ss.util.TestXSSFCellUtil
    [junit] Tests run: 13, Failures: 0, Errors: 0, Skipped: 0, Time elapsed: 0.048 sec
    [junit] Running org.apache.poi.ss.util.TestXSSFPropertyTemplate
    [junit] Tests run: 2, Failures: 0, Errors: 0, Skipped: 0, Time elapsed: 0.053 sec
    [junit] Running org.apache.poi.util.TestIdentifierManager
    [junit] Tests run: 5, Failures: 0, Errors: 0, Skipped: 0, Time elapsed: 0.004 sec
    [junit] Running org.apache.poi.util.TestTempFileThreaded
    [junit] Tests run: 1, Failures: 0, Errors: 0, Skipped: 0, Time elapsed: 2.983 sec
    [junit] Running org.apache.poi.xddf.usermodel.TestNecessaryOOXMLClasses
    [junit] Tests run: 1, Failures: 0, Errors: 0, Skipped: 0, Time elapsed: 0.06 sec
    [junit] Running org.apache.poi.xddf.usermodel.TestXDDFColor
    [junit] Tests run: 5, Failures: 0, Errors: 0, Skipped: 0, Time elapsed: 0.046 sec
    [junit] Running org.apache.poi.xddf.usermodel.chart.TestXDDFChart
    [junit] Tests run: 1, Failures: 0, Errors: 0, Skipped: 0, Time elapsed: 0.017 sec
    [junit] Running org.apache.poi.xddf.usermodel.chart.TestXDDFChartExtensionList
    [junit] Tests run: 1, Failures: 0, Errors: 0, Skipped: 0, Time elapsed: 0.002 sec
    [junit] Running org.apache.poi.xddf.usermodel.chart.TestXDDFDataSourcesFactory
    [junit] Tests run: 6, Failures: 0, Errors: 0, Skipped: 0, Time elapsed: 0.01 sec
    [junit] Running org.apache.poi.xddf.usermodel.text.TestXDDFTextBodyProperties
    [junit] Tests run: 1, Failures: 0, Errors: 0, Skipped: 0, Time elapsed: 0.007 sec
    [junit] Running org.apache.poi.xddf.usermodel.text.TestXDDFTextRun
    [junit] Tests run: 2, Failures: 0, Errors: 0, Skipped: 0, Time elapsed: 0.038 sec
    [junit] Running org.apache.poi.xdgf.extractor.TestXDGFVisioExtractor
    [junit] Tests run: 3, Failures: 0, Errors: 0, Skipped: 0, Time elapsed: 0.164 sec
    [junit] Running org.apache.poi.xslf.TestNecessaryOOXMLClasses
    [junit] Tests run: 1, Failures: 0, Errors: 0, Skipped: 0, Time elapsed: 0.004 sec
    [junit] Running org.apache.poi.xslf.TestXSLFBugs
    [junit] Tests run: 29, Failures: 0, Errors: 0, Skipped: 2, Time elapsed: 1.432 sec
    [junit] Running org.apache.poi.xslf.TestXSLFSlideShow
    [junit] Tests run: 5, Failures: 0, Errors: 0, Skipped: 0, Time elapsed: 0.057 sec
    [junit] Running org.apache.poi.xslf.extractor.TestXSLFPowerPointExtractor
    [junit] Tests run: 8, Failures: 0, Errors: 0, Skipped: 0, Time elapsed: 0.422 sec
    [junit] Running org.apache.poi.xslf.geom.TestFormulaParser
    [junit] Tests run: 1, Failures: 0, Errors: 0, Skipped: 0, Time elapsed: 0.006 sec
    [junit] Running org.apache.poi.xslf.usermodel.TestPPTX2PNG
    [junit] Tests run: 13, Failures: 0, Errors: 0, Skipped: 0, Time elapsed: 16.445 sec
    [junit] Running org.apache.poi.xslf.usermodel.TestXMLSlideShow
    [junit] Tests run: 11, Failures: 0, Errors: 0, Skipped: 0, Time elapsed: 0.224 sec
    [junit] Running org.apache.poi.xslf.usermodel.TestXSLFAutoShape
    [junit] Tests run: 4, Failures: 0, Errors: 0, Skipped: 0, Time elapsed: 0.06 sec
    [junit] Running org.apache.poi.xslf.usermodel.TestXSLFBackground
    [junit] Tests run: 4, Failures: 0, Errors: 0, Skipped: 0, Time elapsed: 0.13 sec
    [junit] Running org.apache.poi.xslf.usermodel.TestXSLFChart
    [junit] Tests run: 5, Failures: 0, Errors: 0, Skipped: 0, Time elapsed: 0.194 sec
    [junit] Running org.apache.poi.xslf.usermodel.TestXSLFColor
    [junit] Tests run: 6, Failures: 0, Errors: 0, Skipped: 0, Time elapsed: 0.026 sec
    [junit] Running org.apache.poi.xslf.usermodel.TestXSLFConnectorShape
    [junit] Tests run: 2, Failures: 0, Errors: 0, Skipped: 0, Time elapsed: 0.03 sec
    [junit] Running org.apache.poi.xslf.usermodel.TestXSLFFreeformShape
    [junit] Tests run: 2, Failures: 0, Errors: 0, Skipped: 0, Time elapsed: 0.076 sec
    [junit] Running org.apache.poi.xslf.usermodel.TestXSLFGroupShape
    [junit] Tests run: 2, Failures: 0, Errors: 0, Skipped: 0, Time elapsed: 0.029 sec
    [junit] Running org.apache.poi.xslf.usermodel.TestXSLFHyperlink
    [junit] Tests run: 3, Failures: 0, Errors: 0, Skipped: 0, Time elapsed: 0.067 sec
    [junit] Running org.apache.poi.xslf.usermodel.TestXSLFNotes
    [junit] Tests run: 3, Failures: 0, Errors: 0, Skipped: 0, Time elapsed: 0.059 sec
    [junit] Running org.apache.poi.xslf.usermodel.TestXSLFPictureShape
    [junit] Tests run: 7, Failures: 0, Errors: 1, Skipped: 0, Time elapsed: 0.218 sec

BUILD FAILED
<https://builds.apache.org/job/POI-DSL-Github-PullRequests/ws/build.xml>:1611: The following error occurred while executing this line:
<https://builds.apache.org/job/POI-DSL-Github-PullRequests/ws/build.xml>:1577: The following error occurred while executing this line:
<https://builds.apache.org/job/POI-DSL-Github-PullRequests/ws/build.xml>:1223: Tests failed

Total time: 4 minutes 17 seconds
Build step 'Invoke Ant' marked build as failure
Skipping publisher since build result is FAILURE
Archiving artifacts
[Fast Archiver] No prior successful build to compare, so performing full copy of artifacts
Skipping publisher since build result is FAILURE
Recording test results

---------------------------------------------------------------------
To unsubscribe, e-mail: [hidden email]
For additional commands, e-mail: [hidden email]