Build failed in Jenkins: POI-DSL-1.9 #56

classic Classic list List threaded Threaded
3 messages Options
Reply | Threaded
Open this post in threaded view
|

Build failed in Jenkins: POI-DSL-1.9 #56

Apache Jenkins Server
See <https://builds.apache.org/job/POI-DSL-1.9/56/display/redirect>

------------------------------------------
[...truncated 105.35 KB...]
        at org.tmatesoft.svn.core.wc2.SvnOperationFactory.run(SvnOperationFactory.java:1235)
        at org.tmatesoft.svn.core.wc2.SvnOperation.run(SvnOperation.java:294)
        at org.tmatesoft.svn.core.wc.SVNUpdateClient.doUpdate(SVNUpdateClient.java:311)
        at org.tmatesoft.svn.core.wc.SVNUpdateClient.doUpdate(SVNUpdateClient.java:291)
        at org.tmatesoft.svn.core.wc.SVNUpdateClient.doUpdate(SVNUpdateClient.java:387)
        at hudson.scm.subversion.UpdateUpdater$TaskImpl.perform(UpdateUpdater.java:158)
Caused: hudson.scm.subversion.UpdaterException: failed to perform svn update
        at hudson.scm.subversion.UpdateUpdater$TaskImpl.perform(UpdateUpdater.java:212)
        at hudson.scm.subversion.WorkspaceUpdater$UpdateTask.delegateTo(WorkspaceUpdater.java:162)
        at hudson.scm.SubversionSCM$CheckOutTask.perform(SubversionSCM.java:1001)
        at hudson.scm.SubversionSCM$CheckOutTask.invoke(SubversionSCM.java:977)
        at hudson.scm.SubversionSCM$CheckOutTask.invoke(SubversionSCM.java:953)
        at hudson.FilePath$FileCallableWrapper.call(FilePath.java:2739)
        at hudson.remoting.UserRequest.perform(UserRequest.java:153)
        at hudson.remoting.UserRequest.perform(UserRequest.java:50)
        at hudson.remoting.Request$2.run(Request.java:336)
        at hudson.remoting.InterceptingExecutorService$1.call(InterceptingExecutorService.java:68)
        at java.util.concurrent.FutureTask.run(FutureTask.java:266)
        at java.util.concurrent.ThreadPoolExecutor.runWorker(ThreadPoolExecutor.java:1142)
        at java.util.concurrent.ThreadPoolExecutor$Worker.run(ThreadPoolExecutor.java:617)
        at java.lang.Thread.run(Thread.java:745)
Caused: java.io.IOException
        at hudson.scm.subversion.UpdateUpdater$TaskImpl.perform(UpdateUpdater.java:212)
        at hudson.scm.subversion.WorkspaceUpdater$UpdateTask.delegateTo(WorkspaceUpdater.java:162)
        at hudson.scm.SubversionSCM$CheckOutTask.perform(SubversionSCM.java:1001)
        at hudson.scm.SubversionSCM$CheckOutTask.invoke(SubversionSCM.java:977)
        at hudson.scm.SubversionSCM$CheckOutTask.invoke(SubversionSCM.java:953)
        at hudson.FilePath$FileCallableWrapper.call(FilePath.java:2739)
        at hudson.remoting.UserRequest.perform(UserRequest.java:153)
        at hudson.remoting.UserRequest.perform(UserRequest.java:50)
        at hudson.remoting.Request$2.run(Request.java:336)
        at hudson.remoting.InterceptingExecutorService$1.call(InterceptingExecutorService.java:68)
        at java.util.concurrent.FutureTask.run(FutureTask.java:266)
        at java.util.concurrent.ThreadPoolExecutor.runWorker(ThreadPoolExecutor.java:1142)
        at java.util.concurrent.ThreadPoolExecutor$Worker.run(ThreadPoolExecutor.java:617)
        at java.lang.Thread.run(Thread.java:745)
        at ......remote call to qnode3(Native Method)
        at hudson.remoting.Channel.attachCallSiteStackTrace(Channel.java:1545)
        at hudson.remoting.UserResponse.retrieve(UserRequest.java:253)
        at hudson.remoting.Channel.call(Channel.java:830)
        at hudson.FilePath.act(FilePath.java:986)
Caused: java.io.IOException: remote file operation failed: <https://builds.apache.org/job/POI-DSL-1.9/ws/> at hudson.remoting.Channel@72839cc9:qnode3
        at hudson.FilePath.act(FilePath.java:993)
        at hudson.FilePath.act(FilePath.java:975)
        at hudson.scm.SubversionSCM.checkout(SubversionSCM.java:902)
        at hudson.scm.SubversionSCM.checkout(SubversionSCM.java:838)
        at hudson.scm.SCM.checkout(SCM.java:495)
        at hudson.model.AbstractProject.checkout(AbstractProject.java:1276)
        at hudson.model.AbstractBuild$AbstractBuildExecution.defaultCheckout(AbstractBuild.java:560)
        at jenkins.scm.SCMCheckoutStrategy.checkout(SCMCheckoutStrategy.java:86)
        at hudson.model.AbstractBuild$AbstractBuildExecution.run(AbstractBuild.java:485)
        at hudson.model.Run.execute(Run.java:1735)
        at hudson.model.FreeStyleBuild.run(FreeStyleBuild.java:43)
        at hudson.model.ResourceController.execute(ResourceController.java:97)
        at hudson.model.Executor.run(Executor.java:405)
Retrying after 10 seconds
Updating https://svn.apache.org/repos/asf/poi/trunk at revision '2017-09-17T10:00:30.511 +0000'
ERROR: Failed to update https://svn.apache.org/repos/asf/poi/trunk
org.tmatesoft.svn.core.SVNException: svn: E200030: FULL
        at org.tmatesoft.svn.core.internal.wc.SVNErrorManager.error(SVNErrorManager.java:70)
        at org.tmatesoft.svn.core.internal.wc.SVNErrorManager.error(SVNErrorManager.java:57)
        at org.tmatesoft.svn.core.internal.io.dav.http.HTTPConnection.request(HTTPConnection.java:798)
        at org.tmatesoft.svn.core.internal.io.dav.http.HTTPConnection.request(HTTPConnection.java:391)
        at org.tmatesoft.svn.core.internal.io.dav.http.HTTPConnection.request(HTTPConnection.java:379)
        at org.tmatesoft.svn.core.internal.io.dav.DAVConnection.performHttpRequest(DAVConnection.java:862)
        at org.tmatesoft.svn.core.internal.io.dav.DAVConnection.doReport(DAVConnection.java:359)
        at org.tmatesoft.svn.core.internal.io.dav.DAVRepository.runReport(DAVRepository.java:1341)
        at org.tmatesoft.svn.core.internal.io.dav.DAVRepository.update(DAVRepository.java:868)
        at org.tmatesoft.svn.core.internal.wc2.ng.SvnNgAbstractUpdate.updateInternal(SvnNgAbstractUpdate.java:247)
        at org.tmatesoft.svn.core.internal.wc2.ng.SvnNgAbstractUpdate.update(SvnNgAbstractUpdate.java:111)
        at org.tmatesoft.svn.core.internal.wc2.ng.SvnNgUpdate.run(SvnNgUpdate.java:40)
        at org.tmatesoft.svn.core.internal.wc2.ng.SvnNgUpdate.run(SvnNgUpdate.java:18)
        at org.tmatesoft.svn.core.internal.wc2.ng.SvnNgOperationRunner.run(SvnNgOperationRunner.java:20)
        at org.tmatesoft.svn.core.internal.wc2.SvnOperationRunner.run(SvnOperationRunner.java:21)
        at org.tmatesoft.svn.core.wc2.SvnOperationFactory.run(SvnOperationFactory.java:1235)
        at org.tmatesoft.svn.core.wc2.SvnOperation.run(SvnOperation.java:294)
        at org.tmatesoft.svn.core.wc.SVNUpdateClient.doUpdate(SVNUpdateClient.java:311)
        at org.tmatesoft.svn.core.wc.SVNUpdateClient.doUpdate(SVNUpdateClient.java:291)
        at org.tmatesoft.svn.core.wc.SVNUpdateClient.doUpdate(SVNUpdateClient.java:387)
        at hudson.scm.subversion.UpdateUpdater$TaskImpl.perform(UpdateUpdater.java:158)
        at hudson.scm.subversion.WorkspaceUpdater$UpdateTask.delegateTo(WorkspaceUpdater.java:162)
        at hudson.scm.SubversionSCM$CheckOutTask.perform(SubversionSCM.java:1001)
        at hudson.scm.SubversionSCM$CheckOutTask.invoke(SubversionSCM.java:977)
        at hudson.scm.SubversionSCM$CheckOutTask.invoke(SubversionSCM.java:953)
        at hudson.FilePath$FileCallableWrapper.call(FilePath.java:2739)
        at hudson.remoting.UserRequest.perform(UserRequest.java:153)
        at hudson.remoting.UserRequest.perform(UserRequest.java:50)
        at hudson.remoting.Request$2.run(Request.java:336)
        at hudson.remoting.InterceptingExecutorService$1.call(InterceptingExecutorService.java:68)
        at java.util.concurrent.FutureTask.run(FutureTask.java:266)
        at java.util.concurrent.ThreadPoolExecutor.runWorker(ThreadPoolExecutor.java:1142)
        at java.util.concurrent.ThreadPoolExecutor$Worker.run(ThreadPoolExecutor.java:617)
        at java.lang.Thread.run(Thread.java:745)
Caused by: org.tmatesoft.sqljet.core.SqlJetException: FULL: error code is FULL
        at org.tmatesoft.sqljet.core.internal.pager.SqlJetPager.openJournal(SqlJetPager.java:3051)
        at org.tmatesoft.sqljet.core.internal.pager.SqlJetPager.begin(SqlJetPager.java:2782)
        at org.tmatesoft.sqljet.core.internal.btree.SqlJetBtree.beginTrans(SqlJetBtree.java:931)
        at org.tmatesoft.sqljet.core.table.engine.SqlJetEngine.doBeginTransaction(SqlJetEngine.java:561)
        at org.tmatesoft.sqljet.core.table.engine.SqlJetEngine.access$100(SqlJetEngine.java:55)
        at org.tmatesoft.sqljet.core.table.engine.SqlJetEngine$12.runSynchronized(SqlJetEngine.java:535)
        at org.tmatesoft.sqljet.core.table.engine.SqlJetEngine.runSynchronized(SqlJetEngine.java:217)
        at org.tmatesoft.sqljet.core.table.engine.SqlJetEngine.runEngineTransaction(SqlJetEngine.java:529)
        at org.tmatesoft.sqljet.core.table.SqlJetDb.runTransaction(SqlJetDb.java:238)
        at org.tmatesoft.sqljet.core.table.SqlJetDb.runWriteTransaction(SqlJetDb.java:211)
        at org.tmatesoft.svn.core.internal.wc17.db.statement.SVNWCDbCreateSchema.exec(SVNWCDbCreateSchema.java:225)
        at org.tmatesoft.svn.core.internal.db.SVNSqlJetStatement.done(SVNSqlJetStatement.java:420)
        at org.tmatesoft.svn.core.internal.wc17.db.SVNWCDb$BumpRevisionPostUpdate.bumpMovedAway(SVNWCDb.java:5421)
        at org.tmatesoft.svn.core.internal.wc17.db.SVNWCDb$BumpRevisionPostUpdate.transaction(SVNWCDb.java:5414)
        at org.tmatesoft.svn.core.internal.db.SVNSqlJetDb.runTransaction(SVNSqlJetDb.java:258)
        at org.tmatesoft.svn.core.internal.db.SVNSqlJetDb.runTransaction(SVNSqlJetDb.java:252)
        at org.tmatesoft.svn.core.internal.wc17.db.SVNWCDb.opBumpRevisionPostUpdate(SVNWCDb.java:5366)
        at org.tmatesoft.svn.core.internal.wc17.SVNUpdateEditor17.closeEdit(SVNUpdateEditor17.java:1728)
        at org.tmatesoft.svn.core.internal.wc.SVNCancellableEditor.closeEdit(SVNCancellableEditor.java:148)
        at org.tmatesoft.svn.core.internal.io.dav.handlers.DAVEditorHandler.endElement(DAVEditorHandler.java:492)
        at org.tmatesoft.svn.core.internal.io.dav.handlers.BasicDAVHandler.endElement(BasicDAVHandler.java:103)
        at com.sun.org.apache.xerces.internal.parsers.AbstractSAXParser.endElement(AbstractSAXParser.java:609)
        at com.sun.org.apache.xerces.internal.impl.XMLDocumentFragmentScannerImpl.scanEndElement(XMLDocumentFragmentScannerImpl.java:1782)
        at com.sun.org.apache.xerces.internal.impl.XMLDocumentFragmentScannerImpl$FragmentContentDriver.next(XMLDocumentFragmentScannerImpl.java:2967)
        at com.sun.org.apache.xerces.internal.impl.XMLDocumentScannerImpl.next(XMLDocumentScannerImpl.java:602)
        at com.sun.org.apache.xerces.internal.impl.XMLNSDocumentScannerImpl.next(XMLNSDocumentScannerImpl.java:112)
        at com.sun.org.apache.xerces.internal.impl.XMLDocumentFragmentScannerImpl.scanDocument(XMLDocumentFragmentScannerImpl.java:505)
        at com.sun.org.apache.xerces.internal.parsers.XML11Configuration.parse(XML11Configuration.java:841)
        at com.sun.org.apache.xerces.internal.parsers.XML11Configuration.parse(XML11Configuration.java:770)
        at com.sun.org.apache.xerces.internal.parsers.XMLParser.parse(XMLParser.java:141)
        at com.sun.org.apache.xerces.internal.parsers.AbstractSAXParser.parse(AbstractSAXParser.java:1213)
        at com.sun.org.apache.xerces.internal.jaxp.SAXParserImpl$JAXPSAXParser.parse(SAXParserImpl.java:643)
        at org.tmatesoft.svn.core.internal.io.dav.http.HTTPConnection.readData(HTTPConnection.java:937)
        at org.tmatesoft.svn.core.internal.io.dav.http.HTTPConnection.readData(HTTPConnection.java:902)
        at org.tmatesoft.svn.core.internal.io.dav.http.HTTPRequest.dispatch(HTTPRequest.java:220)
        at org.tmatesoft.svn.core.internal.io.dav.http.HTTPConnection.request(HTTPConnection.java:490)
        ... 31 more
ERROR: Subversion update failed
org.tmatesoft.sqljet.core.SqlJetException: FULL: error code is FULL
        at org.tmatesoft.sqljet.core.internal.pager.SqlJetPager.openJournal(SqlJetPager.java:3051)
        at org.tmatesoft.sqljet.core.internal.pager.SqlJetPager.begin(SqlJetPager.java:2782)
        at org.tmatesoft.sqljet.core.internal.btree.SqlJetBtree.beginTrans(SqlJetBtree.java:931)
        at org.tmatesoft.sqljet.core.table.engine.SqlJetEngine.doBeginTransaction(SqlJetEngine.java:561)
        at org.tmatesoft.sqljet.core.table.engine.SqlJetEngine.access$100(SqlJetEngine.java:55)
        at org.tmatesoft.sqljet.core.table.engine.SqlJetEngine$12.runSynchronized(SqlJetEngine.java:535)
        at org.tmatesoft.sqljet.core.table.engine.SqlJetEngine.runSynchronized(SqlJetEngine.java:217)
        at org.tmatesoft.sqljet.core.table.engine.SqlJetEngine.runEngineTransaction(SqlJetEngine.java:529)
        at org.tmatesoft.sqljet.core.table.SqlJetDb.runTransaction(SqlJetDb.java:238)
        at org.tmatesoft.sqljet.core.table.SqlJetDb.runWriteTransaction(SqlJetDb.java:211)
        at org.tmatesoft.svn.core.internal.wc17.db.statement.SVNWCDbCreateSchema.exec(SVNWCDbCreateSchema.java:225)
        at org.tmatesoft.svn.core.internal.db.SVNSqlJetStatement.done(SVNSqlJetStatement.java:420)
        at org.tmatesoft.svn.core.internal.wc17.db.SVNWCDb$BumpRevisionPostUpdate.bumpMovedAway(SVNWCDb.java:5421)
        at org.tmatesoft.svn.core.internal.wc17.db.SVNWCDb$BumpRevisionPostUpdate.transaction(SVNWCDb.java:5414)
        at org.tmatesoft.svn.core.internal.db.SVNSqlJetDb.runTransaction(SVNSqlJetDb.java:258)
        at org.tmatesoft.svn.core.internal.db.SVNSqlJetDb.runTransaction(SVNSqlJetDb.java:252)
        at org.tmatesoft.svn.core.internal.wc17.db.SVNWCDb.opBumpRevisionPostUpdate(SVNWCDb.java:5366)
        at org.tmatesoft.svn.core.internal.wc17.SVNUpdateEditor17.closeEdit(SVNUpdateEditor17.java:1728)
        at org.tmatesoft.svn.core.internal.wc.SVNCancellableEditor.closeEdit(SVNCancellableEditor.java:148)
        at org.tmatesoft.svn.core.internal.io.dav.handlers.DAVEditorHandler.endElement(DAVEditorHandler.java:492)
        at org.tmatesoft.svn.core.internal.io.dav.handlers.BasicDAVHandler.endElement(BasicDAVHandler.java:103)
        at com.sun.org.apache.xerces.internal.parsers.AbstractSAXParser.endElement(AbstractSAXParser.java:609)
        at com.sun.org.apache.xerces.internal.impl.XMLDocumentFragmentScannerImpl.scanEndElement(XMLDocumentFragmentScannerImpl.java:1782)
        at com.sun.org.apache.xerces.internal.impl.XMLDocumentFragmentScannerImpl$FragmentContentDriver.next(XMLDocumentFragmentScannerImpl.java:2967)
        at com.sun.org.apache.xerces.internal.impl.XMLDocumentScannerImpl.next(XMLDocumentScannerImpl.java:602)
        at com.sun.org.apache.xerces.internal.impl.XMLNSDocumentScannerImpl.next(XMLNSDocumentScannerImpl.java:112)
        at com.sun.org.apache.xerces.internal.impl.XMLDocumentFragmentScannerImpl.scanDocument(XMLDocumentFragmentScannerImpl.java:505)
        at com.sun.org.apache.xerces.internal.parsers.XML11Configuration.parse(XML11Configuration.java:841)
        at com.sun.org.apache.xerces.internal.parsers.XML11Configuration.parse(XML11Configuration.java:770)
        at com.sun.org.apache.xerces.internal.parsers.XMLParser.parse(XMLParser.java:141)
        at com.sun.org.apache.xerces.internal.parsers.AbstractSAXParser.parse(AbstractSAXParser.java:1213)
        at com.sun.org.apache.xerces.internal.jaxp.SAXParserImpl$JAXPSAXParser.parse(SAXParserImpl.java:643)
        at org.tmatesoft.svn.core.internal.io.dav.http.HTTPConnection.readData(HTTPConnection.java:937)
        at org.tmatesoft.svn.core.internal.io.dav.http.HTTPConnection.readData(HTTPConnection.java:902)
        at org.tmatesoft.svn.core.internal.io.dav.http.HTTPRequest.dispatch(HTTPRequest.java:220)
        at org.tmatesoft.svn.core.internal.io.dav.http.HTTPConnection.request(HTTPConnection.java:490)
Caused: org.tmatesoft.svn.core.SVNException: svn: E200030: FULL
        at org.tmatesoft.svn.core.internal.wc.SVNErrorManager.error(SVNErrorManager.java:70)
        at org.tmatesoft.svn.core.internal.wc.SVNErrorManager.error(SVNErrorManager.java:57)
        at org.tmatesoft.svn.core.internal.io.dav.http.HTTPConnection.request(HTTPConnection.java:798)
        at org.tmatesoft.svn.core.internal.io.dav.http.HTTPConnection.request(HTTPConnection.java:391)
        at org.tmatesoft.svn.core.internal.io.dav.http.HTTPConnection.request(HTTPConnection.java:379)
        at org.tmatesoft.svn.core.internal.io.dav.DAVConnection.performHttpRequest(DAVConnection.java:862)
        at org.tmatesoft.svn.core.internal.io.dav.DAVConnection.doReport(DAVConnection.java:359)
        at org.tmatesoft.svn.core.internal.io.dav.DAVRepository.runReport(DAVRepository.java:1341)
        at org.tmatesoft.svn.core.internal.io.dav.DAVRepository.update(DAVRepository.java:868)
        at org.tmatesoft.svn.core.internal.wc2.ng.SvnNgAbstractUpdate.updateInternal(SvnNgAbstractUpdate.java:247)
        at org.tmatesoft.svn.core.internal.wc2.ng.SvnNgAbstractUpdate.update(SvnNgAbstractUpdate.java:111)
        at org.tmatesoft.svn.core.internal.wc2.ng.SvnNgUpdate.run(SvnNgUpdate.java:40)
        at org.tmatesoft.svn.core.internal.wc2.ng.SvnNgUpdate.run(SvnNgUpdate.java:18)
        at org.tmatesoft.svn.core.internal.wc2.ng.SvnNgOperationRunner.run(SvnNgOperationRunner.java:20)
        at org.tmatesoft.svn.core.internal.wc2.SvnOperationRunner.run(SvnOperationRunner.java:21)
        at org.tmatesoft.svn.core.wc2.SvnOperationFactory.run(SvnOperationFactory.java:1235)
        at org.tmatesoft.svn.core.wc2.SvnOperation.run(SvnOperation.java:294)
        at org.tmatesoft.svn.core.wc.SVNUpdateClient.doUpdate(SVNUpdateClient.java:311)
        at org.tmatesoft.svn.core.wc.SVNUpdateClient.doUpdate(SVNUpdateClient.java:291)
        at org.tmatesoft.svn.core.wc.SVNUpdateClient.doUpdate(SVNUpdateClient.java:387)
        at hudson.scm.subversion.UpdateUpdater$TaskImpl.perform(UpdateUpdater.java:158)
Caused: hudson.scm.subversion.UpdaterException: failed to perform svn update
        at hudson.scm.subversion.UpdateUpdater$TaskImpl.perform(UpdateUpdater.java:212)
        at hudson.scm.subversion.WorkspaceUpdater$UpdateTask.delegateTo(WorkspaceUpdater.java:162)
        at hudson.scm.SubversionSCM$CheckOutTask.perform(SubversionSCM.java:1001)
        at hudson.scm.SubversionSCM$CheckOutTask.invoke(SubversionSCM.java:977)
        at hudson.scm.SubversionSCM$CheckOutTask.invoke(SubversionSCM.java:953)
        at hudson.FilePath$FileCallableWrapper.call(FilePath.java:2739)
        at hudson.remoting.UserRequest.perform(UserRequest.java:153)
        at hudson.remoting.UserRequest.perform(UserRequest.java:50)
        at hudson.remoting.Request$2.run(Request.java:336)
        at hudson.remoting.InterceptingExecutorService$1.call(InterceptingExecutorService.java:68)
        at java.util.concurrent.FutureTask.run(FutureTask.java:266)
        at java.util.concurrent.ThreadPoolExecutor.runWorker(ThreadPoolExecutor.java:1142)
        at java.util.concurrent.ThreadPoolExecutor$Worker.run(ThreadPoolExecutor.java:617)
        at java.lang.Thread.run(Thread.java:745)
Caused: java.io.IOException
        at hudson.scm.subversion.UpdateUpdater$TaskImpl.perform(UpdateUpdater.java:212)
        at hudson.scm.subversion.WorkspaceUpdater$UpdateTask.delegateTo(WorkspaceUpdater.java:162)
        at hudson.scm.SubversionSCM$CheckOutTask.perform(SubversionSCM.java:1001)
        at hudson.scm.SubversionSCM$CheckOutTask.invoke(SubversionSCM.java:977)
        at hudson.scm.SubversionSCM$CheckOutTask.invoke(SubversionSCM.java:953)
        at hudson.FilePath$FileCallableWrapper.call(FilePath.java:2739)
        at hudson.remoting.UserRequest.perform(UserRequest.java:153)
        at hudson.remoting.UserRequest.perform(UserRequest.java:50)
        at hudson.remoting.Request$2.run(Request.java:336)
        at hudson.remoting.InterceptingExecutorService$1.call(InterceptingExecutorService.java:68)
        at java.util.concurrent.FutureTask.run(FutureTask.java:266)
        at java.util.concurrent.ThreadPoolExecutor.runWorker(ThreadPoolExecutor.java:1142)
        at java.util.concurrent.ThreadPoolExecutor$Worker.run(ThreadPoolExecutor.java:617)
        at java.lang.Thread.run(Thread.java:745)
        at ......remote call to qnode3(Native Method)
        at hudson.remoting.Channel.attachCallSiteStackTrace(Channel.java:1545)
        at hudson.remoting.UserResponse.retrieve(UserRequest.java:253)
        at hudson.remoting.Channel.call(Channel.java:830)
        at hudson.FilePath.act(FilePath.java:986)
Caused: java.io.IOException: remote file operation failed: <https://builds.apache.org/job/POI-DSL-1.9/ws/> at hudson.remoting.Channel@72839cc9:qnode3
        at hudson.FilePath.act(FilePath.java:993)
        at hudson.FilePath.act(FilePath.java:975)
        at hudson.scm.SubversionSCM.checkout(SubversionSCM.java:902)
        at hudson.scm.SubversionSCM.checkout(SubversionSCM.java:838)
        at hudson.scm.SCM.checkout(SCM.java:495)
        at hudson.model.AbstractProject.checkout(AbstractProject.java:1276)
        at hudson.model.AbstractBuild$AbstractBuildExecution.defaultCheckout(AbstractBuild.java:560)
        at jenkins.scm.SCMCheckoutStrategy.checkout(SCMCheckoutStrategy.java:86)
        at hudson.model.AbstractBuild$AbstractBuildExecution.run(AbstractBuild.java:485)
        at hudson.model.Run.execute(Run.java:1735)
        at hudson.model.FreeStyleBuild.run(FreeStyleBuild.java:43)
        at hudson.model.ResourceController.execute(ResourceController.java:97)
        at hudson.model.Executor.run(Executor.java:405)
Skipping publisher since build result is FAILURE
Archiving artifacts
[Fast Archiver] Compressed 234.10 MB of artifacts by 19.9% relative to #55
Skipping publisher since build result is FAILURE
Recording test results
ERROR: Step ‘Publish JUnit test result report’ failed: Test reports were found but none of them are new. Did tests run?
For example, <https://builds.apache.org/job/POI-DSL-1.9/ws/build/excelant-test-results/TEST-org.apache.poi.ss.examples.formula.TestExcelAntUserDefinedFunction.xml> is 6 days 21 hr old



---------------------------------------------------------------------
To unsubscribe, e-mail: [hidden email]
For additional commands, e-mail: [hidden email]

Reply | Threaded
Open this post in threaded view
|

Build failed in Jenkins: POI-DSL-1.9 #57

Apache Jenkins Server
See <https://builds.apache.org/job/POI-DSL-1.9/57/display/redirect>

------------------------------------------
[...truncated 982.10 KB...]
 [findbugs]   java.util.zip.GZIPOutputStream
 [findbugs]   java.util.EnumSet
 [findbugs]   java.io.BufferedOutputStream
 [findbugs]   javax.xml.crypto.dom.DOMStructure
 [findbugs]   javax.security.auth.x500.X500Principal
 [findbugs]   java.net.Proxy
 [findbugs]   java.net.Proxy$Type
 [findbugs]   java.net.URL
 [findbugs]   java.net.InetAddress
 [findbugs]   java.net.InetSocketAddress
 [findbugs]   java.net.HttpURLConnection
 [findbugs]   java.lang.CloneNotSupportedException
 [findbugs]   java.awt.Stroke
 [findbugs]   java.awt.image.BufferedImageOp
 [findbugs]   java.awt.Composite
 [findbugs]   java.awt.font.GlyphVector
 [findbugs]   java.awt.image.RenderedImage
 [findbugs]   java.awt.image.renderable.RenderableImage
 [findbugs]   java.awt.geom.GeneralPath
 [findbugs]   java.awt.Polygon
 [findbugs]   java.awt.GraphicsEnvironment
 [findbugs]   java.awt.GraphicsDevice
 [findbugs]   java.util.Deque
 [findbugs]   java.util.concurrent.locks.ReentrantReadWriteLock
 [findbugs]   java.util.concurrent.locks.ReentrantReadWriteLock$WriteLock
 [findbugs]   javax.crypto.CipherInputStream
 [findbugs]   java.lang.IllegalAccessError
 [findbugs]   java.util.SortedSet
 [findbugs]   java.awt.image.RescaleOp
 [findbugs]   java.lang.Error
 [findbugs]   java.lang.CharSequence
 [findbugs]   java.nio.BufferUnderflowException
 [findbugs]   java.util.LinkedHashSet
 [findbugs]   javax.xml.xpath.XPathConstants
 [findbugs]   java.io.StringReader
 [findbugs]   javax.xml.xpath.XPathFactory
 [findbugs]   javax.xml.xpath.XPath
 [findbugs]   java.util.Vector
 [findbugs]   java.io.EOFException
 [findbugs]   java.util.concurrent.TimeUnit
 [findbugs]   java.io.UnsupportedEncodingException
 [findbugs]   java.nio.charset.CharsetEncoder
 [findbugs]   java.util.zip.DeflaterOutputStream
 [findbugs]   javax.xml.crypto.dsig.XMLSignatureException
 [findbugs]   java.text.NumberFormat
 [findbugs]   javax.xml.stream.events.XMLEvent
 [findbugs]   java.lang.StringIndexOutOfBoundsException
 [findbugs]   javax.xml.crypto.KeySelector$Purpose
 [findbugs]   javax.xml.crypto.AlgorithmMethod
 [findbugs]   javax.xml.crypto.KeySelectorException
 [findbugs]   javax.xml.crypto.dsig.keyinfo.KeyInfo
 [findbugs]   javax.xml.crypto.dsig.keyinfo.X509Data
 [findbugs]   java.io.InvalidObjectException
 [findbugs]   java.security.KeyPair
 [findbugs]   java.nio.channels.FileChannel$MapMode
 [findbugs]   java.io.RandomAccessFile
 [findbugs]   java.nio.channels.FileChannel
 [findbugs]   java.nio.channels.Channels
 [findbugs]   java.security.AccessController
 [findbugs]   java.lang.reflect.Array
 [findbugs]   org.xml.sax.SAXParseException
 [findbugs]   javax.xml.validation.SchemaFactory
 [findbugs]   javax.xml.validation.Schema
 [findbugs]   javax.xml.validation.Validator
 [findbugs]   java.net.URISyntaxException
 [findbugs]   javax.xml.xpath.XPathExpression
 [findbugs]   javax.xml.crypto.dsig.dom.DOMValidateContext
 [findbugs]   javax.xml.crypto.dsig.XMLSignature
 [findbugs]   javax.xml.crypto.dsig.SignedInfo
 [findbugs]   javax.xml.crypto.dsig.XMLObject
 [findbugs]   javax.xml.crypto.dsig.Manifest
 [findbugs]   java.security.KeyException
 [findbugs]   javax.xml.crypto.dsig.dom.DOMSignContext
 [findbugs]   javax.xml.crypto.dsig.Reference
 [findbugs]   javax.xml.crypto.dsig.DigestMethod
 [findbugs]   javax.xml.bind.JAXBElement
 [findbugs]   java.awt.geom.RoundRectangle2D$Float
 [findbugs]   java.awt.geom.Ellipse2D$Float
 [findbugs]   java.awt.geom.Arc2D$Float
 [findbugs]   java.awt.geom.Line2D$Float
 [findbugs]   java.nio.channels.ReadableByteChannel
 [findbugs]   javax.xml.stream.XMLEventFactory
 [findbugs]   javax.xml.parsers.SAXParserFactory
 [findbugs]   javax.xml.parsers.SAXParser
 [findbugs]   java.util.jar.JarFile
 [findbugs]   java.util.jar.JarEntry
 [findbugs]   java.security.ProtectionDomain
 [findbugs]   java.security.CodeSource
 [findbugs]   javax.xml.stream.XMLInputFactory
 [findbugs]   javax.xml.stream.XMLEventReader
 [findbugs]   javax.xml.bind.JAXBContext
 [findbugs]   javax.xml.stream.events.StartElement
 [findbugs]   javax.xml.bind.Unmarshaller
 [findbugs]   java.security.InvalidAlgorithmParameterException
 [findbugs]   javax.xml.crypto.dsig.TransformException
 [findbugs]   javax.xml.crypto.dsig.XMLSignContext
 [findbugs]   javax.xml.crypto.dsig.XMLValidateContext
 [findbugs]   java.awt.geom.Line2D
 [findbugs]   java.io.DataInputStream
 [findbugs]   java.io.LineNumberReader
 [findbugs]   javax.imageio.stream.MemoryCacheImageInputStream
 [findbugs]   javax.imageio.ImageTypeSpecifier
 [findbugs]   javax.imageio.ImageReadParam
 [findbugs]   java.awt.image.AffineTransformOp
 [findbugs]   javax.xml.stream.XMLOutputFactory
 [findbugs]   java.util.zip.CRC32
 [findbugs]   java.util.zip.Checksum
 [findbugs]   java.lang.NoSuchFieldError
 [findbugs]   java.lang.NegativeArraySizeException
 [findbugs]   java.lang.UnsatisfiedLinkError
 [findbugs]   java.lang.NoSuchMethodError
 [findbugs]   java.lang.IncompatibleClassChangeError
 [findbugs]   java.lang.AbstractMethodError
 [findbugs]   java.awt.MultipleGradientPaint
 [findbugs]   java.lang.ClassFormatError
 [findbugs]   java.lang.VerifyError
 [findbugs]   java.lang.ExceptionInInitializerError
 [findbugs]   java.lang.NoSuchFieldException
 [findbugs]   java.lang.NoSuchMethodException
 [findbugs]   java.lang.NoClassDefFoundError
 [findbugs]   java.util.zip.Deflater
 [findbugs]   java.text.CharacterIterator
 [findbugs]   javax.xml.XMLConstants
 [findbugs]   java.awt.geom.Ellipse2D
 [findbugs]   javax.xml.crypto.XMLStructure
 [findbugs]   java.awt.geom.Arc2D
 [findbugs]   java.awt.Transparency
 [findbugs]   javax.xml.transform.TransformerException
 [findbugs]   javax.xml.transform.OutputKeys
 [findbugs]   java.nio.charset.UnsupportedCharsetException
 [findbugs]   java.security.DigestException
 [findbugs]   java.util.zip.ZipException
 [findbugs]   java.nio.MappedByteBuffer
 [findbugs]   javax.xml.bind.JAXBException
 [findbugs]   java.security.AccessControlException
 [findbugs]   javax.xml.crypto.dsig.spec.C14NMethodParameterSpec
 [findbugs]   javax.xml.xpath.XPathExpressionException
 [findbugs]   java.text.ParseException
 [findbugs]   org.xml.sax.ContentHandler
 [findbugs]   java.awt.geom.RoundRectangle2D
 [findbugs]   javax.xml.crypto.Data
 [findbugs]   javax.crypto.ShortBufferException
 [findbugs] Warnings generated: 43
 [findbugs] Missing classes: 366
 [findbugs] Calculating exit code...
 [findbugs] Setting 'missing class' flag (2)
 [findbugs] Setting 'bugs found' flag (1)
 [findbugs] Exit code set to: 3
 [findbugs] Java Result: 3
 [findbugs] Classes needed for analysis were missing
 [findbugs] Output saved to build/findbugs.xml
     [xslt] Transforming into <https://builds.apache.org/job/POI-DSL-1.9/ws/build>
     [xslt] Processing <https://builds.apache.org/job/POI-DSL-1.9/ws/build/findbugs.xml> to <https://builds.apache.org/job/POI-DSL-1.9/57/artifact/build/findbugs.html>
     [xslt] Loading stylesheet jar:<https://builds.apache.org/job/POI-DSL-1.9/ws/build/findbugs/lib/findbugs.jar!/fancy-hist.xsl>

release-notes:
     [copy] Copying 1 file to <https://builds.apache.org/job/POI-DSL-1.9/ws/build/dist>

rat-check:
    [mkdir] Created dir: <https://builds.apache.org/job/POI-DSL-1.9/ws/build/rat>
     [echo]
     [echo] *****************************************************
     [echo] Summary
     [echo] -------
     [echo] Generated at: 2017-09-18T20:52:35+00:00
     [echo]
     [echo] Notes: 1
     [echo] Binaries: 119
     [echo] Archives: 0
     [echo] Standards: 3600
     [echo]
     [echo] Apache Licensed: 3600
     [echo] Generated Documents: 0
     [echo]
     [echo] JavaDocs are generated, thus a license header is optional.
     [echo] Generated files do not require license headers.
     [echo]
     [echo] 0 Unknown Licenses
     [echo]
     [echo] *****************************************************
     [echo]   Files with Apache License headers will be marked AL
     [echo]   Binary files (which do not require any license headers) will be marked B
     [echo]   Compressed archives will be marked A
     [echo]   Notices, licenses etc. will be marked N
     [echo]  
     [echo] *****************************************************

forbidden-apis-check:
[forbiddenapis] Reading bundled API signatures: jdk-unsafe-1.8
[forbiddenapis] Reading bundled API signatures: jdk-deprecated-1.8
[forbiddenapis] Reading bundled API signatures: jdk-internal-1.8
[forbiddenapis] Reading bundled API signatures: jdk-non-portable
[forbiddenapis] Reading bundled API signatures: jdk-reflection
[forbiddenapis] Reading API signatures: <https://builds.apache.org/job/POI-DSL-1.9/ws/src/resources/devtools/forbidden-signatures.txt>
[forbiddenapis] Loading classes to check...
[forbiddenapis] Scanning classes for violations...
[forbiddenapis] Scanned 3984 (and 1851 related) class file(s) for forbidden API invocations (in 10.31s), 0 error(s).
[forbiddenapis] Reading API signatures: <https://builds.apache.org/job/POI-DSL-1.9/ws/src/resources/devtools/forbidden-signatures-prod.txt>
[forbiddenapis] Loading classes to check...
[forbiddenapis] Scanning classes for violations...
[forbiddenapis] Scanned 3090 (and 1445 related) class file(s) for forbidden API invocations (in 1.56s), 0 error(s).

jenkins:

BUILD SUCCESSFUL
Total time: 26 minutes 25 seconds
[integrationtest] $ /home/jenkins/tools/ant/apache-ant-1.9.9/bin/ant -file build.xml run -Djava9addmods=--add-modules=java.xml.bind -Djavadoc9addmods=--add-modules=java.xml.bind -Djava9addmodsvalue=-Dsun.reflect.debugModuleAccessChecks=true -Djava9addopens1=--add-opens=java.xml/com.sun.org.apache.xerces.internal.util=ALL-UNNAMED -Djava9addopens2=--add-opens=java.base/java.io=ALL-UNNAMED -Djava9addopens3=--add-opens=java.base/java.nio=ALL-UNNAMED -Djava9addopens4=--add-opens=java.base/java.lang=ALL-UNNAMED -Djava9addopens5=--add-opens=java.base/jdk.internal.ref=ALL-UNNAMED -Djava.locale.providers=JRE,CLDR
Buildfile: <https://builds.apache.org/job/POI-DSL-1.9/ws/src/integrationtest/build.xml>

init:

runSourceBuild:
    [mkdir] Created dir: <https://builds.apache.org/job/POI-DSL-1.9/ws/build/distsourcebuild>
     [echo] Found source package at <https://builds.apache.org/job/POI-DSL-1.9/ws/build/dist/poi-src-4.0.0-SNAPSHOT-20170918.zip>
    [unzip] Expanding: <https://builds.apache.org/job/POI-DSL-1.9/ws/build/dist/poi-src-4.0.0-SNAPSHOT-20170918.zip> into <https://builds.apache.org/job/POI-DSL-1.9/ws/build/distsourcebuild>

BUILD FAILED
<https://builds.apache.org/job/POI-DSL-1.9/ws/src/integrationtest/build.xml>:55: Error while expanding <https://builds.apache.org/job/POI-DSL-1.9/ws/build/dist/poi-src-4.0.0-SNAPSHOT-20170918.zip>
java.io.IOException: No space left on device
        at java.base/java.io.FileOutputStream.writeBytes(Native Method)
        at java.base/java.io.FileOutputStream.write(FileOutputStream.java:332)
        at org.apache.tools.ant.taskdefs.Expand.extractFile(Expand.java:359)
        at org.apache.tools.ant.taskdefs.Expand.expandFile(Expand.java:193)
        at org.apache.tools.ant.taskdefs.Expand.execute(Expand.java:148)
        at org.apache.tools.ant.UnknownElement.execute(UnknownElement.java:293)
        at java.base/jdk.internal.reflect.NativeMethodAccessorImpl.invoke0(Native Method)
        at java.base/jdk.internal.reflect.NativeMethodAccessorImpl.invoke(NativeMethodAccessorImpl.java:62)
        at java.base/jdk.internal.reflect.DelegatingMethodAccessorImpl.invoke(DelegatingMethodAccessorImpl.java:43)
        at java.base/java.lang.reflect.Method.invoke(Method.java:564)
        at org.apache.tools.ant.dispatch.DispatchUtils.execute(DispatchUtils.java:106)
        at org.apache.tools.ant.Task.perform(Task.java:348)
        at org.apache.tools.ant.Target.execute(Target.java:435)
        at org.apache.tools.ant.Target.performTasks(Target.java:456)
        at org.apache.tools.ant.Project.executeSortedTargets(Project.java:1405)
        at org.apache.tools.ant.Project.executeTarget(Project.java:1376)
        at org.apache.tools.ant.helper.DefaultExecutor.executeTargets(DefaultExecutor.java:41)
        at org.apache.tools.ant.Project.executeTargets(Project.java:1260)
        at org.apache.tools.ant.Main.runBuild(Main.java:857)
        at org.apache.tools.ant.Main.startAnt(Main.java:236)
        at org.apache.tools.ant.launch.Launcher.run(Launcher.java:287)
        at org.apache.tools.ant.launch.Launcher.main(Launcher.java:113)

Total time: 3 seconds
Build step 'Invoke Ant' marked build as failure
Skipping publisher since build result is FAILURE
Archiving artifacts
[Fast Archiver] Compressed 235.69 MB of artifacts by 37.6% relative to #55
Skipping publisher since build result is FAILURE
Recording test results

---------------------------------------------------------------------
To unsubscribe, e-mail: [hidden email]
For additional commands, e-mail: [hidden email]

Reply | Threaded
Open this post in threaded view
|

Jenkins build is back to normal : POI-DSL-1.9 #58

Apache Jenkins Server
See <https://builds.apache.org/job/POI-DSL-1.9/58/display/redirect?page=changes>


---------------------------------------------------------------------
To unsubscribe, e-mail: [hidden email]
For additional commands, e-mail: [hidden email]