Build failed in Jenkins: POI-DSL-1.8 #998

classic Classic list List threaded Threaded
4 messages Options
Reply | Threaded
Open this post in threaded view
|

Build failed in Jenkins: POI-DSL-1.8 #998

Apache Jenkins Server
See <https://builds.apache.org/job/POI-DSL-1.8/998/display/redirect?page=changes>

Changes:

[fanningpj] remove some deprecated Name methods from Workbook


------------------------------------------
Started by user fanningpj
Running as SYSTEM
[EnvInject] - Loading node environment variables.
[EnvInject] - Preparing an environment for the build.
[EnvInject] - Keeping Jenkins system variables.
[EnvInject] - Keeping Jenkins build variables.
[EnvInject] - Injecting as environment variables the properties content
LANG=en_US.UTF-8
FORREST_HOME=/home/jenkins/tools/forrest/latest

[EnvInject] - Variables injected successfully.
[EnvInject] - Injecting contributions.
Building remotely on H27 (ubuntu) in workspace <https://builds.apache.org/job/POI-DSL-1.8/ws/>
[WS-CLEANUP] Deleting project workspace...
[WS-CLEANUP] Done
Updating https://svn.apache.org/repos/asf/poi/trunk at revision '2020-06-27T09:33:30.088 +0000'
U         src/java/org/apache/poi/hssf/usermodel/HSSFWorkbook.java
U         src/java/org/apache/poi/ss/usermodel/Workbook.java
U         src/ooxml/java/org/apache/poi/xssf/streaming/SXSSFWorkbook.java
U         src/ooxml/java/org/apache/poi/xssf/usermodel/XSSFWorkbook.java
U         src/testcases/org/apache/poi/hssf/usermodel/TestHSSFName.java
U         src/testcases/org/apache/poi/ss/usermodel/BaseTestNamedRange.java

<-- Got one external: forrest.properties, svn url: https://svn.apache.org/repos/asf/poi/site/forrest.properties -->
Fetching 'https://svn.apache.org/repos/asf/poi/site/forrest.properties' at -1 into '<https://builds.apache.org/job/POI-DSL-1.8/ws/forrest.properties'>
At revision 1879255


<-- Got one external: documentation, svn url: https://svn.apache.org/repos/asf/poi/site/src/documentation -->
Fetching 'https://svn.apache.org/repos/asf/poi/site/src/documentation' at -1 into '<https://builds.apache.org/job/POI-DSL-1.8/ws/src/documentation'>
At revision 1879255

At revision 1879255

No changes for https://svn.apache.org/repos/asf/poi/site/forrest.properties since the previous build
No changes for https://svn.apache.org/repos/asf/poi/site/src/documentation since the previous build
[POI-DSL-1.8] $ /bin/bash -xe /tmp/jenkins7992638499563196055.sh
+ svn status
?       build.javacheck.xml
    X   forrest.properties
X       src/documentation
?       src/integrationtest/build

Performing status on external item at 'src/documentation':
+ echo Java-Home: /home/jenkins/tools/java/latest1.8
Java-Home: /home/jenkins/tools/java/latest1.8
+ ls -al /home/jenkins/tools/java/latest1.8/
total 26012
drwxr-xr-x  7 root root     4096 Feb 25 11:26 .
drwxr-xr-x 28 root root     4096 Apr  7 14:57 ..
drwxr-xr-x  2 root root     4096 Feb 25 11:26 bin
-r--r--r--  1 root root     3244 Dec 11  2019 COPYRIGHT
drwxr-xr-x  3 root root     4096 Feb 25 11:26 include
-rw-r--r--  1 root root  5217333 Dec 11  2019 javafx-src.zip
drwxr-xr-x  5 root root     4096 Feb 25 11:26 jre
drwxr-xr-x  5 root root     4096 Feb 25 11:26 lib
-r--r--r--  1 root root       44 Dec 11  2019 LICENSE
drwxr-xr-x  4 root root     4096 Feb 25 11:26 man
-r--r--r--  1 root root      159 Dec 11  2019 README.html
-rw-r--r--  1 root root      424 Dec 11  2019 release
-rw-r--r--  1 root root 21078837 Dec 11  2019 src.zip
-rw-r--r--  1 root root   116400 Dec 11  2019 THIRDPARTYLICENSEREADME-JAVAFX.txt
-r--r--r--  1 root root   169788 Dec 11  2019 THIRDPARTYLICENSEREADME.txt
+ ls -al /home/jenkins/tools/java/latest1.8/bin
total 912
drwxr-xr-x 2 root root   4096 Feb 25 11:26 .
drwxr-xr-x 7 root root   4096 Feb 25 11:26 ..
-rwxr-xr-x 1 root root   8592 Dec 11  2019 appletviewer
-rwxr-xr-x 2 root root   6264 Dec 11  2019 ControlPanel
-rwxr-xr-x 1 root root   8584 Dec 11  2019 extcheck
-rwxr-xr-x 1 root root   8584 Dec 11  2019 idlj
-rwxr-xr-x 1 root root   8584 Dec 11  2019 jar
-rwxr-xr-x 1 root root   8584 Dec 11  2019 jarsigner
-rwxr-xr-x 1 root root   8464 Dec 11  2019 java
-rwxr-xr-x 1 root root   8584 Dec 11  2019 javac
-rwxr-xr-x 1 root root   8584 Dec 11  2019 javadoc
-rwxr-xr-x 1 root root   2293 Dec 11  2019 javafxpackager
-rwxr-xr-x 1 root root   8584 Dec 11  2019 javah
-rwxr-xr-x 1 root root   8584 Dec 11  2019 javap
-rwxr-xr-x 1 root root   2293 Dec 11  2019 javapackager
-rwxr-xr-x 1 root root   1809 Dec 11  2019 java-rmi.cgi
-rwxr-xr-x 1 root root 140488 Dec 11  2019 javaws
-rwxr-xr-x 1 root root   8584 Dec 11  2019 jcmd
-rwxr-xr-x 1 root root   8608 Dec 11  2019 jconsole
-rwxr-xr-x 2 root root   6264 Dec 11  2019 jcontrol
-rwxr-xr-x 1 root root   8600 Dec 11  2019 jdb
-rwxr-xr-x 1 root root   8584 Dec 11  2019 jdeps
-rwxr-xr-x 1 root root   8584 Dec 11  2019 jhat
-rwxr-xr-x 1 root root   8648 Dec 11  2019 jinfo
-rwxr-xr-x 1 root root   8584 Dec 11  2019 jjs
-rwxr-xr-x 1 root root   8648 Dec 11  2019 jmap
-rwxr-xr-x 1 root root  74675 Dec  8  2017 jmc
-rwxr-xr-x 1 root root    402 Dec  8  2017 jmc.ini
-rwxr-xr-x 1 root root   8584 Dec 11  2019 jps
-rwxr-xr-x 1 root root   8592 Dec 11  2019 jrunscript
-rwxr-xr-x 1 root root   8600 Dec 11  2019 jsadebugd
-rwxr-xr-x 1 root root   8648 Dec 11  2019 jstack
-rwxr-xr-x 1 root root   8584 Dec 11  2019 jstat
-rwxr-xr-x 1 root root   8584 Dec 11  2019 jstatd
-rwxr-xr-x 1 root root   5110 Jan 14  2017 jvisualvm
-rwxr-xr-x 1 root root   8584 Dec 11  2019 keytool
-rwxr-xr-x 1 root root   8592 Dec 11  2019 native2ascii
-rwxr-xr-x 1 root root   8656 Dec 11  2019 orbd
-rwxr-xr-x 1 root root   8584 Dec 11  2019 pack200
-rwxr-xr-x 1 root root   8592 Dec 11  2019 policytool
-rwxr-xr-x 1 root root   8584 Dec 11  2019 rmic
-rwxr-xr-x 1 root root   8584 Dec 11  2019 rmid
-rwxr-xr-x 1 root root   8592 Dec 11  2019 rmiregistry
-rwxr-xr-x 1 root root   8584 Dec 11  2019 schemagen
-rwxr-xr-x 1 root root   8584 Dec 11  2019 serialver
-rwxr-xr-x 1 root root   8592 Dec 11  2019 servertool
-rwxr-xr-x 1 root root   8656 Dec 11  2019 tnameserv
-rwxr-xr-x 1 root root 182616 Dec 11  2019 unpack200
-rwxr-xr-x 1 root root   8584 Dec 11  2019 wsgen
-rwxr-xr-x 1 root root   8584 Dec 11  2019 wsimport
-rwxr-xr-x 1 root root   8584 Dec 11  2019 xjc
+ /home/jenkins/tools/java/latest1.8/bin/java -version
java version "1.8.0_241"
Java(TM) SE Runtime Environment (build 1.8.0_241-b07)
Java HotSpot(TM) 64-Bit Server VM (build 25.241-b07, mixed mode)
+ echo which java
which java
+ which java
/home/jenkins/tools/java/latest1.8/bin/java
+ java -version
java version "1.8.0_241"
Java(TM) SE Runtime Environment (build 1.8.0_241-b07)
Java HotSpot(TM) 64-Bit Server VM (build 25.241-b07, mixed mode)
+ echo which javac
which javac
+ which javac
/home/jenkins/tools/java/latest1.8/bin/javac
+ javac -version
javac 1.8.0_241
+ echo Ant-Home:
Ant-Home:
+ ls -al
total 520
drwxr-xr-x  14 jenkins jenkins   4096 Jun 26 11:07 .
drwxr-xr-x 728 jenkins jenkins  73728 Jun 27 09:02 ..
drwxr-xr-x  26 jenkins jenkins   4096 Jun 26 11:18 build
-rw-r--r--   1 jenkins jenkins  12417 Jun  6 10:02 build.gradle
-rw-r--r--   1 jenkins jenkins    172 Jun 26 10:41 build.javacheck.xml
-rw-r--r--   1 jenkins jenkins 137785 Jun 26 10:41 build.xml
-rw-r--r--   1 jenkins jenkins   3341 Jun  6 10:02 .classpath
-rw-r--r--   1 jenkins jenkins   6160 Feb 21 00:58 doap_POI.rdf
-rw-r--r--   1 jenkins jenkins   2847 Mar 22 20:25 file-leak-detector.exclude
-rw-r--r--   1 jenkins jenkins   6229 Nov 18  2019 forrest.properties
-rw-r--r--   1 jenkins jenkins     53 Nov 18  2019 .gitattributes
-rw-r--r--   1 jenkins jenkins    493 Nov 18  2019 .gitignore
drwxr-xr-x   3 jenkins jenkins   4096 Nov 18  2019 gradle
-rwxr-xr-x   1 jenkins jenkins   5917 Nov 18  2019 gradlew
-rw-r--r--   1 jenkins jenkins   2842 Nov 18  2019 gradlew.bat
drwxr-xr-x   2 jenkins jenkins   4096 Jun 26 10:41 jenkins
-rw-r--r--   1 jenkins jenkins 166411 Nov 18  2019 KEYS
drwxr-xr-x   2 jenkins jenkins   4096 Nov 18  2019 legal
drwxr-xr-x   9 jenkins jenkins   4096 May  6 09:57 lib
drwxr-xr-x   2 jenkins jenkins   4096 Mar 22 20:25 maven
drwxr-xr-x   4 jenkins jenkins   4096 May 28 12:58 osgi
-rw-r--r--   1 jenkins jenkins   4813 Nov 18  2019 patch.xml
-rw-r--r--   1 jenkins jenkins    426 Nov 18  2019 .project
-rw-r--r--   1 jenkins jenkins   4266 May  6 09:56 README.rst
drwxr-xr-x   2 jenkins jenkins   4096 Nov 18  2019 .settings
-rw-r--r--   1 jenkins jenkins    556 Nov 18  2019 settings.gradle
drwxr-xr-x  11 jenkins jenkins   4096 May 28 12:58 sonar
drwxr-xr-x  16 jenkins jenkins   4096 May  6 09:56 src
drwxr-xr-x   4 jenkins jenkins   4096 Jun 27 09:33 .svn
drwxr-xr-x  14 jenkins jenkins   4096 Nov 18  2019 test-data
-rw-r--r--   1 jenkins jenkins    136 Nov 18  2019 .travis.yml
+ echo which ant
which ant
+ which ant
/usr/bin/ant
+ ant -version
Apache Ant(TM) version 1.10.5 compiled on March 28 2019
+ echo '<project default="test"><target name="test"><echo>Java ${ant.java.version}/${java.version}</echo><exec executable="javac"><arg value="-version"/></exec></target></project>'
+ ant -f build.javacheck.xml -v
Apache Ant(TM) version 1.10.5 compiled on March 28 2019
Buildfile: <https://builds.apache.org/job/POI-DSL-1.8/ws/build.javacheck.xml>
Detected Java version: 1.8 in: /usr/local/asfpackages/java/jdk1.8.0_241/jre
Detected OS: Linux
parsing buildfile <https://builds.apache.org/job/POI-DSL-1.8/ws/build.javacheck.xml> with URI = <https://builds.apache.org/job/POI-DSL-1.8/ws/build.javacheck.xml>
Project base dir set to: <https://builds.apache.org/job/POI-DSL-1.8/ws/>
Build sequence for target(s) `test' is [test]
Complete build sequence is [test, ]

test:
parsing buildfile jar:file:/usr/share/ant/lib/ant.jar!/org/apache/tools/ant/antlib.xml with URI = jar:file:/usr/share/ant/lib/ant.jar!/org/apache/tools/ant/antlib.xml from a zip file
     [echo] Java 1.8/1.8.0_241
     [exec] Current OS is Linux
     [exec] Executing 'javac' with arguments:
     [exec] '-version'
     [exec]
     [exec] The ' characters around the executable and arguments are
     [exec] not part of the command.
     [exec] javac 1.8.0_241

BUILD SUCCESSFUL
Total time: 0 seconds
+ exit 0
[POI-DSL-1.8] $ /home/jenkins/tools/ant/latest1.9/bin/ant -Dcoverage.enabled=true clean jenkins
Buildfile: <https://builds.apache.org/job/POI-DSL-1.8/ws/build.xml>

clean:
   [delete] Deleting directory <https://builds.apache.org/job/POI-DSL-1.8/ws/build>

replaceVersion:

check-jars:

fetch-jars:

check-ooxml-jars:

fetch-ooxml-jars:
      [get] Destination already exists (skipping): <https://builds.apache.org/job/POI-DSL-1.8/998/artifact/lib/ooxml/curvesapi-1.06.jar>
      [get] Getting: https://builds.apache.org/view/P/view/POI/job/POI-XMLBeans-DSL-1.8/lastSuccessfulBuild/artifact/build/xmlbeans-4.0.0.jar
      [get] To: <https://builds.apache.org/job/POI-DSL-1.8/998/artifact/lib/ooxml/xmlbeans-4.0.0.jar>
      [get] Error opening connection java.io.IOException: Server returned HTTP response code: 502 for URL: https://builds.apache.org/view/P/view/POI/job/POI-XMLBeans-DSL-1.8/lastSuccessfulBuild/artifact/build/xmlbeans-4.0.0.jar
      [get] Error opening connection java.io.IOException: Server returned HTTP response code: 502 for URL: https://builds.apache.org/view/P/view/POI/job/POI-XMLBeans-DSL-1.8/lastSuccessfulBuild/artifact/build/xmlbeans-4.0.0.jar
      [get] Error opening connection java.io.IOException: Server returned HTTP response code: 502 for URL: https://builds.apache.org/view/P/view/POI/job/POI-XMLBeans-DSL-1.8/lastSuccessfulBuild/artifact/build/xmlbeans-4.0.0.jar
      [get] Can't get https://builds.apache.org/view/P/view/POI/job/POI-XMLBeans-DSL-1.8/lastSuccessfulBuild/artifact/build/xmlbeans-4.0.0.jar to <https://builds.apache.org/job/POI-DSL-1.8/998/artifact/lib/ooxml/xmlbeans-4.0.0.jar>

BUILD FAILED
<https://builds.apache.org/job/POI-DSL-1.8/ws/build.xml>:723: The following error occurred while executing this line:
<https://builds.apache.org/job/POI-DSL-1.8/ws/build.xml>:595: Can't get https://builds.apache.org/view/P/view/POI/job/POI-XMLBeans-DSL-1.8/lastSuccessfulBuild/artifact/build/xmlbeans-4.0.0.jar to <https://builds.apache.org/job/POI-DSL-1.8/998/artifact/lib/ooxml/xmlbeans-4.0.0.jar>

Total time: 7 seconds
Build step 'Invoke Ant' marked build as failure
Skipping publisher since build result is FAILURE
Archiving artifacts
[Fast Archiver] Compressed 726.94 KB of artifacts by 92.4% relative to #997
Skipping publisher since build result is FAILURE
Recording test results
ERROR: Step ?Publish JUnit test result report? failed: No test report files were found. Configuration error?

---------------------------------------------------------------------
To unsubscribe, e-mail: [hidden email]
For additional commands, e-mail: [hidden email]

Reply | Threaded
Open this post in threaded view
|

Build failed in Jenkins: POI-DSL-1.8 #999

Apache Jenkins Server
See <https://builds.apache.org/job/POI-DSL-1.8/999/display/redirect>

Changes:


------------------------------------------
[...truncated 4.12 KB...]
-rwxr-xr-x 1 root root 140488 Dec 11  2019 javaws
-rwxr-xr-x 1 root root   8584 Dec 11  2019 jcmd
-rwxr-xr-x 1 root root   8608 Dec 11  2019 jconsole
-rwxr-xr-x 2 root root   6264 Dec 11  2019 jcontrol
-rwxr-xr-x 1 root root   8600 Dec 11  2019 jdb
-rwxr-xr-x 1 root root   8584 Dec 11  2019 jdeps
-rwxr-xr-x 1 root root   8584 Dec 11  2019 jhat
-rwxr-xr-x 1 root root   8648 Dec 11  2019 jinfo
-rwxr-xr-x 1 root root   8584 Dec 11  2019 jjs
-rwxr-xr-x 1 root root   8648 Dec 11  2019 jmap
-rwxr-xr-x 1 root root  74675 Dec  8  2017 jmc
-rwxr-xr-x 1 root root    402 Dec  8  2017 jmc.ini
-rwxr-xr-x 1 root root   8584 Dec 11  2019 jps
-rwxr-xr-x 1 root root   8592 Dec 11  2019 jrunscript
-rwxr-xr-x 1 root root   8600 Dec 11  2019 jsadebugd
-rwxr-xr-x 1 root root   8648 Dec 11  2019 jstack
-rwxr-xr-x 1 root root   8584 Dec 11  2019 jstat
-rwxr-xr-x 1 root root   8584 Dec 11  2019 jstatd
-rwxr-xr-x 1 root root   5110 Jan 14  2017 jvisualvm
-rwxr-xr-x 1 root root   8584 Dec 11  2019 keytool
-rwxr-xr-x 1 root root   8592 Dec 11  2019 native2ascii
-rwxr-xr-x 1 root root   8656 Dec 11  2019 orbd
-rwxr-xr-x 1 root root   8584 Dec 11  2019 pack200
-rwxr-xr-x 1 root root   8592 Dec 11  2019 policytool
-rwxr-xr-x 1 root root   8584 Dec 11  2019 rmic
-rwxr-xr-x 1 root root   8584 Dec 11  2019 rmid
-rwxr-xr-x 1 root root   8592 Dec 11  2019 rmiregistry
-rwxr-xr-x 1 root root   8584 Dec 11  2019 schemagen
-rwxr-xr-x 1 root root   8584 Dec 11  2019 serialver
-rwxr-xr-x 1 root root   8592 Dec 11  2019 servertool
-rwxr-xr-x 1 root root   8656 Dec 11  2019 tnameserv
-rwxr-xr-x 1 root root 182616 Dec 11  2019 unpack200
-rwxr-xr-x 1 root root   8584 Dec 11  2019 wsgen
-rwxr-xr-x 1 root root   8584 Dec 11  2019 wsimport
-rwxr-xr-x 1 root root   8584 Dec 11  2019 xjc
+ /home/jenkins/tools/java/latest1.8/bin/java -version
java version "1.8.0_241"
Java(TM) SE Runtime Environment (build 1.8.0_241-b07)
Java HotSpot(TM) 64-Bit Server VM (build 25.241-b07, mixed mode)
+ echo which java
which java
+ which java
/home/jenkins/tools/java/latest1.8/bin/java
+ java -version
java version "1.8.0_241"
Java(TM) SE Runtime Environment (build 1.8.0_241-b07)
Java HotSpot(TM) 64-Bit Server VM (build 25.241-b07, mixed mode)
+ echo which javac
which javac
+ which javac
/home/jenkins/tools/java/latest1.8/bin/javac
+ javac -version
javac 1.8.0_241
+ echo Ant-Home:
Ant-Home:
+ ls -al
total 516
drwxr-xr-x  13 jenkins jenkins   4096 Jun 27 09:33 .
drwxr-xr-x 728 jenkins jenkins  73728 Jun 27 09:02 ..
-rw-r--r--   1 jenkins jenkins  12417 Jun  6 10:02 build.gradle
-rw-r--r--   1 jenkins jenkins    172 Jun 27 09:33 build.javacheck.xml
-rw-r--r--   1 jenkins jenkins 137785 Jun 26 10:41 build.xml
-rw-r--r--   1 jenkins jenkins   3341 Jun  6 10:02 .classpath
-rw-r--r--   1 jenkins jenkins   6160 Feb 21 00:58 doap_POI.rdf
-rw-r--r--   1 jenkins jenkins   2847 Mar 22 20:25 file-leak-detector.exclude
-rw-r--r--   1 jenkins jenkins   6229 Nov 18  2019 forrest.properties
-rw-r--r--   1 jenkins jenkins     53 Nov 18  2019 .gitattributes
-rw-r--r--   1 jenkins jenkins    493 Nov 18  2019 .gitignore
drwxr-xr-x   3 jenkins jenkins   4096 Nov 18  2019 gradle
-rwxr-xr-x   1 jenkins jenkins   5917 Nov 18  2019 gradlew
-rw-r--r--   1 jenkins jenkins   2842 Nov 18  2019 gradlew.bat
drwxr-xr-x   2 jenkins jenkins   4096 Jun 26 10:41 jenkins
-rw-r--r--   1 jenkins jenkins 166411 Nov 18  2019 KEYS
drwxr-xr-x   2 jenkins jenkins   4096 Nov 18  2019 legal
drwxr-xr-x   9 jenkins jenkins   4096 May  6 09:57 lib
drwxr-xr-x   2 jenkins jenkins   4096 Mar 22 20:25 maven
drwxr-xr-x   4 jenkins jenkins   4096 May 28 12:58 osgi
-rw-r--r--   1 jenkins jenkins   4813 Nov 18  2019 patch.xml
-rw-r--r--   1 jenkins jenkins    426 Nov 18  2019 .project
-rw-r--r--   1 jenkins jenkins   4266 May  6 09:56 README.rst
drwxr-xr-x   2 jenkins jenkins   4096 Nov 18  2019 .settings
-rw-r--r--   1 jenkins jenkins    556 Nov 18  2019 settings.gradle
drwxr-xr-x  11 jenkins jenkins   4096 May 28 12:58 sonar
drwxr-xr-x  16 jenkins jenkins   4096 May  6 09:56 src
drwxr-xr-x   4 jenkins jenkins   4096 Jun 27 09:42 .svn
drwxr-xr-x  14 jenkins jenkins   4096 Nov 18  2019 test-data
-rw-r--r--   1 jenkins jenkins    136 Nov 18  2019 .travis.yml
+ echo which ant
which ant
+ which ant
/usr/bin/ant
+ ant -version
Apache Ant(TM) version 1.10.5 compiled on March 28 2019
+ echo '<project default="test"><target name="test"><echo>Java ${ant.java.version}/${java.version}</echo><exec executable="javac"><arg value="-version"/></exec></target></project>'
+ ant -f build.javacheck.xml -v
Apache Ant(TM) version 1.10.5 compiled on March 28 2019
Buildfile: <https://builds.apache.org/job/POI-DSL-1.8/ws/build.javacheck.xml>
Detected Java version: 1.8 in: /usr/local/asfpackages/java/jdk1.8.0_241/jre
Detected OS: Linux
parsing buildfile <https://builds.apache.org/job/POI-DSL-1.8/ws/build.javacheck.xml> with URI = <https://builds.apache.org/job/POI-DSL-1.8/ws/build.javacheck.xml>
Project base dir set to: <https://builds.apache.org/job/POI-DSL-1.8/ws/>
Build sequence for target(s) `test' is [test]
Complete build sequence is [test, ]

test:
parsing buildfile jar:file:/usr/share/ant/lib/ant.jar!/org/apache/tools/ant/antlib.xml with URI = jar:file:/usr/share/ant/lib/ant.jar!/org/apache/tools/ant/antlib.xml from a zip file
     [echo] Java 1.8/1.8.0_241
     [exec] Current OS is Linux
     [exec] Executing 'javac' with arguments:
     [exec] '-version'
     [exec]
     [exec] The ' characters around the executable and arguments are
     [exec] not part of the command.
     [exec] javac 1.8.0_241

BUILD SUCCESSFUL
Total time: 0 seconds
+ exit 0
[POI-DSL-1.8] $ /home/jenkins/tools/ant/latest1.9/bin/ant -Dcoverage.enabled=true clean jenkins
Buildfile: <https://builds.apache.org/job/POI-DSL-1.8/ws/build.xml>

clean:

replaceVersion:

check-jars:

fetch-jars:

check-ooxml-jars:

fetch-ooxml-jars:
      [get] Destination already exists (skipping): <https://builds.apache.org/job/POI-DSL-1.8/999/artifact/lib/ooxml/curvesapi-1.06.jar>
      [get] Getting: https://builds.apache.org/view/P/view/POI/job/POI-XMLBeans-DSL-1.8/lastSuccessfulBuild/artifact/build/xmlbeans-4.0.0.jar
      [get] To: <https://builds.apache.org/job/POI-DSL-1.8/999/artifact/lib/ooxml/xmlbeans-4.0.0.jar>
      [get] Destination already exists (skipping): <https://builds.apache.org/job/POI-DSL-1.8/999/artifact/lib/ooxml/commons-compress-1.20.jar>
      [get] Destination already exists (skipping): <https://builds.apache.org/job/POI-DSL-1.8/ws/lib/ooxml-tests/reflections-0.9.11.jar>
      [get] Destination already exists (skipping): <https://builds.apache.org/job/POI-DSL-1.8/ws/lib/ooxml-tests/guava-20.0.jar>
      [get] Destination already exists (skipping): <https://builds.apache.org/job/POI-DSL-1.8/ws/lib/ooxml-tests/javassist-3.21.0-GA.jar>
      [get] Destination already exists (skipping): <https://builds.apache.org/job/POI-DSL-1.8/ws/lib/ooxml-provided/batik-all-1.12.jar>
      [get] Destination already exists (skipping): <https://builds.apache.org/job/POI-DSL-1.8/ws/lib/ooxml-provided/xml-apis-ext-1.3.04.jar>
      [get] Destination already exists (skipping): <https://builds.apache.org/job/POI-DSL-1.8/ws/lib/ooxml-provided/xmlgraphics-commons-2.3.jar>

init:
    [mkdir] Created dir: <https://builds.apache.org/job/POI-DSL-1.8/ws/build>
    [mkdir] Created dir: <https://builds.apache.org/job/POI-DSL-1.8/ws/build/classes>
    [mkdir] Created dir: <https://builds.apache.org/job/POI-DSL-1.8/ws/build/test-classes>
    [mkdir] Created dir: <https://builds.apache.org/job/POI-DSL-1.8/ws/build/test-results>
    [mkdir] Created dir: <https://builds.apache.org/job/POI-DSL-1.8/ws/build/scratchpad-classes>
    [mkdir] Created dir: <https://builds.apache.org/job/POI-DSL-1.8/ws/build/scratchpad-test-classes>
    [mkdir] Created dir: <https://builds.apache.org/job/POI-DSL-1.8/ws/build/scratchpad-test-results>
    [mkdir] Created dir: <https://builds.apache.org/job/POI-DSL-1.8/ws/build/geometry-java>
    [mkdir] Created dir: <https://builds.apache.org/job/POI-DSL-1.8/ws/build/ooxml-classes>
    [mkdir] Created dir: <https://builds.apache.org/job/POI-DSL-1.8/ws/build/ooxml-test-classes>
    [mkdir] Created dir: <https://builds.apache.org/job/POI-DSL-1.8/ws/build/ooxml-test-results>
    [mkdir] Created dir: <https://builds.apache.org/job/POI-DSL-1.8/ws/build/excelant-classes>
    [mkdir] Created dir: <https://builds.apache.org/job/POI-DSL-1.8/ws/build/excelant-test-classes>
    [mkdir] Created dir: <https://builds.apache.org/job/POI-DSL-1.8/ws/build/excelant-test-results>
    [mkdir] Created dir: <https://builds.apache.org/job/POI-DSL-1.8/ws/build/examples-classes>
    [mkdir] Created dir: <https://builds.apache.org/job/POI-DSL-1.8/ws/build/integration-test-classes>
    [mkdir] Created dir: <https://builds.apache.org/job/POI-DSL-1.8/999/artifact/build/integration-test-results>
    [mkdir] Created dir: <https://builds.apache.org/job/POI-DSL-1.8/ws/build/dist>
    [mkdir] Created dir: <https://builds.apache.org/job/POI-DSL-1.8/ws/build/site>
     [echo] Using Ant: Apache Ant(TM) version 1.9.14 compiled on March 12 2019 from /home/jenkins/tools/ant/latest1.9, Ant detected Java 1.8 (may be different than actual Java sometimes...)
     [echo] Using Java: 1.8.0_241/1.8.0_241-b07/25.241-b07/Java HotSpot(TM) 64-Bit Server VM from Oracle Corporation on Linux: 4.15.0-58-generic
     [echo] Building Apache POI version 5.0.0-SNAPSHOT and RC: RC1

compile-main:
    [javac] Compiling 1189 source files to <https://builds.apache.org/job/POI-DSL-1.8/ws/build/classes>
    [javac] Note: Some input files use or override a deprecated API.
    [javac] Note: Recompile with -Xlint:deprecation for details.
    [javac] Note: Some input files use unchecked or unsafe operations.
    [javac] Note: Recompile with -Xlint:unchecked for details.
    [javac] Creating empty <https://builds.apache.org/job/POI-DSL-1.8/ws/build/classes/org/apache/poi/ddf/package-info.class>
    [javac] Creating empty <https://builds.apache.org/job/POI-DSL-1.8/ws/build/classes/org/apache/poi/hssf/package-info.class>
    [javac] Creating empty <https://builds.apache.org/job/POI-DSL-1.8/ws/build/classes/org/apache/poi/poifs/dev/package-info.class>
    [javac] Creating empty <https://builds.apache.org/job/POI-DSL-1.8/ws/build/classes/org/apache/poi/util/package-info.class>
    [javac] Creating empty <https://builds.apache.org/job/POI-DSL-1.8/ws/build/classes/org/apache/poi/poifs/common/package-info.class>
    [javac] Creating empty <https://builds.apache.org/job/POI-DSL-1.8/ws/build/classes/org/apache/poi/hssf/record/package-info.class>
    [javac] Creating empty <https://builds.apache.org/job/POI-DSL-1.8/ws/build/classes/org/apache/poi/poifs/package-info.class>
    [javac] Creating empty <https://builds.apache.org/job/POI-DSL-1.8/ws/build/classes/org/apache/poi/poifs/crypt/package-info.class>
    [javac] Creating empty <https://builds.apache.org/job/POI-DSL-1.8/ws/build/classes/org/apache/poi/hpsf/wellknown/package-info.class>
    [javac] Creating empty <https://builds.apache.org/job/POI-DSL-1.8/ws/build/classes/org/apache/poi/hssf/dev/package-info.class>
    [javac] Creating empty <https://builds.apache.org/job/POI-DSL-1.8/ws/build/classes/org/apache/poi/ss/formula/package-info.class>
    [javac] Creating empty <https://builds.apache.org/job/POI-DSL-1.8/ws/build/classes/org/apache/poi/hpsf/package-info.class>
    [javac] Creating empty <https://builds.apache.org/job/POI-DSL-1.8/ws/build/classes/org/apache/poi/poifs/property/package-info.class>
    [javac] Creating empty <https://builds.apache.org/job/POI-DSL-1.8/ws/build/classes/org/apache/poi/poifs/filesystem/package-info.class>
    [javac] Creating empty <https://builds.apache.org/job/POI-DSL-1.8/ws/build/classes/org/apache/poi/ss/formula/ptg/package-info.class>
    [javac] Creating empty <https://builds.apache.org/job/POI-DSL-1.8/ws/build/classes/org/apache/poi/poifs/storage/package-info.class>
    [javac] Creating empty <https://builds.apache.org/job/POI-DSL-1.8/ws/build/classes/org/apache/poi/hssf/eventusermodel/package-info.class>
    [javac] Creating empty <https://builds.apache.org/job/POI-DSL-1.8/ws/build/classes/org/apache/poi/hssf/record/aggregates/package-info.class>
    [javac] Creating empty <https://builds.apache.org/job/POI-DSL-1.8/ws/build/classes/org/apache/poi/ss/format/package-info.class>
    [javac] Creating empty <https://builds.apache.org/job/POI-DSL-1.8/ws/build/classes/org/apache/poi/hssf/model/package-info.class>
    [javac] Creating empty <https://builds.apache.org/job/POI-DSL-1.8/ws/build/classes/org/apache/poi/hssf/usermodel/package-info.class>
    [javac] Creating empty <https://builds.apache.org/job/POI-DSL-1.8/ws/build/classes/org/apache/poi/hssf/util/package-info.class>
    [javac] Creating empty <https://builds.apache.org/job/POI-DSL-1.8/ws/build/classes/org/apache/poi/poifs/eventfilesystem/package-info.class>
    [javac] Compiling 548 source files to <https://builds.apache.org/job/POI-DSL-1.8/ws/build/test-classes>
    [javac] <https://builds.apache.org/job/POI-DSL-1.8/ws/src/testcases/org/apache/poi/ss/usermodel/BaseTestWorkbook.java>:690: error: cannot find symbol
    [javac]         Name sale_2 = wb1.getNameAt(1);
    [javac]                          ^
    [javac]   symbol:   method getNameAt(int)
    [javac]   location: variable wb1 of type Workbook
    [javac] <https://builds.apache.org/job/POI-DSL-1.8/ws/src/testcases/org/apache/poi/ss/usermodel/BaseTestWorkbook.java>:691: error: cannot find symbol
    [javac]         Name sale_3 = wb1.getNameAt(2);
    [javac]                          ^
    [javac]   symbol:   method getNameAt(int)
    [javac]   location: variable wb1 of type Workbook
    [javac] <https://builds.apache.org/job/POI-DSL-1.8/ws/src/testcases/org/apache/poi/ss/usermodel/BaseTestWorkbook.java>:692: error: cannot find symbol
    [javac]         Name sale_4 = wb1.getNameAt(3);
    [javac]                          ^
    [javac]   symbol:   method getNameAt(int)
    [javac]   location: variable wb1 of type Workbook
    [javac] <https://builds.apache.org/job/POI-DSL-1.8/ws/src/testcases/org/apache/poi/ss/usermodel/BaseTestWorkbook.java>:739: error: cannot find symbol
    [javac]         sale_2 = wb2.getNameAt(1);
    [javac]                     ^
    [javac]   symbol:   method getNameAt(int)
    [javac]   location: variable wb2 of type Workbook
    [javac] <https://builds.apache.org/job/POI-DSL-1.8/ws/src/testcases/org/apache/poi/ss/usermodel/BaseTestWorkbook.java>:740: error: cannot find symbol
    [javac]         sale_3 = wb2.getNameAt(2);
    [javac]                     ^
    [javac]   symbol:   method getNameAt(int)
    [javac]   location: variable wb2 of type Workbook
    [javac] <https://builds.apache.org/job/POI-DSL-1.8/ws/src/testcases/org/apache/poi/ss/usermodel/BaseTestWorkbook.java>:741: error: cannot find symbol
    [javac]         sale_4 = wb2.getNameAt(3);
    [javac]                     ^
    [javac]   symbol:   method getNameAt(int)
    [javac]   location: variable wb2 of type Workbook
    [javac] <https://builds.apache.org/job/POI-DSL-1.8/ws/src/testcases/org/apache/poi/hssf/util/TestAreaReference.java>:251: error: incompatible types: String cannot be converted to HSSFName
    [javac]             int idx = wb.getNameIndex("test");
    [javac]                                       ^
    [javac] <https://builds.apache.org/job/POI-DSL-1.8/ws/src/testcases/org/apache/poi/hssf/util/TestAreaReference.java>:253: error: getNameAt(int) is not public in HSSFWorkbook; cannot be accessed from outside package
    [javac]             HSSFName aNamedCell = wb.getNameAt(idx);
    [javac]                                     ^
    [javac] Note: Some input files use or override a deprecated API.
    [javac] Note: Recompile with -Xlint:deprecation for details.
    [javac] Note: Some messages have been simplified; recompile with -Xdiags:verbose to get full output
    [javac] 8 errors

BUILD FAILED
<https://builds.apache.org/job/POI-DSL-1.8/ws/build.xml>:938: Compile failed; see the compiler error output for details.

Total time: 22 seconds
Build step 'Invoke Ant' marked build as failure
Skipping publisher since build result is FAILURE
Archiving artifacts
[Fast Archiver] Compressed 3.04 MB of artifacts by 96.6% relative to #997
Skipping publisher since build result is FAILURE
Recording test results
ERROR: Step ?Publish JUnit test result report? failed: No test report files were found. Configuration error?

---------------------------------------------------------------------
To unsubscribe, e-mail: [hidden email]
For additional commands, e-mail: [hidden email]

Reply | Threaded
Open this post in threaded view
|

Build failed in Jenkins: POI-DSL-1.8 #1000

Apache Jenkins Server
See <https://builds.apache.org/job/POI-DSL-1.8/1000/display/redirect?page=changes>

Changes:

[fanningpj] try to fix test compile


------------------------------------------
[...truncated 7.20 KB...]
+ javac -version
javac 1.8.0_241
+ echo Ant-Home:
Ant-Home:
+ ls -al
total 556
drwxr-xr-x  14 jenkins jenkins   4096 Jun 26 10:28 .
drwxr-xr-x 688 jenkins jenkins  77824 Jun 27 09:16 ..
drwxr-xr-x  22 jenkins jenkins   4096 Jun 26 10:26 build
-rw-r--r--   1 jenkins jenkins  11264 May 27 12:58 build.gradle
-rw-r--r--   1 jenkins jenkins  11312 Nov 14  2019 build.gradle.mine
-rw-r--r--   1 jenkins jenkins  11321 Nov 14  2019 build.gradle.r1868671
-rw-r--r--   1 jenkins jenkins  11175 Nov 14  2019 build.gradle.r1869773
-rw-r--r--   1 jenkins jenkins    172 Jun 26 10:16 build.javacheck.xml
-rw-r--r--   1 jenkins jenkins 137785 Jun 26 01:29 build.xml
-rw-r--r--   1 jenkins jenkins   3341 Jun 11 00:58 .classpath
-rw-r--r--   1 jenkins jenkins   6160 Mar  2 00:58 doap_POI.rdf
-rw-r--r--   1 jenkins jenkins   2847 Mar  8 12:58 file-leak-detector.exclude
-rw-r--r--   1 jenkins jenkins   6229 Aug 31  2019 forrest.properties
-rw-r--r--   1 jenkins jenkins     53 Aug 31  2019 .gitattributes
-rw-r--r--   1 jenkins jenkins    493 Aug 31  2019 .gitignore
drwxr-xr-x   3 jenkins jenkins   4096 Aug 31  2019 gradle
-rwxr-xr-x   1 jenkins jenkins   5917 Nov 14  2019 gradlew
-rw-r--r--   1 jenkins jenkins   2842 Nov 14  2019 gradlew.bat
drwxr-xr-x   2 jenkins jenkins   4096 Jun 23 00:58 jenkins
-rw-r--r--   1 jenkins jenkins 166411 Aug 31  2019 KEYS
drwxr-xr-x   2 jenkins jenkins   4096 Aug 31  2019 legal
drwxr-xr-x   9 jenkins jenkins   4096 May  6 00:58 lib
drwxr-xr-x   2 jenkins jenkins   4096 Mar  9 00:58 maven
drwxr-xr-x   4 jenkins jenkins   4096 May 27 12:58 osgi
-rw-r--r--   1 jenkins jenkins   4813 Aug 31  2019 patch.xml
-rw-r--r--   1 jenkins jenkins    426 Aug 31  2019 .project
-rw-r--r--   1 jenkins jenkins   4266 Apr 25 00:58 README.rst
drwxr-xr-x   2 jenkins jenkins   4096 Aug 31  2019 .settings
-rw-r--r--   1 jenkins jenkins    556 Aug 31  2019 settings.gradle
drwxr-xr-x  11 jenkins jenkins   4096 May 27 12:58 sonar
drwxr-xr-x  16 jenkins jenkins   4096 May  6 00:58 src
drwxr-xr-x   4 jenkins jenkins   4096 Jun 27 09:53 .svn
drwxr-xr-x  14 jenkins jenkins   4096 Aug 31  2019 test-data
-rw-r--r--   1 jenkins jenkins    136 Aug 31  2019 .travis.yml
+ echo which ant
which ant
+ which ant
/usr/bin/ant
+ ant -version
Apache Ant(TM) version 1.10.5 compiled on March 28 2019
+ echo '<project default="test"><target name="test"><echo>Java ${ant.java.version}/${java.version}</echo><exec executable="javac"><arg value="-version"/></exec></target></project>'
+ ant -f build.javacheck.xml -v
Apache Ant(TM) version 1.10.5 compiled on March 28 2019
Buildfile: <https://builds.apache.org/job/POI-DSL-1.8/ws/build.javacheck.xml>
Detected Java version: 1.8 in: /usr/local/asfpackages/java/jdk1.8.0_241/jre
Detected OS: Linux
parsing buildfile <https://builds.apache.org/job/POI-DSL-1.8/ws/build.javacheck.xml> with URI = <https://builds.apache.org/job/POI-DSL-1.8/ws/build.javacheck.xml>
Project base dir set to: <https://builds.apache.org/job/POI-DSL-1.8/ws/>
Build sequence for target(s) `test' is [test]
Complete build sequence is [test, ]

test:
parsing buildfile jar:file:/usr/share/ant/lib/ant.jar!/org/apache/tools/ant/antlib.xml with URI = jar:file:/usr/share/ant/lib/ant.jar!/org/apache/tools/ant/antlib.xml from a zip file
     [echo] Java 1.8/1.8.0_241
     [exec] Current OS is Linux
     [exec] Executing 'javac' with arguments:
     [exec] '-version'
     [exec]
     [exec] The ' characters around the executable and arguments are
     [exec] not part of the command.
     [exec] javac 1.8.0_241

BUILD SUCCESSFUL
Total time: 0 seconds
+ exit 0
[POI-DSL-1.8] $ /home/jenkins/tools/ant/latest1.9/bin/ant -Dcoverage.enabled=true clean jenkins
Buildfile: <https://builds.apache.org/job/POI-DSL-1.8/ws/build.xml>

clean:
   [delete] Deleting directory <https://builds.apache.org/job/POI-DSL-1.8/ws/build>

replaceVersion:

check-jars:

fetch-jars:

check-ooxml-jars:

fetch-ooxml-jars:
      [get] Destination already exists (skipping): <https://builds.apache.org/job/POI-DSL-1.8/1000/artifact/lib/ooxml/curvesapi-1.06.jar>
      [get] Getting: https://builds.apache.org/view/P/view/POI/job/POI-XMLBeans-DSL-1.8/lastSuccessfulBuild/artifact/build/xmlbeans-4.0.0.jar
      [get] To: <https://builds.apache.org/job/POI-DSL-1.8/1000/artifact/lib/ooxml/xmlbeans-4.0.0.jar>
      [get] Destination already exists (skipping): <https://builds.apache.org/job/POI-DSL-1.8/1000/artifact/lib/ooxml/commons-compress-1.20.jar>
      [get] Destination already exists (skipping): <https://builds.apache.org/job/POI-DSL-1.8/ws/lib/ooxml-tests/reflections-0.9.11.jar>
      [get] Destination already exists (skipping): <https://builds.apache.org/job/POI-DSL-1.8/ws/lib/ooxml-tests/guava-20.0.jar>
      [get] Destination already exists (skipping): <https://builds.apache.org/job/POI-DSL-1.8/ws/lib/ooxml-tests/javassist-3.21.0-GA.jar>
      [get] Destination already exists (skipping): <https://builds.apache.org/job/POI-DSL-1.8/ws/lib/ooxml-provided/batik-all-1.12.jar>
      [get] Destination already exists (skipping): <https://builds.apache.org/job/POI-DSL-1.8/ws/lib/ooxml-provided/xml-apis-ext-1.3.04.jar>
      [get] Destination already exists (skipping): <https://builds.apache.org/job/POI-DSL-1.8/ws/lib/ooxml-provided/xmlgraphics-commons-2.3.jar>

init:
    [mkdir] Created dir: <https://builds.apache.org/job/POI-DSL-1.8/ws/build>
    [mkdir] Created dir: <https://builds.apache.org/job/POI-DSL-1.8/ws/build/classes>
    [mkdir] Created dir: <https://builds.apache.org/job/POI-DSL-1.8/ws/build/test-classes>
    [mkdir] Created dir: <https://builds.apache.org/job/POI-DSL-1.8/ws/build/test-results>
    [mkdir] Created dir: <https://builds.apache.org/job/POI-DSL-1.8/ws/build/scratchpad-classes>
    [mkdir] Created dir: <https://builds.apache.org/job/POI-DSL-1.8/ws/build/scratchpad-test-classes>
    [mkdir] Created dir: <https://builds.apache.org/job/POI-DSL-1.8/ws/build/scratchpad-test-results>
    [mkdir] Created dir: <https://builds.apache.org/job/POI-DSL-1.8/ws/build/geometry-java>
    [mkdir] Created dir: <https://builds.apache.org/job/POI-DSL-1.8/ws/build/ooxml-classes>
    [mkdir] Created dir: <https://builds.apache.org/job/POI-DSL-1.8/ws/build/ooxml-test-classes>
    [mkdir] Created dir: <https://builds.apache.org/job/POI-DSL-1.8/ws/build/ooxml-test-results>
    [mkdir] Created dir: <https://builds.apache.org/job/POI-DSL-1.8/ws/build/excelant-classes>
    [mkdir] Created dir: <https://builds.apache.org/job/POI-DSL-1.8/ws/build/excelant-test-classes>
    [mkdir] Created dir: <https://builds.apache.org/job/POI-DSL-1.8/ws/build/excelant-test-results>
    [mkdir] Created dir: <https://builds.apache.org/job/POI-DSL-1.8/ws/build/examples-classes>
    [mkdir] Created dir: <https://builds.apache.org/job/POI-DSL-1.8/ws/build/integration-test-classes>
    [mkdir] Created dir: <https://builds.apache.org/job/POI-DSL-1.8/1000/artifact/build/integration-test-results>
    [mkdir] Created dir: <https://builds.apache.org/job/POI-DSL-1.8/ws/build/dist>
    [mkdir] Created dir: <https://builds.apache.org/job/POI-DSL-1.8/ws/build/site>
     [echo] Using Ant: Apache Ant(TM) version 1.9.14 compiled on March 12 2019 from /home/jenkins/tools/ant/latest1.9, Ant detected Java 1.8 (may be different than actual Java sometimes...)
     [echo] Using Java: 1.8.0_241/1.8.0_241-b07/25.241-b07/Java HotSpot(TM) 64-Bit Server VM from Oracle Corporation on Linux: 4.15.0-74-generic
     [echo] Building Apache POI version 5.0.0-SNAPSHOT and RC: RC1

compile-main:
    [javac] Compiling 1189 source files to <https://builds.apache.org/job/POI-DSL-1.8/ws/build/classes>
    [javac] Note: Some input files use or override a deprecated API.
    [javac] Note: Recompile with -Xlint:deprecation for details.
    [javac] Note: Some input files use unchecked or unsafe operations.
    [javac] Note: Recompile with -Xlint:unchecked for details.
    [javac] Creating empty <https://builds.apache.org/job/POI-DSL-1.8/ws/build/classes/org/apache/poi/ddf/package-info.class>
    [javac] Creating empty <https://builds.apache.org/job/POI-DSL-1.8/ws/build/classes/org/apache/poi/hssf/package-info.class>
    [javac] Creating empty <https://builds.apache.org/job/POI-DSL-1.8/ws/build/classes/org/apache/poi/poifs/dev/package-info.class>
    [javac] Creating empty <https://builds.apache.org/job/POI-DSL-1.8/ws/build/classes/org/apache/poi/util/package-info.class>
    [javac] Creating empty <https://builds.apache.org/job/POI-DSL-1.8/ws/build/classes/org/apache/poi/poifs/common/package-info.class>
    [javac] Creating empty <https://builds.apache.org/job/POI-DSL-1.8/ws/build/classes/org/apache/poi/hssf/record/package-info.class>
    [javac] Creating empty <https://builds.apache.org/job/POI-DSL-1.8/ws/build/classes/org/apache/poi/poifs/package-info.class>
    [javac] Creating empty <https://builds.apache.org/job/POI-DSL-1.8/ws/build/classes/org/apache/poi/poifs/crypt/package-info.class>
    [javac] Creating empty <https://builds.apache.org/job/POI-DSL-1.8/ws/build/classes/org/apache/poi/hpsf/wellknown/package-info.class>
    [javac] Creating empty <https://builds.apache.org/job/POI-DSL-1.8/ws/build/classes/org/apache/poi/hssf/dev/package-info.class>
    [javac] Creating empty <https://builds.apache.org/job/POI-DSL-1.8/ws/build/classes/org/apache/poi/ss/formula/package-info.class>
    [javac] Creating empty <https://builds.apache.org/job/POI-DSL-1.8/ws/build/classes/org/apache/poi/hpsf/package-info.class>
    [javac] Creating empty <https://builds.apache.org/job/POI-DSL-1.8/ws/build/classes/org/apache/poi/poifs/property/package-info.class>
    [javac] Creating empty <https://builds.apache.org/job/POI-DSL-1.8/ws/build/classes/org/apache/poi/poifs/filesystem/package-info.class>
    [javac] Creating empty <https://builds.apache.org/job/POI-DSL-1.8/ws/build/classes/org/apache/poi/ss/formula/ptg/package-info.class>
    [javac] Creating empty <https://builds.apache.org/job/POI-DSL-1.8/ws/build/classes/org/apache/poi/poifs/storage/package-info.class>
    [javac] Creating empty <https://builds.apache.org/job/POI-DSL-1.8/ws/build/classes/org/apache/poi/hssf/eventusermodel/package-info.class>
    [javac] Creating empty <https://builds.apache.org/job/POI-DSL-1.8/ws/build/classes/org/apache/poi/hssf/record/aggregates/package-info.class>
    [javac] Creating empty <https://builds.apache.org/job/POI-DSL-1.8/ws/build/classes/org/apache/poi/ss/format/package-info.class>
    [javac] Creating empty <https://builds.apache.org/job/POI-DSL-1.8/ws/build/classes/org/apache/poi/hssf/model/package-info.class>
    [javac] Creating empty <https://builds.apache.org/job/POI-DSL-1.8/ws/build/classes/org/apache/poi/hssf/usermodel/package-info.class>
    [javac] Creating empty <https://builds.apache.org/job/POI-DSL-1.8/ws/build/classes/org/apache/poi/hssf/util/package-info.class>
    [javac] Creating empty <https://builds.apache.org/job/POI-DSL-1.8/ws/build/classes/org/apache/poi/poifs/eventfilesystem/package-info.class>
    [javac] Compiling 548 source files to <https://builds.apache.org/job/POI-DSL-1.8/ws/build/test-classes>
    [javac] Note: Some input files use or override a deprecated API.
    [javac] Note: Recompile with -Xlint:deprecation for details.
     [copy] Copying 5 files to <https://builds.apache.org/job/POI-DSL-1.8/ws/build/classes>
    [mkdir] Created dir: <https://builds.apache.org/job/POI-DSL-1.8/ws/build/classes/META-INF/versions/9>

compile-scratchpad:
    [javac] Compiling 513 source files to <https://builds.apache.org/job/POI-DSL-1.8/ws/build/scratchpad-classes>
    [javac] Note: Some input files use or override a deprecated API.
    [javac] Note: Recompile with -Xlint:deprecation for details.
    [javac] Note: Some input files use unchecked or unsafe operations.
    [javac] Note: Recompile with -Xlint:unchecked for details.
    [javac] Compiling 204 source files to <https://builds.apache.org/job/POI-DSL-1.8/ws/build/scratchpad-test-classes>
    [javac] Note: Some input files use or override a deprecated API.
    [javac] Note: Recompile with -Xlint:deprecation for details.
    [javac] Note: <https://builds.apache.org/job/POI-DSL-1.8/ws/src/scratchpad/testcases/org/apache/poi/hslf/usermodel/TestBugs.java> uses unchecked or unsafe operations.
    [javac] Note: Recompile with -Xlint:unchecked for details.
     [copy] Copying 2 files to <https://builds.apache.org/job/POI-DSL-1.8/ws/build/scratchpad-classes>

check-compiled-ooxml-xsds:

compile-ooxml-xsds:
    [mkdir] Created dir: <https://builds.apache.org/job/POI-DSL-1.8/ws/build/xmlbean-xsds>
    [mkdir] Created dir: <https://builds.apache.org/job/POI-DSL-1.8/ws/build/xmlbean-sources>
    [mkdir] Created dir: <https://builds.apache.org/job/POI-DSL-1.8/ws/build/xmlbean-classes>
     [copy] Copying 3 files to <https://builds.apache.org/job/POI-DSL-1.8/ws/build/xmlbean-xsds>
     [copy] Copying 87 resources to <https://builds.apache.org/job/POI-DSL-1.8/ws/build/xmlbean-xsds>
  [xmlbean] SchemaCompiler  Metadata LOAD:org/apache/xmlbeans/metadata GEN:org/apache/poi/schemas/ooxml
  [xmlbean] Time to build schema type system: 2.054 seconds
  [xmlbean] Time to generate code: 5.186 seconds
     [echo] Forking javac with max heap size 1536m
    [javac] Compiling 4576 source files to <https://builds.apache.org/job/POI-DSL-1.8/ws/build/xmlbean-classes>
    [mkdir] Created dir: <https://builds.apache.org/job/POI-DSL-1.8/ws/build/xmlbean-classes/META-INF/versions/9>
      [jar] Building jar: <https://builds.apache.org/job/POI-DSL-1.8/1000/artifact/lib/ooxml/ooxml-schemas-1.4.jar>
      [jar] Building jar: <https://builds.apache.org/job/POI-DSL-1.8/1000/artifact/lib/ooxml/ooxml-schemas-1.4-sources.jar>
   [delete] Deleting directory <https://builds.apache.org/job/POI-DSL-1.8/ws/build/xmlbean-xsds>
   [delete] Deleting directory <https://builds.apache.org/job/POI-DSL-1.8/ws/build/xmlbean-sources>
   [delete] Deleting directory <https://builds.apache.org/job/POI-DSL-1.8/ws/build/xmlbean-classes>
    [mkdir] Created dir: <https://builds.apache.org/job/POI-DSL-1.8/ws/build/xmlbean-xsds>
    [mkdir] Created dir: <https://builds.apache.org/job/POI-DSL-1.8/ws/build/xmlbean-sources>
    [mkdir] Created dir: <https://builds.apache.org/job/POI-DSL-1.8/ws/build/xmlbean-classes>
     [copy] Copying 11 files to <https://builds.apache.org/job/POI-DSL-1.8/ws/build/xmlbean-xsds>
     [copy] Copying 2 resources to <https://builds.apache.org/job/POI-DSL-1.8/ws/build/xmlbean-xsds>
  [xmlbean] SchemaCompiler  Metadata LOAD:org/apache/xmlbeans/metadata GEN:org/apache/poi/schemas/security
  [xmlbean] Time to build schema type system: 0.658 seconds
  [xmlbean] Time to generate code: 0.387 seconds
     [echo] Forking javac with max heap size 1536m
    [javac] Compiling 372 source files to <https://builds.apache.org/job/POI-DSL-1.8/ws/build/xmlbean-classes>
    [mkdir] Created dir: <https://builds.apache.org/job/POI-DSL-1.8/ws/build/xmlbean-classes/META-INF/versions/9>
      [jar] Building jar: <https://builds.apache.org/job/POI-DSL-1.8/1000/artifact/lib/ooxml/ooxml-security-1.1.jar>
      [jar] Building jar: <https://builds.apache.org/job/POI-DSL-1.8/1000/artifact/lib/ooxml/ooxml-security-1.1-sources.jar>
   [delete] Deleting directory <https://builds.apache.org/job/POI-DSL-1.8/ws/build/xmlbean-xsds>
   [delete] Deleting directory <https://builds.apache.org/job/POI-DSL-1.8/ws/build/xmlbean-sources>
   [delete] Deleting directory <https://builds.apache.org/job/POI-DSL-1.8/ws/build/xmlbean-classes>

compile-ooxml:
    [javac] Compiling 627 source files to <https://builds.apache.org/job/POI-DSL-1.8/ws/build/ooxml-classes>
    [javac] <https://builds.apache.org/job/POI-DSL-1.8/ws/src/ooxml/java/org/apache/poi/xssf/usermodel/BaseXSSFEvaluationWorkbook.java>:171: error: cannot find symbol
    [javac]             XSSFName nm = _uBook.getNameAt(i);
    [javac]                                 ^
    [javac]   symbol:   method getNameAt(int)
    [javac]   location: variable _uBook of type XSSFWorkbook
    [javac] <https://builds.apache.org/job/POI-DSL-1.8/ws/src/ooxml/java/org/apache/poi/xssf/usermodel/BaseXSSFEvaluationWorkbook.java>:215: error: cannot find symbol
    [javac]             int nameIdx = _uBook.getNameIndex(nameName);
    [javac]                                 ^
    [javac]   symbol:   method getNameIndex(String)
    [javac]   location: variable _uBook of type XSSFWorkbook
    [javac] <https://builds.apache.org/job/POI-DSL-1.8/ws/src/ooxml/java/org/apache/poi/xssf/usermodel/BaseXSSFEvaluationWorkbook.java>:286: error: cannot find symbol
    [javac]         XSSFName xname = _uBook.getNameAt(idx);
    [javac]                                ^
    [javac]   symbol:   method getNameAt(int)
    [javac]   location: variable _uBook of type XSSFWorkbook
    [javac] <https://builds.apache.org/job/POI-DSL-1.8/ws/src/ooxml/java/org/apache/poi/xssf/usermodel/BaseXSSFEvaluationWorkbook.java>:340: error: cannot find symbol
    [javac]         return _uBook.getNameAt(namePtg.getIndex()).getNameName();
    [javac]                      ^
    [javac]   symbol:   method getNameAt(int)
    [javac]   location: variable _uBook of type XSSFWorkbook
    [javac] <https://builds.apache.org/job/POI-DSL-1.8/ws/src/ooxml/java/org/apache/poi/xssf/usermodel/BaseXSSFEvaluationWorkbook.java>:345: error: cannot find symbol
    [javac]         return new Name(_uBook.getNameAt(ix), ix, this);
    [javac]                               ^
    [javac]   symbol:   method getNameAt(int)
    [javac]   location: variable _uBook of type XSSFWorkbook
    [javac] Note: Some input files use or override a deprecated API.
    [javac] Note: Recompile with -Xlint:deprecation for details.
    [javac] Note: <https://builds.apache.org/job/POI-DSL-1.8/ws/src/ooxml/java/org/apache/poi/xslf/draw/SVGImageRenderer.java> uses unchecked or unsafe operations.
    [javac] Note: Recompile with -Xlint:unchecked for details.
    [javac] 5 errors

BUILD FAILED
<https://builds.apache.org/job/POI-DSL-1.8/ws/build.xml>:1027: Compile failed; see the compiler error output for details.

Total time: 1 minute 55 seconds
Build step 'Invoke Ant' marked build as failure
Skipping publisher since build result is FAILURE
Archiving artifacts
[Fast Archiver] Compressed 26.05 MB of artifacts by 11.4% relative to #997
Skipping publisher since build result is FAILURE
Recording test results
ERROR: Step ?Publish JUnit test result report? failed: No test report files were found. Configuration error?

---------------------------------------------------------------------
To unsubscribe, e-mail: [hidden email]
For additional commands, e-mail: [hidden email]

Reply | Threaded
Open this post in threaded view
|

Jenkins build is back to normal : POI-DSL-1.8 #1001

Apache Jenkins Server
See <https://builds.apache.org/job/POI-DSL-1.8/1001/display/redirect?page=changes>


---------------------------------------------------------------------
To unsubscribe, e-mail: [hidden email]
For additional commands, e-mail: [hidden email]