Build failed in Jenkins: POI-DSL-1.8 #987

classic Classic list List threaded Threaded
1 message Options
Reply | Threaded
Open this post in threaded view
|

Build failed in Jenkins: POI-DSL-1.8 #987

Apache Jenkins Server
See <https://builds.apache.org/job/POI-DSL-1.8/987/display/redirect?page=changes>

Changes:

[kiwiwings] #64411 - Provide JigSaw modules - use XmlBeans 4.0.0 (preview)

[kiwiwings] limit xmlbeans archived files

[kiwiwings] try to fix windows failures


------------------------------------------
[...truncated 105.20 KB...]
    [junit] Tests run: 6, Failures: 0, Errors: 0, Skipped: 0, Time elapsed: 0.002 sec
    [junit] Running org.apache.poi.hslf.record.TestInteractiveInfo
    [junit] Tests run: 4, Failures: 0, Errors: 0, Skipped: 0, Time elapsed: 0.002 sec
    [junit] Running org.apache.poi.hslf.record.TestInteractiveInfoAtom
    [junit] Tests run: 6, Failures: 0, Errors: 0, Skipped: 0, Time elapsed: 0.002 sec
    [junit] Running org.apache.poi.hslf.record.TestNotesAtom
    [junit] Tests run: 3, Failures: 0, Errors: 0, Skipped: 0, Time elapsed: 0.002 sec
    [junit] Running org.apache.poi.hslf.record.TestRecordContainer
    [junit] Tests run: 5, Failures: 0, Errors: 0, Skipped: 0, Time elapsed: 0.005 sec
    [junit] Running org.apache.poi.hslf.record.TestRecordTypes
    [junit] Tests run: 3, Failures: 0, Errors: 0, Skipped: 0, Time elapsed: 0.002 sec
    [junit] Running org.apache.poi.hslf.record.TestSlideAtom
    [junit] Tests run: 5, Failures: 0, Errors: 0, Skipped: 0, Time elapsed: 0.006 sec
    [junit] Running org.apache.poi.hslf.record.TestSlidePersistAtom
    [junit] Tests run: 3, Failures: 0, Errors: 0, Skipped: 0, Time elapsed: 0.002 sec
    [junit] Running org.apache.poi.hslf.record.TestSound
    [junit] Tests run: 1, Failures: 0, Errors: 0, Skipped: 0, Time elapsed: 0.003 sec
    [junit] Running org.apache.poi.hslf.record.TestStyleTextPropAtom
    [junit] Tests run: 20, Failures: 0, Errors: 0, Skipped: 0, Time elapsed: 0.015 sec
    [junit] Running org.apache.poi.hslf.record.TestTextBytesAtom
    [junit] Tests run: 5, Failures: 0, Errors: 0, Skipped: 0, Time elapsed: 0.002 sec
    [junit] Running org.apache.poi.hslf.record.TestTextCharsAtom
    [junit] Tests run: 6, Failures: 0, Errors: 0, Skipped: 0, Time elapsed: 0.002 sec
    [junit] Running org.apache.poi.hslf.record.TestTextHeaderAtom
    [junit] Tests run: 3, Failures: 0, Errors: 0, Skipped: 0, Time elapsed: 0.001 sec
    [junit] Running org.apache.poi.hslf.record.TestTextRulerAtom
    [junit] Tests run: 3, Failures: 0, Errors: 0, Skipped: 0, Time elapsed: 0.001 sec
    [junit] Running org.apache.poi.hslf.record.TestTextSpecInfoAtom
    [junit] Tests run: 3, Failures: 0, Errors: 0, Skipped: 0, Time elapsed: 0.003 sec
    [junit] Running org.apache.poi.hslf.record.TestTxInteractiveInfoAtom
    [junit] Tests run: 4, Failures: 0, Errors: 0, Skipped: 0, Time elapsed: 0.002 sec
    [junit] Running org.apache.poi.hslf.record.TestTxMasterStyleAtom
    [junit] Tests run: 1, Failures: 0, Errors: 0, Skipped: 0, Time elapsed: 0.003 sec
    [junit] Running org.apache.poi.hslf.record.TestUserEditAtom
    [junit] Tests run: 3, Failures: 0, Errors: 0, Skipped: 0, Time elapsed: 0.003 sec
    [junit] Running org.apache.poi.hslf.usermodel.TestAddingSlides
    [junit] Tests run: 5, Failures: 0, Errors: 0, Skipped: 0, Time elapsed: 0.036 sec
    [junit] Running org.apache.poi.hslf.usermodel.TestBackground
    [junit] Tests run: 3, Failures: 0, Errors: 0, Skipped: 0, Time elapsed: 0.012 sec
    [junit] Running org.apache.poi.hslf.usermodel.TestBugs
    [junit] Tests run: 41, Failures: 0, Errors: 0, Skipped: 0, Time elapsed: 0.815 sec
    [junit] Running org.apache.poi.hslf.usermodel.TestCounts
    [junit] Tests run: 2, Failures: 0, Errors: 0, Skipped: 0, Time elapsed: 0.004 sec
    [junit] Running org.apache.poi.hslf.usermodel.TestFontRendering
    [junit] Tests run: 1, Failures: 0, Errors: 0, Skipped: 1, Time elapsed: 0.005 sec
    [junit] Running org.apache.poi.hslf.usermodel.TestHSLFSlideShow
    [junit] Tests run: 8, Failures: 0, Errors: 0, Skipped: 0, Time elapsed: 0.035 sec
    [junit] Running org.apache.poi.hslf.usermodel.TestHSLFSlideShowFactory
    [junit] Tests run: 1, Failures: 0, Errors: 0, Skipped: 0, Time elapsed: 0.011 sec
    [junit] Running org.apache.poi.hslf.usermodel.TestMostRecentRecords
    [junit] Tests run: 3, Failures: 0, Errors: 0, Skipped: 0, Time elapsed: 0.004 sec
    [junit] Running org.apache.poi.hslf.usermodel.TestNotesText
    [junit] Tests run: 2, Failures: 0, Errors: 0, Skipped: 0, Time elapsed: 0.004 sec
    [junit] Running org.apache.poi.hslf.usermodel.TestNumberedList
    [junit] Tests run: 1, Failures: 0, Errors: 0, Skipped: 0, Time elapsed: 0.005 sec
    [junit] Running org.apache.poi.hslf.usermodel.TestNumberedList2
    [junit] Tests run: 1, Failures: 0, Errors: 0, Skipped: 0, Time elapsed: 0.004 sec
    [junit] Running org.apache.poi.hslf.usermodel.TestNumberedList3
    [junit] Tests run: 1, Failures: 0, Errors: 0, Skipped: 0, Time elapsed: 0.004 sec
    [junit] Running org.apache.poi.hslf.usermodel.TestPicture
    [junit] Tests run: 4, Failures: 0, Errors: 0, Skipped: 1, Time elapsed: 0.055 sec
    [junit] Running org.apache.poi.hslf.usermodel.TestPictures
    [junit] Tests run: 11, Failures: 0, Errors: 0, Skipped: 1, Time elapsed: 0.06 sec
    [junit] Running org.apache.poi.hslf.usermodel.TestReOrderingSlides
    [junit] Tests run: 5, Failures: 0, Errors: 0, Skipped: 0, Time elapsed: 0.042 sec
    [junit] Running org.apache.poi.hslf.usermodel.TestRecordSetup
    [junit] Tests run: 1, Failures: 0, Errors: 0, Skipped: 0, Time elapsed: 0.003 sec
    [junit] Running org.apache.poi.hslf.usermodel.TestRichTextRun
    [junit] Tests run: 11, Failures: 0, Errors: 0, Skipped: 0, Time elapsed: 0.164 sec
    [junit] Running org.apache.poi.hslf.usermodel.TestSheetText
    [junit] Tests run: 1, Failures: 0, Errors: 0, Skipped: 0, Time elapsed: 0.002 sec
    [junit] Running org.apache.poi.hslf.usermodel.TestSlideOrdering
    [junit] Tests run: 3, Failures: 0, Errors: 0, Skipped: 0, Time elapsed: 0.011 sec
    [junit] Running org.apache.poi.hslf.usermodel.TestSoundData
    [junit] Tests run: 1, Failures: 0, Errors: 0, Skipped: 0, Time elapsed: 0.003 sec
    [junit] Running org.apache.poi.hslf.usermodel.TestTable
    [junit] Tests run: 3, Failures: 0, Errors: 0, Skipped: 0, Time elapsed: 0.02 sec
    [junit] Running org.apache.poi.hslf.usermodel.TestTextRun
    [junit] Tests run: 14, Failures: 0, Errors: 0, Skipped: 0, Time elapsed: 0.036 sec
    [junit] Running org.apache.poi.hslf.usermodel.TestTextShape
    [junit] Tests run: 6, Failures: 0, Errors: 0, Skipped: 0, Time elapsed: 0.013 sec
    [junit] Running org.apache.poi.hslf.util.TestSystemTimeUtils
    [junit] Tests run: 4, Failures: 0, Errors: 0, Skipped: 0, Time elapsed: 0.002 sec
    [junit] Running org.apache.poi.hsmf.Test7BitCodepage
    [junit] Tests run: 1, Failures: 0, Errors: 0, Skipped: 0, Time elapsed: 0.099 sec
    [junit] Running org.apache.poi.hsmf.TestBasics
    [junit] Tests run: 9, Failures: 0, Errors: 0, Skipped: 0, Time elapsed: 0.231 sec
    [junit] Running org.apache.poi.hsmf.TestBlankFileRead
    [junit] Tests run: 7, Failures: 0, Errors: 0, Skipped: 0, Time elapsed: 0.013 sec
    [junit] Running org.apache.poi.hsmf.TestExtractEmbeddedMSG
    [junit] Tests run: 1, Failures: 0, Errors: 0, Skipped: 0, Time elapsed: 0.013 sec
    [junit] Running org.apache.poi.hsmf.TestFileWithAttachmentsRead
    [junit] Tests run: 4, Failures: 0, Errors: 0, Skipped: 0, Time elapsed: 0.016 sec
    [junit] Running org.apache.poi.hsmf.TestFixedSizedProperties
    [junit] Tests run: 8, Failures: 0, Errors: 0, Skipped: 0, Time elapsed: 0.102 sec
    [junit] Running org.apache.poi.hsmf.TestMessageSubmissionChunk
    [junit] Tests run: 2, Failures: 0, Errors: 0, Skipped: 0, Time elapsed: 0.007 sec
    [junit] Running org.apache.poi.hsmf.TestMessageSubmissionChunkY2KRead
    [junit] Tests run: 3, Failures: 0, Errors: 0, Skipped: 0, Time elapsed: 0.026 sec
    [junit] Running org.apache.poi.hsmf.TestNameIdChunks
    [junit] Tests run: 2, Failures: 0, Errors: 0, Skipped: 0, Time elapsed: 0.026 sec
    [junit] Running org.apache.poi.hsmf.TestOutlook30FileRead
    [junit] Tests run: 9, Failures: 0, Errors: 0, Skipped: 0, Time elapsed: 0.057 sec
    [junit] Running org.apache.poi.hsmf.TestSimpleFileRead
    [junit] Tests run: 9, Failures: 0, Errors: 0, Skipped: 0, Time elapsed: 0.032 sec
    [junit] Running org.apache.poi.hsmf.datatypes.TestChunkData
    [junit] Tests run: 6, Failures: 0, Errors: 0, Skipped: 0, Time elapsed: 0.003 sec
    [junit] Running org.apache.poi.hsmf.datatypes.TestMAPIProperty
    [junit] Tests run: 3, Failures: 0, Errors: 0, Skipped: 0, Time elapsed: 0.002 sec
    [junit] Running org.apache.poi.hsmf.datatypes.TestSorters
    [junit] Tests run: 2, Failures: 0, Errors: 0, Skipped: 0, Time elapsed: 0.001 sec
    [junit] Running org.apache.poi.hsmf.datatypes.TestTypes
    [junit] Tests run: 3, Failures: 0, Errors: 0, Skipped: 0, Time elapsed: 0.002 sec
    [junit] Running org.apache.poi.hsmf.extractor.TestOutlookTextExtractor
    [junit] Tests run: 9, Failures: 0, Errors: 0, Skipped: 0, Time elapsed: 0.169 sec
    [junit] Running org.apache.poi.hsmf.parsers.TestPOIFSChunkParser
    [junit] Tests run: 6, Failures: 0, Errors: 0, Skipped: 0, Time elapsed: 0.083 sec
    [junit] Running org.apache.poi.hssf.converter.TestExcelConverterSuite
    [junit] Tests run: 778, Failures: 0, Errors: 0, Skipped: 0, Time elapsed: 14.249 sec
    [junit] Running org.apache.poi.hssf.usermodel.TestHSSFChart
    [junit] Tests run: 7, Failures: 0, Errors: 0, Skipped: 0, Time elapsed: 0.087 sec
    [junit] Running org.apache.poi.hwmf.TestHwmfParsing
    [junit] Tests run: 5, Failures: 0, Errors: 0, Skipped: 1, Time elapsed: 0.034 sec
    [junit] Running org.apache.poi.hwpf.TestFieldsTables
    [junit] Tests run: 1, Failures: 0, Errors: 0, Skipped: 0, Time elapsed: 0.02 sec
    [junit] Running org.apache.poi.hwpf.TestHWPFPictures
    [junit] Tests run: 6, Failures: 0, Errors: 0, Skipped: 0, Time elapsed: 0.152 sec
    [junit] Running org.apache.poi.hwpf.TestHWPFRangeParts
    [junit] Tests run: 2, Failures: 0, Errors: 0, Skipped: 0, Time elapsed: 0.024 sec
    [junit] Running org.apache.poi.hwpf.converter.TestNumberFormatter
    [junit] Tests run: 2, Failures: 0, Errors: 0, Skipped: 0, Time elapsed: 0.099 sec
    [junit] Running org.apache.poi.hwpf.converter.TestWordToConverterSuite
    [junit] Tests run: 411, Failures: 0, Errors: 0, Skipped: 0, Time elapsed: 5.103 sec
    [junit] Running org.apache.poi.hwpf.converter.TestWordToFoConverter
    [junit] Tests run: 8, Failures: 0, Errors: 0, Skipped: 0, Time elapsed: 0.012 sec
    [junit] Running org.apache.poi.hwpf.converter.TestWordToHtmlConverter
    [junit] Tests run: 21, Failures: 0, Errors: 0, Skipped: 0, Time elapsed: 0.116 sec
    [junit] Running org.apache.poi.hwpf.converter.TestWordToTextConverter
    [junit] Tests run: 3, Failures: 0, Errors: 0, Skipped: 0, Time elapsed: 0.056 sec
    [junit] Running org.apache.poi.hwpf.dev.TestHWPFLister
    [junit] Tests run: 2, Failures: 0, Errors: 0, Skipped: 0, Time elapsed: 0.028 sec
    [junit] Running org.apache.poi.hwpf.extractor.TestDifferentRoutes
    [junit] Tests run: 2, Failures: 0, Errors: 0, Skipped: 0, Time elapsed: 0.003 sec
    [junit] Running org.apache.poi.hwpf.extractor.TestWordExtractor
    [junit] Tests run: 18, Failures: 0, Errors: 0, Skipped: 0, Time elapsed: 0.06 sec
    [junit] Running org.apache.poi.hwpf.extractor.TestWordExtractorBugs
    [junit] Tests run: 3, Failures: 0, Errors: 0, Skipped: 0, Time elapsed: 0.164 sec
    [junit] Running org.apache.poi.hwpf.model.TestBookmarksTables
    [junit] Tests run: 5, Failures: 0, Errors: 0, Skipped: 0, Time elapsed: 0.005 sec
    [junit] Running org.apache.poi.hwpf.model.TestCHPBinTable
    [junit] Tests run: 1, Failures: 0, Errors: 0, Skipped: 0, Time elapsed: 0.001 sec
    [junit] Running org.apache.poi.hwpf.model.TestDocumentProperties
    [junit] Tests run: 1, Failures: 0, Errors: 0, Skipped: 0, Time elapsed: 0.006 sec
    [junit] Running org.apache.poi.hwpf.model.TestFileInformationBlock
    [junit] Tests run: 1, Failures: 0, Errors: 0, Skipped: 0, Time elapsed: 0.002 sec
    [junit] Running org.apache.poi.hwpf.model.TestFontTable
    [junit] Tests run: 1, Failures: 0, Errors: 0, Skipped: 0, Time elapsed: 0.002 sec
    [junit] Running org.apache.poi.hwpf.model.TestListTables
    [junit] Tests run: 1, Failures: 0, Errors: 0, Skipped: 0, Time elapsed: 0.001 sec
    [junit] Running org.apache.poi.hwpf.model.TestNotesTables
    [junit] Tests run: 1, Failures: 0, Errors: 0, Skipped: 0, Time elapsed: 0.001 sec
    [junit] Running org.apache.poi.hwpf.model.TestPAPBinTable
    [junit] Tests run: 2, Failures: 0, Errors: 0, Skipped: 0, Time elapsed: 0.008 sec
    [junit] Running org.apache.poi.hwpf.model.TestPlexOfCps
    [junit] Tests run: 1, Failures: 0, Errors: 0, Skipped: 0, Time elapsed: 0.001 sec
    [junit] Running org.apache.poi.hwpf.model.TestRevisionMarkAuthorTable
    [junit] Tests run: 3, Failures: 0, Errors: 0, Skipped: 0, Time elapsed: 0.004 sec
    [junit] Running org.apache.poi.hwpf.model.TestSavedByTable
    [junit] Tests run: 1, Failures: 0, Errors: 0, Skipped: 0, Time elapsed: 0.021 sec
    [junit] Running org.apache.poi.hwpf.model.TestSectionTable
    [junit] Tests run: 1, Failures: 0, Errors: 0, Skipped: 0, Time elapsed: 0.001 sec
    [junit] Running org.apache.poi.hwpf.model.TestStyleSheet
    [junit] Tests run: 2, Failures: 0, Errors: 0, Skipped: 0, Time elapsed: 0.002 sec
    [junit] Running org.apache.poi.hwpf.model.TestTextPieceTable
    [junit] Tests run: 4, Failures: 0, Errors: 0, Skipped: 0, Time elapsed: 0.008 sec
    [junit] Running org.apache.poi.hwpf.sprm.TestSprms
    [junit] Tests run: 2, Failures: 0, Errors: 0, Skipped: 0, Time elapsed: 0.005 sec
    [junit] Running org.apache.poi.hwpf.usermodel.TestBorderCode
    [junit] Tests run: 1, Failures: 0, Errors: 0, Skipped: 0, Time elapsed: 0.002 sec
    [junit] Running org.apache.poi.hwpf.usermodel.TestBug46610
    [junit] Tests run: 3, Failures: 0, Errors: 0, Skipped: 0, Time elapsed: 0.006 sec
    [junit] Running org.apache.poi.hwpf.usermodel.TestBug47563
    [junit] Tests run: 8, Failures: 0, Errors: 0, Skipped: 0, Time elapsed: 0.026 sec
    [junit] Running org.apache.poi.hwpf.usermodel.TestBug49820
    [junit] Tests run: 1, Failures: 0, Errors: 0, Skipped: 0, Time elapsed: 0.002 sec
    [junit] Running org.apache.poi.hwpf.usermodel.TestBug50075
    [junit] Tests run: 1, Failures: 0, Errors: 0, Skipped: 0, Time elapsed: 0.002 sec
    [junit] Running org.apache.poi.hwpf.usermodel.TestBugs
    [junit] Tests run: 41, Failures: 0, Errors: 0, Skipped: 0, Time elapsed: 0.441 sec
    [junit] Running org.apache.poi.hwpf.usermodel.TestHWPFOldDocument
    [junit] Tests run: 14, Failures: 0, Errors: 0, Skipped: 0, Time elapsed: 0.105 sec
    [junit] Running org.apache.poi.hwpf.usermodel.TestHWPFWrite
    [junit] Tests run: 5, Failures: 0, Errors: 0, Skipped: 0, Time elapsed: 0.029 sec
    [junit] Running org.apache.poi.hwpf.usermodel.TestHeaderStories
    [junit] Tests run: 8, Failures: 0, Errors: 0, Skipped: 0, Time elapsed: 0.032 sec
    [junit] Running org.apache.poi.hwpf.usermodel.TestLists
    [junit] Tests run: 7, Failures: 0, Errors: 0, Skipped: 0, Time elapsed: 0.01 sec
    [junit] Running org.apache.poi.hwpf.usermodel.TestOfficeDrawings
    [junit] Tests run: 1, Failures: 0, Errors: 0, Skipped: 0, Time elapsed: 0.002 sec
    [junit] Running org.apache.poi.hwpf.usermodel.TestPictures
    [junit] Tests run: 16, Failures: 0, Errors: 0, Skipped: 2, Time elapsed: 0.037 sec
    [junit] Running org.apache.poi.hwpf.usermodel.TestProblems
    [junit] Tests run: 10, Failures: 0, Errors: 0, Skipped: 0, Time elapsed: 0.017 sec
    [junit] Running org.apache.poi.hwpf.usermodel.TestRange
    [junit] Tests run: 2, Failures: 0, Errors: 0, Skipped: 0, Time elapsed: 0.002 sec
    [junit] Running org.apache.poi.hwpf.usermodel.TestRangeDelete
    [junit] Tests run: 4, Failures: 0, Errors: 0, Skipped: 0, Time elapsed: 0.004 sec
    [junit] Running org.apache.poi.hwpf.usermodel.TestRangeInsertion
    [junit] Tests run: 3, Failures: 0, Errors: 0, Skipped: 0, Time elapsed: 0.003 sec
    [junit] Running org.apache.poi.hwpf.usermodel.TestRangeProperties
    [junit] Tests run: 5, Failures: 0, Errors: 0, Skipped: 0, Time elapsed: 0.021 sec
    [junit] Running org.apache.poi.hwpf.usermodel.TestRangeReplacement
    [junit] Tests run: 3, Failures: 0, Errors: 0, Skipped: 0, Time elapsed: 0.003 sec
    [junit] Running org.apache.poi.hwpf.usermodel.TestRangeSymbols
    [junit] Tests run: 2, Failures: 0, Errors: 0, Skipped: 0, Time elapsed: 0.002 sec
    [junit] Running org.apache.poi.hwpf.usermodel.TestTableRow
    [junit] Tests run: 2, Failures: 0, Errors: 0, Skipped: 0, Time elapsed: 0.002 sec

-test-scratchpad-write-testfile:

-test-ooxml-check:

-ooxml-lite-agent:
      [jar] Building jar: <https://builds.apache.org/job/POI-DSL-1.8/ws/build/ooxml-lite-agent.jar>

test-ooxml:
[jacoco:coverage] Enhancing junit with coverage
    [junit] Running org.apache.poi.TestDetectAsOOXML
    [junit] Tests run: 3, Failures: 0, Errors: 0, Skipped: 0, Time elapsed: 0.505 sec
    [junit] Running org.apache.poi.TestEmbedded
    [junit] Tests run: 3, Failures: 0, Errors: 0, Skipped: 0, Time elapsed: 1.877 sec
    [junit] Running org.apache.poi.TestXMLPropertiesTextExtractor
    [junit] Tests run: 5, Failures: 0, Errors: 0, Skipped: 0, Time elapsed: 0.329 sec
    [junit] Running org.apache.poi.extractor.ooxml.TestExtractorFactory
    [junit] Tests run: 15, Failures: 0, Errors: 0, Skipped: 0, Time elapsed: 2.873 sec
    [junit] Running org.apache.poi.ooxml.TestPOIXMLDocument
    [junit] Tests run: 11, Failures: 1, Errors: 0, Skipped: 0, Time elapsed: 1.994 sec

BUILD FAILED
<https://builds.apache.org/job/POI-DSL-1.8/ws/build.xml>:1499: The following error occurred while executing this line:
<https://builds.apache.org/job/POI-DSL-1.8/ws/build.xml>:1465: The following error occurred while executing this line:
<https://builds.apache.org/job/POI-DSL-1.8/ws/build.xml>:1095: Tests failed

Total time: 6 minutes 30 seconds
Build step 'Invoke Ant' marked build as failure
Skipping publisher since build result is FAILURE
Archiving artifacts
Skipping publisher since build result is FAILURE
Recording test results

---------------------------------------------------------------------
To unsubscribe, e-mail: [hidden email]
For additional commands, e-mail: [hidden email]