Build failed in Jenkins: POI-DSL-1.8 #868

classic Classic list List threaded Threaded
3 messages Options
Reply | Threaded
Open this post in threaded view
|

Build failed in Jenkins: POI-DSL-1.8 #868

Apache Jenkins Server
See <https://builds.apache.org/job/POI-DSL-1.8/868/display/redirect>

Changes:


------------------------------------------
Started by user fanningpj
Running as SYSTEM
[EnvInject] - Loading node environment variables.
[EnvInject] - Preparing an environment for the build.
[EnvInject] - Keeping Jenkins system variables.
[EnvInject] - Keeping Jenkins build variables.
[EnvInject] - Injecting as environment variables the properties content
LANG=en_US.UTF-8
FORREST_HOME=/home/jenkins/tools/forrest/latest

[EnvInject] - Variables injected successfully.
[EnvInject] - Injecting contributions.
Building remotely on H25 (ubuntu) in workspace <https://builds.apache.org/job/POI-DSL-1.8/ws/>
[WS-CLEANUP] Deleting project workspace...
[WS-CLEANUP] Done
Also:   hudson.remoting.Channel$CallSiteStackTrace: Remote call to H25
                at hudson.remoting.Channel.attachCallSiteStackTrace(Channel.java:1743)
                at hudson.remoting.UserRequest$ExceptionResponse.retrieve(UserRequest.java:357)
                at hudson.remoting.Channel.call(Channel.java:957)
                at hudson.FilePath.act(FilePath.java:1072)
                at hudson.FilePath.act(FilePath.java:1061)
                at hudson.scm.SubversionSCM.checkout(SubversionSCM.java:937)
                at hudson.scm.SubversionSCM.checkout(SubversionSCM.java:864)
                at hudson.scm.SCM.checkout(SCM.java:504)
                at hudson.model.AbstractProject.checkout(AbstractProject.java:1208)
                at hudson.model.AbstractBuild$AbstractBuildExecution.defaultCheckout(AbstractBuild.java:574)
                at jenkins.scm.SCMCheckoutStrategy.checkout(SCMCheckoutStrategy.java:86)
                at hudson.model.AbstractBuild$AbstractBuildExecution.run(AbstractBuild.java:499)
                at hudson.model.Run.execute(Run.java:1815)
                at hudson.model.FreeStyleBuild.run(FreeStyleBuild.java:43)
                at hudson.model.ResourceController.execute(ResourceController.java:97)
                at hudson.model.Executor.run(Executor.java:429)
java.lang.NoClassDefFoundError: Could not initialize class jenkins.model.Jenkins
        at hudson.scm.SubversionSCM.descriptor(SubversionSCM.java:2584)
        at hudson.scm.SubversionSCM.createDefaultSVNOptions(SubversionSCM.java:1096)
        at hudson.scm.SubversionSCM.createClientManager(SubversionSCM.java:1086)
        at hudson.scm.SubversionSCM$CheckOutTask.invoke(SubversionSCM.java:1013)
        at hudson.scm.SubversionSCM$CheckOutTask.invoke(SubversionSCM.java:990)
        at hudson.FilePath$FileCallableWrapper.call(FilePath.java:3052)
        at hudson.remoting.UserRequest.perform(UserRequest.java:212)
        at hudson.remoting.UserRequest.perform(UserRequest.java:54)
        at hudson.remoting.Request$2.run(Request.java:369)
        at hudson.remoting.InterceptingExecutorService$1.call(InterceptingExecutorService.java:72)
        at java.util.concurrent.FutureTask.run(FutureTask.java:266)
        at java.util.concurrent.ThreadPoolExecutor.runWorker(ThreadPoolExecutor.java:1149)
        at java.util.concurrent.ThreadPoolExecutor$Worker.run(ThreadPoolExecutor.java:624)
        at java.lang.Thread.run(Thread.java:748)
Caused: java.io.IOException: Remote call on H25 failed
        at hudson.remoting.Channel.call(Channel.java:963)
        at hudson.FilePath.act(FilePath.java:1072)
        at hudson.FilePath.act(FilePath.java:1061)
        at hudson.scm.SubversionSCM.checkout(SubversionSCM.java:937)
        at hudson.scm.SubversionSCM.checkout(SubversionSCM.java:864)
        at hudson.scm.SCM.checkout(SCM.java:504)
        at hudson.model.AbstractProject.checkout(AbstractProject.java:1208)
        at hudson.model.AbstractBuild$AbstractBuildExecution.defaultCheckout(AbstractBuild.java:574)
        at jenkins.scm.SCMCheckoutStrategy.checkout(SCMCheckoutStrategy.java:86)
        at hudson.model.AbstractBuild$AbstractBuildExecution.run(AbstractBuild.java:499)
        at hudson.model.Run.execute(Run.java:1815)
        at hudson.model.FreeStyleBuild.run(FreeStyleBuild.java:43)
        at hudson.model.ResourceController.execute(ResourceController.java:97)
        at hudson.model.Executor.run(Executor.java:429)
Retrying after 10 seconds
Also:   hudson.remoting.Channel$CallSiteStackTrace: Remote call to H25
                at hudson.remoting.Channel.attachCallSiteStackTrace(Channel.java:1743)
                at hudson.remoting.UserRequest$ExceptionResponse.retrieve(UserRequest.java:357)
                at hudson.remoting.Channel.call(Channel.java:957)
                at hudson.FilePath.act(FilePath.java:1072)
                at hudson.FilePath.act(FilePath.java:1061)
                at hudson.scm.SubversionSCM.checkout(SubversionSCM.java:937)
                at hudson.scm.SubversionSCM.checkout(SubversionSCM.java:864)
                at hudson.scm.SCM.checkout(SCM.java:504)
                at hudson.model.AbstractProject.checkout(AbstractProject.java:1208)
                at hudson.model.AbstractBuild$AbstractBuildExecution.defaultCheckout(AbstractBuild.java:574)
                at jenkins.scm.SCMCheckoutStrategy.checkout(SCMCheckoutStrategy.java:86)
                at hudson.model.AbstractBuild$AbstractBuildExecution.run(AbstractBuild.java:499)
                at hudson.model.Run.execute(Run.java:1815)
                at hudson.model.FreeStyleBuild.run(FreeStyleBuild.java:43)
                at hudson.model.ResourceController.execute(ResourceController.java:97)
                at hudson.model.Executor.run(Executor.java:429)
java.lang.NoClassDefFoundError: Could not initialize class jenkins.model.Jenkins
        at hudson.scm.SubversionSCM.descriptor(SubversionSCM.java:2584)
        at hudson.scm.SubversionSCM.createDefaultSVNOptions(SubversionSCM.java:1096)
        at hudson.scm.SubversionSCM.createClientManager(SubversionSCM.java:1086)
        at hudson.scm.SubversionSCM$CheckOutTask.invoke(SubversionSCM.java:1013)
        at hudson.scm.SubversionSCM$CheckOutTask.invoke(SubversionSCM.java:990)
        at hudson.FilePath$FileCallableWrapper.call(FilePath.java:3052)
        at hudson.remoting.UserRequest.perform(UserRequest.java:212)
        at hudson.remoting.UserRequest.perform(UserRequest.java:54)
        at hudson.remoting.Request$2.run(Request.java:369)
        at hudson.remoting.InterceptingExecutorService$1.call(InterceptingExecutorService.java:72)
        at java.util.concurrent.FutureTask.run(FutureTask.java:266)
        at java.util.concurrent.ThreadPoolExecutor.runWorker(ThreadPoolExecutor.java:1149)
        at java.util.concurrent.ThreadPoolExecutor$Worker.run(ThreadPoolExecutor.java:624)
        at java.lang.Thread.run(Thread.java:748)
Caused: java.io.IOException: Remote call on H25 failed
        at hudson.remoting.Channel.call(Channel.java:963)
        at hudson.FilePath.act(FilePath.java:1072)
        at hudson.FilePath.act(FilePath.java:1061)
        at hudson.scm.SubversionSCM.checkout(SubversionSCM.java:937)
        at hudson.scm.SubversionSCM.checkout(SubversionSCM.java:864)
        at hudson.scm.SCM.checkout(SCM.java:504)
        at hudson.model.AbstractProject.checkout(AbstractProject.java:1208)
        at hudson.model.AbstractBuild$AbstractBuildExecution.defaultCheckout(AbstractBuild.java:574)
        at jenkins.scm.SCMCheckoutStrategy.checkout(SCMCheckoutStrategy.java:86)
        at hudson.model.AbstractBuild$AbstractBuildExecution.run(AbstractBuild.java:499)
        at hudson.model.Run.execute(Run.java:1815)
        at hudson.model.FreeStyleBuild.run(FreeStyleBuild.java:43)
        at hudson.model.ResourceController.execute(ResourceController.java:97)
        at hudson.model.Executor.run(Executor.java:429)
Retrying after 10 seconds
Also:   hudson.remoting.Channel$CallSiteStackTrace: Remote call to H25
                at hudson.remoting.Channel.attachCallSiteStackTrace(Channel.java:1743)
                at hudson.remoting.UserRequest$ExceptionResponse.retrieve(UserRequest.java:357)
                at hudson.remoting.Channel.call(Channel.java:957)
                at hudson.FilePath.act(FilePath.java:1072)
                at hudson.FilePath.act(FilePath.java:1061)
                at hudson.scm.SubversionSCM.checkout(SubversionSCM.java:937)
                at hudson.scm.SubversionSCM.checkout(SubversionSCM.java:864)
                at hudson.scm.SCM.checkout(SCM.java:504)
                at hudson.model.AbstractProject.checkout(AbstractProject.java:1208)
                at hudson.model.AbstractBuild$AbstractBuildExecution.defaultCheckout(AbstractBuild.java:574)
                at jenkins.scm.SCMCheckoutStrategy.checkout(SCMCheckoutStrategy.java:86)
                at hudson.model.AbstractBuild$AbstractBuildExecution.run(AbstractBuild.java:499)
                at hudson.model.Run.execute(Run.java:1815)
                at hudson.model.FreeStyleBuild.run(FreeStyleBuild.java:43)
                at hudson.model.ResourceController.execute(ResourceController.java:97)
                at hudson.model.Executor.run(Executor.java:429)
java.lang.NoClassDefFoundError: Could not initialize class jenkins.model.Jenkins
        at hudson.scm.SubversionSCM.descriptor(SubversionSCM.java:2584)
        at hudson.scm.SubversionSCM.createDefaultSVNOptions(SubversionSCM.java:1096)
        at hudson.scm.SubversionSCM.createClientManager(SubversionSCM.java:1086)
        at hudson.scm.SubversionSCM$CheckOutTask.invoke(SubversionSCM.java:1013)
        at hudson.scm.SubversionSCM$CheckOutTask.invoke(SubversionSCM.java:990)
        at hudson.FilePath$FileCallableWrapper.call(FilePath.java:3052)
        at hudson.remoting.UserRequest.perform(UserRequest.java:212)
        at hudson.remoting.UserRequest.perform(UserRequest.java:54)
        at hudson.remoting.Request$2.run(Request.java:369)
        at hudson.remoting.InterceptingExecutorService$1.call(InterceptingExecutorService.java:72)
        at java.util.concurrent.FutureTask.run(FutureTask.java:266)
        at java.util.concurrent.ThreadPoolExecutor.runWorker(ThreadPoolExecutor.java:1149)
        at java.util.concurrent.ThreadPoolExecutor$Worker.run(ThreadPoolExecutor.java:624)
        at java.lang.Thread.run(Thread.java:748)
Caused: java.io.IOException: Remote call on H25 failed
        at hudson.remoting.Channel.call(Channel.java:963)
        at hudson.FilePath.act(FilePath.java:1072)
        at hudson.FilePath.act(FilePath.java:1061)
        at hudson.scm.SubversionSCM.checkout(SubversionSCM.java:937)
        at hudson.scm.SubversionSCM.checkout(SubversionSCM.java:864)
        at hudson.scm.SCM.checkout(SCM.java:504)
        at hudson.model.AbstractProject.checkout(AbstractProject.java:1208)
        at hudson.model.AbstractBuild$AbstractBuildExecution.defaultCheckout(AbstractBuild.java:574)
        at jenkins.scm.SCMCheckoutStrategy.checkout(SCMCheckoutStrategy.java:86)
        at hudson.model.AbstractBuild$AbstractBuildExecution.run(AbstractBuild.java:499)
        at hudson.model.Run.execute(Run.java:1815)
        at hudson.model.FreeStyleBuild.run(FreeStyleBuild.java:43)
        at hudson.model.ResourceController.execute(ResourceController.java:97)
        at hudson.model.Executor.run(Executor.java:429)
Retrying after 10 seconds
Also:   hudson.remoting.Channel$CallSiteStackTrace: Remote call to H25
                at hudson.remoting.Channel.attachCallSiteStackTrace(Channel.java:1743)
                at hudson.remoting.UserRequest$ExceptionResponse.retrieve(UserRequest.java:357)
                at hudson.remoting.Channel.call(Channel.java:957)
                at hudson.FilePath.act(FilePath.java:1072)
                at hudson.FilePath.act(FilePath.java:1061)
                at hudson.scm.SubversionSCM.checkout(SubversionSCM.java:937)
                at hudson.scm.SubversionSCM.checkout(SubversionSCM.java:864)
                at hudson.scm.SCM.checkout(SCM.java:504)
                at hudson.model.AbstractProject.checkout(AbstractProject.java:1208)
                at hudson.model.AbstractBuild$AbstractBuildExecution.defaultCheckout(AbstractBuild.java:574)
                at jenkins.scm.SCMCheckoutStrategy.checkout(SCMCheckoutStrategy.java:86)
                at hudson.model.AbstractBuild$AbstractBuildExecution.run(AbstractBuild.java:499)
                at hudson.model.Run.execute(Run.java:1815)
                at hudson.model.FreeStyleBuild.run(FreeStyleBuild.java:43)
                at hudson.model.ResourceController.execute(ResourceController.java:97)
                at hudson.model.Executor.run(Executor.java:429)
java.lang.NoClassDefFoundError: Could not initialize class jenkins.model.Jenkins
        at hudson.scm.SubversionSCM.descriptor(SubversionSCM.java:2584)
        at hudson.scm.SubversionSCM.createDefaultSVNOptions(SubversionSCM.java:1096)
        at hudson.scm.SubversionSCM.createClientManager(SubversionSCM.java:1086)
        at hudson.scm.SubversionSCM$CheckOutTask.invoke(SubversionSCM.java:1013)
        at hudson.scm.SubversionSCM$CheckOutTask.invoke(SubversionSCM.java:990)
        at hudson.FilePath$FileCallableWrapper.call(FilePath.java:3052)
        at hudson.remoting.UserRequest.perform(UserRequest.java:212)
        at hudson.remoting.UserRequest.perform(UserRequest.java:54)
        at hudson.remoting.Request$2.run(Request.java:369)
        at hudson.remoting.InterceptingExecutorService$1.call(InterceptingExecutorService.java:72)
        at java.util.concurrent.FutureTask.run(FutureTask.java:266)
        at java.util.concurrent.ThreadPoolExecutor.runWorker(ThreadPoolExecutor.java:1149)
        at java.util.concurrent.ThreadPoolExecutor$Worker.run(ThreadPoolExecutor.java:624)
        at java.lang.Thread.run(Thread.java:748)
Caused: java.io.IOException: Remote call on H25 failed
        at hudson.remoting.Channel.call(Channel.java:963)
        at hudson.FilePath.act(FilePath.java:1072)
        at hudson.FilePath.act(FilePath.java:1061)
        at hudson.scm.SubversionSCM.checkout(SubversionSCM.java:937)
        at hudson.scm.SubversionSCM.checkout(SubversionSCM.java:864)
        at hudson.scm.SCM.checkout(SCM.java:504)
        at hudson.model.AbstractProject.checkout(AbstractProject.java:1208)
        at hudson.model.AbstractBuild$AbstractBuildExecution.defaultCheckout(AbstractBuild.java:574)
        at jenkins.scm.SCMCheckoutStrategy.checkout(SCMCheckoutStrategy.java:86)
        at hudson.model.AbstractBuild$AbstractBuildExecution.run(AbstractBuild.java:499)
        at hudson.model.Run.execute(Run.java:1815)
        at hudson.model.FreeStyleBuild.run(FreeStyleBuild.java:43)
        at hudson.model.ResourceController.execute(ResourceController.java:97)
        at hudson.model.Executor.run(Executor.java:429)
Skipping publisher since build result is FAILURE
Archiving artifacts
[Fast Archiver] Compressed 226.52 MB of artifacts by 43.0% relative to #867
Skipping publisher since build result is FAILURE
Recording test results
ERROR: Step ?Publish JUnit test result report? failed: Test reports were found but none of them are new. Did leafNodes run?
For example, <https://builds.apache.org/job/POI-DSL-1.8/ws/build/excelant-test-results/TEST-org.apache.poi.ss.examples.formula.TestExcelAntUserDefinedFunction.xml> is 3 days 9 hr old


---------------------------------------------------------------------
To unsubscribe, e-mail: [hidden email]
For additional commands, e-mail: [hidden email]

Reply | Threaded
Open this post in threaded view
|

Build failed in Jenkins: POI-DSL-1.8 #869

Apache Jenkins Server
See <https://builds.apache.org/job/POI-DSL-1.8/869/display/redirect>

Changes:


------------------------------------------
Started by an SCM change
Running as SYSTEM
[EnvInject] - Loading node environment variables.
[EnvInject] - Preparing an environment for the build.
[EnvInject] - Keeping Jenkins system variables.
[EnvInject] - Keeping Jenkins build variables.
[EnvInject] - Injecting as environment variables the properties content
LANG=en_US.UTF-8
FORREST_HOME=/home/jenkins/tools/forrest/latest

[EnvInject] - Variables injected successfully.
[EnvInject] - Injecting contributions.
Building remotely on H23 (ubuntu) in workspace <https://builds.apache.org/job/POI-DSL-1.8/ws/>
[WS-CLEANUP] Deleting project workspace...
[WS-CLEANUP] Done
Updating https://svn.apache.org/repos/asf/poi/trunk at revision '2020-01-12T12:58:15.214 +0000'
U         src/java/org/apache/poi/hssf/record/aggregates/PageSettingsBlock.java
U         src/java/org/apache/poi/hssf/record/aggregates/ChartSubstreamRecordAggregate.java
U         src/java/org/apache/poi/hssf/record/aggregates/CustomViewSettingsRecordAggregate.java
U         src/java/org/apache/poi/hssf/record/aggregates/RecordAggregate.java
U         src/java/org/apache/poi/hssf/record/aggregates/RowRecordsAggregate.java
U         src/java/org/apache/poi/hssf/record/aggregates/ValueRecordsAggregate.java
U         src/java/org/apache/poi/hssf/record/aggregates/WorksheetProtectionBlock.java
U         src/java/org/apache/poi/hssf/record/EscherAggregate.java
U         src/java/org/apache/poi/hssf/record/InterfaceEndRecord.java
U         src/java/org/apache/poi/hssf/record/RecordFactory.java
U         src/java/org/apache/poi/hssf/record/RecordFactoryInputStream.java
U         src/java/org/apache/poi/hssf/dev/BiffViewer.java
U         src/java/org/apache/poi/hssf/dev/FormulaViewer.java
U         src/java/org/apache/poi/hssf/eventmodel/ERFListener.java
U         src/java/org/apache/poi/hssf/eventmodel/EventRecordFactory.java
U         src/java/org/apache/poi/hssf/eventusermodel/AbortableHSSFListener.java
U         src/java/org/apache/poi/hssf/eventusermodel/EventWorkbookBuilder.java
U         src/java/org/apache/poi/hssf/eventusermodel/FormatTrackingHSSFListener.java
U         src/java/org/apache/poi/hssf/eventusermodel/HSSFEventFactory.java
U         src/java/org/apache/poi/hssf/eventusermodel/HSSFListener.java
U         src/java/org/apache/poi/hssf/eventusermodel/HSSFRequest.java
U         src/java/org/apache/poi/hssf/eventusermodel/MissingRecordAwareHSSFListener.java
U         src/java/org/apache/poi/hssf/extractor/EventBasedExcelExtractor.java
U         src/java/org/apache/poi/hssf/model/InternalSheet.java
U         src/java/org/apache/poi/hssf/model/InternalWorkbook.java
U         src/java/org/apache/poi/hssf/model/LinkTable.java
U         src/java/org/apache/poi/hssf/model/RecordOrderer.java
U         src/java/org/apache/poi/hssf/model/RecordStream.java
U         src/java/org/apache/poi/hssf/model/RowBlocksReader.java
U         src/java/org/apache/poi/hssf/model/WorkbookRecordList.java
U         src/java/org/apache/poi/hssf/usermodel/HSSFChart.java
U         src/java/org/apache/poi/hssf/usermodel/HSSFSheet.java
U         src/java/org/apache/poi/hssf/usermodel/HSSFWorkbook.java
U         src/java/org/apache/poi/ss/formula/EvaluationCache.java
U         src/java/org/apache/poi/ss/util/AreaReference.java
U         src/java/org/apache/poi/ss/extractor/EmbeddedExtractor.java
U         src/java/org/apache/poi/ss/format/CellNumberFormatter.java
U         src/java/org/apache/poi/hpsf/ClassIDPredefined.java
U         src/java/org/apache/poi/hpsf/DocumentSummaryInformation.java
U         src/java/org/apache/poi/hpsf/PropertySet.java
U         src/java/org/apache/poi/hpsf/SummaryInformation.java
U         src/java/org/apache/poi/ddf/EscherDggRecord.java
U         src/java/org/apache/poi/poifs/crypt/ChunkedCipherOutputStream.java
U         src/java/org/apache/poi/poifs/crypt/xor/XOREncryptor.java
U         src/java/org/apache/poi/sl/extractor/SlideShowExtractor.java
U         src/testcases/org/apache/poi/sl/draw/geom/TestPresetGeometries.java
U         src/testcases/org/apache/poi/ss/util/NumberComparisonExamples.java
U         src/testcases/org/apache/poi/ss/usermodel/BaseTestBugzillaIssues.java
U         src/testcases/org/apache/poi/hssf/eventmodel/TestAbortableListener.java
U         src/testcases/org/apache/poi/hssf/eventusermodel/TestEventWorkbookBuilder.java
U         src/testcases/org/apache/poi/hssf/eventusermodel/TestFormatTrackingHSSFListener.java
U         src/testcases/org/apache/poi/hssf/eventusermodel/TestHSSFEventFactory.java
U         src/testcases/org/apache/poi/hssf/eventusermodel/TestMissingRecordAwareHSSFListener.java
U         src/testcases/org/apache/poi/hssf/model/TestDrawingAggregate.java
U         src/testcases/org/apache/poi/hssf/model/TestEscherRecordFactory.java
U         src/testcases/org/apache/poi/hssf/model/TestLinkTable.java
U         src/testcases/org/apache/poi/hssf/model/TestSheet.java
U         src/testcases/org/apache/poi/hssf/record/TestDrawingRecord.java
U         src/testcases/org/apache/poi/hssf/record/TestFeatRecord.java
U         src/testcases/org/apache/poi/hssf/record/TestInterfaceEndRecord.java
U         src/testcases/org/apache/poi/hssf/record/TestMergeCellsRecord.java
U         src/testcases/org/apache/poi/hssf/record/TestRecordFactory.java
U         src/testcases/org/apache/poi/hssf/record/aggregates/TestCFRecordsAggregate.java
U         src/testcases/org/apache/poi/hssf/record/aggregates/TestColumnInfoRecordsAggregate.java
U         src/testcases/org/apache/poi/hssf/record/aggregates/TestFormulaRecordAggregate.java
U         src/testcases/org/apache/poi/hssf/record/aggregates/TestPageSettingsBlock.java
U         src/testcases/org/apache/poi/hssf/record/aggregates/TestRowRecordsAggregate.java
U         src/testcases/org/apache/poi/hssf/record/aggregates/TestValueRecordsAggregate.java
U         src/testcases/org/apache/poi/hssf/record/chart/TestChartTitleFormatRecord.java
U         src/testcases/org/apache/poi/hssf/usermodel/SanityChecker.java
U         src/testcases/org/apache/poi/hssf/usermodel/TestBugs.java
U         src/testcases/org/apache/poi/hssf/usermodel/TestHSSFCell.java
U         src/testcases/org/apache/poi/hssf/usermodel/TestHSSFSheet.java
U         src/testcases/org/apache/poi/hssf/usermodel/TestHSSFSheetUpdateArrayFormulas.java
U         src/testcases/org/apache/poi/hssf/usermodel/TestSanityChecker.java
U         src/testcases/org/apache/poi/hssf/usermodel/TestWorkbook.java
U         src/testcases/org/apache/poi/hssf/util/TestAreaReference.java
U         src/integrationtest/org/apache/poi/stress/HSLFFileHandler.java
U         src/integrationtest/org/apache/poi/stress/HMEFFileHandler.java
U         src/integrationtest/org/apache/poi/hssf/usermodel/RecordsStresser.java
U         src/examples/src/org/apache/poi/hssf/eventusermodel/examples/XLS2CSVmra.java
U         src/examples/src/org/apache/poi/hssf/usermodel/examples/EventExample.java
U         src/scratchpad/src/org/apache/poi/hslf/dev/SlideIdListing.java
U         src/scratchpad/src/org/apache/poi/hslf/dev/SlideShowRecordDumper.java
U         src/scratchpad/src/org/apache/poi/hslf/dev/TextStyleListing.java
U         src/scratchpad/src/org/apache/poi/hslf/dev/UserEditAndPersistListing.java
U         src/scratchpad/src/org/apache/poi/hslf/record/AnimationInfo.java
U         src/scratchpad/src/org/apache/poi/hslf/record/Comment2000.java
U         src/scratchpad/src/org/apache/poi/hslf/record/DocInfoListContainer.java
U         src/scratchpad/src/org/apache/poi/hslf/record/EscherTextboxWrapper.java
U         src/scratchpad/src/org/apache/poi/hslf/record/ExEmbed.java
U         src/scratchpad/src/org/apache/poi/hslf/record/ExHyperlink.java
U         src/scratchpad/src/org/apache/poi/hslf/record/ExMCIMovie.java
U         src/scratchpad/src/org/apache/poi/hslf/record/ExObjList.java
U         src/scratchpad/src/org/apache/poi/hslf/record/ExVideoContainer.java
U         src/scratchpad/src/org/apache/poi/hslf/record/FontCollection.java
U         src/scratchpad/src/org/apache/poi/hslf/record/HSLFEscherClientDataRecord.java
U         src/scratchpad/src/org/apache/poi/hslf/record/HeadersFootersContainer.java
U         src/scratchpad/src/org/apache/poi/hslf/record/InteractiveInfo.java
U         src/scratchpad/src/org/apache/poi/hslf/record/PPDrawing.java
U         src/scratchpad/src/org/apache/poi/hslf/record/PPDrawingGroup.java
U         src/scratchpad/src/org/apache/poi/hslf/record/ParentAwareRecord.java
U         src/scratchpad/src/org/apache/poi/hslf/record/Record.java
U         src/scratchpad/src/org/apache/poi/hslf/record/RecordAtom.java
U         src/scratchpad/src/org/apache/poi/hslf/record/RecordContainer.java
U         src/scratchpad/src/org/apache/poi/hslf/record/Slide.java
U         src/scratchpad/src/org/apache/poi/hslf/record/SlideListWithText.java
U         src/scratchpad/src/org/apache/poi/hslf/record/TextHeaderAtom.java
U         src/scratchpad/src/org/apache/poi/hslf/record/UnknownRecordPlaceholder.java
U         src/scratchpad/src/org/apache/poi/hslf/record/VBAInfoContainer.java
U         src/scratchpad/src/org/apache/poi/hslf/usermodel/HSLFHyperlink.java
U         src/scratchpad/src/org/apache/poi/hslf/usermodel/HSLFObjectShape.java
U         src/scratchpad/src/org/apache/poi/hslf/usermodel/HSLFShape.java
U         src/scratchpad/src/org/apache/poi/hslf/usermodel/HSLFShapeFactory.java
U         src/scratchpad/src/org/apache/poi/hslf/usermodel/HSLFShapePlaceholderDetails.java
U         src/scratchpad/src/org/apache/poi/hslf/usermodel/HSLFSlide.java
U         src/scratchpad/src/org/apache/poi/hslf/usermodel/HSLFSlideShow.java
U         src/scratchpad/src/org/apache/poi/hslf/usermodel/HSLFSlideShowEncrypted.java
U         src/scratchpad/src/org/apache/poi/hslf/usermodel/HSLFSlideShowImpl.java
U         src/scratchpad/src/org/apache/poi/hslf/usermodel/HSLFSoundData.java
U         src/scratchpad/src/org/apache/poi/hslf/usermodel/HSLFTextParagraph.java
U         src/scratchpad/src/org/apache/poi/hwmf/record/HwmfWindowing.java
U         src/scratchpad/testcases/org/apache/poi/hslf/record/TestRecordContainer.java
U         src/scratchpad/testcases/org/apache/poi/hslf/record/TestSound.java
U         src/scratchpad/testcases/org/apache/poi/hslf/usermodel/TestAddingSlides.java
U         src/scratchpad/testcases/org/apache/poi/hslf/usermodel/TestBugs.java
U         src/scratchpad/testcases/org/apache/poi/hslf/usermodel/TestMostRecentRecords.java
U         src/scratchpad/testcases/org/apache/poi/hslf/usermodel/TestRecordSetup.java
U         src/scratchpad/testcases/org/apache/poi/hslf/usermodel/TestRichTextRun.java
U         src/scratchpad/testcases/org/apache/poi/hslf/usermodel/TestTextRun.java
U         src/scratchpad/testcases/org/apache/poi/hmef/TestAttachments.java
U         src/scratchpad/testcases/org/apache/poi/hmef/TestBugs.java
U         src/scratchpad/testcases/org/apache/poi/hmef/TestCompressedRTF.java
U         src/scratchpad/testcases/org/apache/poi/hmef/TestHMEFMessage.java
U         src/scratchpad/testcases/org/apache/poi/hmef/attribute/TestMAPIAttributes.java
U         src/ooxml/java/org/apache/poi/ooxml/extractor/ExtractorFactory.java
U         src/ooxml/java/org/apache/poi/openxml4j/opc/PackagePartCollection.java
U         src/ooxml/java/org/apache/poi/xssf/binary/XSSFBHyperlinksTable.java
U         src/ooxml/java/org/apache/poi/xssf/binary/XSSFBParser.java
U         src/ooxml/java/org/apache/poi/xssf/eventusermodel/XSSFBReader.java
U         src/ooxml/java/org/apache/poi/xwpf/usermodel/XWPFDocument.java
U         src/ooxml/java/org/apache/poi/xslf/usermodel/XSLFSheet.java
U         src/ooxml/java/org/apache/poi/xslf/usermodel/XSLFTextParagraph.java
U         src/ooxml/java/org/apache/poi/xddf/usermodel/chart/XDDFChart.java
U         src/ooxml/java/org/apache/poi/xddf/usermodel/chart/XDDFBarChartData.java
U         src/ooxml/java/org/apache/poi/xddf/usermodel/text/XDDFTextRun.java
U         src/ooxml/testcases/org/apache/poi/xslf/usermodel/TestXSLFTable.java
U         jenkins/create_jobs.groovy
AU        test-data/hmef/bug63955-winmail.dat
U         sonar/pom.xml
U         sonar/main/pom.xml
A         sonar/integration-test
A         sonar/integration-test/pom.xml
U         build.gradle
U         build.xml
U         maven/poi.pom

<-- Got one external: forrest.properties, svn url: https://svn.apache.org/repos/asf/poi/site/forrest.properties -->
Fetching 'https://svn.apache.org/repos/asf/poi/site/forrest.properties' at -1 into '<https://builds.apache.org/job/POI-DSL-1.8/ws/forrest.properties'>
At revision 1872673


<-- Got one external: documentation, svn url: https://svn.apache.org/repos/asf/poi/site/src/documentation -->
Fetching 'https://svn.apache.org/repos/asf/poi/site/src/documentation' at -1 into '<https://builds.apache.org/job/POI-DSL-1.8/ws/src/documentation'>
U         src/documentation/content/xdocs/changes.xml
At revision 1872673

At revision 1872673

[POI-DSL-1.8] $ /bin/bash -xe /tmp/jenkins348715822522124375.sh
+ svn status
/tmp/jenkins348715822522124375.sh: fork: retry: Resource temporarily unavailable
/tmp/jenkins348715822522124375.sh: fork: retry: Resource temporarily unavailable
/tmp/jenkins348715822522124375.sh: fork: retry: Resource temporarily unavailable
/tmp/jenkins348715822522124375.sh: fork: retry: Resource temporarily unavailable
/tmp/jenkins348715822522124375.sh: fork: Resource temporarily unavailable
Build step 'Execute shell' marked build as failure
Skipping publisher since build result is FAILURE
Archiving artifacts
[Fast Archiver] Compressed 225.93 MB of artifacts by 40.5% relative to #867
Skipping publisher since build result is FAILURE
Recording test results
ERROR: Step ?Publish JUnit test result report? failed: Test reports were found but none of them are new. Did leafNodes run?
For example, <https://builds.apache.org/job/POI-DSL-1.8/ws/build/excelant-test-results/TEST-org.apache.poi.ss.examples.formula.TestExcelAntUserDefinedFunction.xml> is 8 days 11 hr old


---------------------------------------------------------------------
To unsubscribe, e-mail: [hidden email]
For additional commands, e-mail: [hidden email]

Reply | Threaded
Open this post in threaded view
|

Jenkins build is back to normal : POI-DSL-1.8 #870

Apache Jenkins Server
See <https://builds.apache.org/job/POI-DSL-1.8/870/display/redirect>


---------------------------------------------------------------------
To unsubscribe, e-mail: [hidden email]
For additional commands, e-mail: [hidden email]