Build failed in Jenkins: POI-DSL-1.8 #765

classic Classic list List threaded Threaded
3 messages Options
Reply | Threaded
Open this post in threaded view
|

Build failed in Jenkins: POI-DSL-1.8 #765

Apache Jenkins Server
See <https://builds.apache.org/job/POI-DSL-1.8/765/display/redirect?page=changes>

Changes:

[centic] Adjust reproducer test-case for bug 59322 to not print to stdout and close resources

[centic] Fix bug 59322: NullPointerException when converting a certain Word document to HTML

------------------------------------------
[...truncated 2.05 KB...]
?       src/integrationtest/build

Performing status on external item at 'src/documentation':
+ echo Java-Home: /home/jenkins/tools/java/latest1.8
Java-Home: /home/jenkins/tools/java/latest1.8
+ ls -al /home/jenkins/tools/java/latest1.8/
total 26000
drwxr-xr-x  7 root root     4096 Jul 29 13:36 .
drwxr-xr-x 43 root root     4096 Aug 19 21:26 ..
drwxr-xr-x  2 root root     4096 Jul 29 13:36 bin
-r--r--r--  1 root root     3244 Oct  6  2018 COPYRIGHT
drwxr-xr-x  3 root root     4096 Jul 29 13:36 include
-rw-r--r--  1 root root  5207154 Sep 12  2018 javafx-src.zip
drwxr-xr-x  5 root root     4096 Jul 29 13:36 jre
drwxr-xr-x  5 root root     4096 Jul 29 13:36 lib
-r--r--r--  1 root root       40 Oct  6  2018 LICENSE
drwxr-xr-x  4 root root     4096 Jul 29 13:36 man
-r--r--r--  1 root root      159 Oct  6  2018 README.html
-rw-r--r--  1 root root      424 Oct  6  2018 release
-rw-r--r--  1 root root 21101479 Oct  6  2018 src.zip
-rw-r--r--  1 root root   108062 Sep 12  2018 THIRDPARTYLICENSEREADME-JAVAFX.txt
-r--r--r--  1 root root   155003 Oct  6  2018 THIRDPARTYLICENSEREADME.txt
+ ls -al /home/jenkins/tools/java/latest1.8/bin
total 904
drwxr-xr-x 2 root root   4096 Jul 29 13:36 .
drwxr-xr-x 7 root root   4096 Jul 29 13:36 ..
-rwxr-xr-x 1 root root   8592 Oct  6  2018 appletviewer
lrwxrwxrwx 1 root root      8 Oct  6  2018 ControlPanel -> jcontrol
-rwxr-xr-x 1 root root   8584 Oct  6  2018 extcheck
-rwxr-xr-x 1 root root   8584 Oct  6  2018 idlj
-rwxr-xr-x 1 root root   8584 Oct  6  2018 jar
-rwxr-xr-x 1 root root   8584 Oct  6  2018 jarsigner
-rwxr-xr-x 1 root root   8464 Oct  6  2018 java
-rwxr-xr-x 1 root root   8584 Oct  6  2018 javac
-rwxr-xr-x 1 root root   8584 Oct  6  2018 javadoc
-rwxr-xr-x 1 root root   2293 Sep 12  2018 javafxpackager
-rwxr-xr-x 1 root root   8584 Oct  6  2018 javah
-rwxr-xr-x 1 root root   8584 Oct  6  2018 javap
-rwxr-xr-x 1 root root   2293 Sep 12  2018 javapackager
-rwxr-xr-x 1 root root   1809 Oct  6  2018 java-rmi.cgi
-rwxr-xr-x 1 root root 140248 Oct  6  2018 javaws
-rwxr-xr-x 1 root root   8584 Oct  6  2018 jcmd
-rwxr-xr-x 1 root root   8608 Oct  6  2018 jconsole
-rwxr-xr-x 1 root root   6264 Oct  6  2018 jcontrol
-rwxr-xr-x 1 root root   8600 Oct  6  2018 jdb
-rwxr-xr-x 1 root root   8584 Oct  6  2018 jdeps
-rwxr-xr-x 1 root root   8584 Oct  6  2018 jhat
-rwxr-xr-x 1 root root   8648 Oct  6  2018 jinfo
-rwxr-xr-x 1 root root   8584 Oct  6  2018 jjs
-rwxr-xr-x 1 root root   8648 Oct  6  2018 jmap
-rwxr-xr-x 1 root root  74675 Dec  8  2017 jmc
-rwxr-xr-x 1 root root    402 Dec  8  2017 jmc.ini
-rwxr-xr-x 1 root root   8584 Oct  6  2018 jps
-rwxr-xr-x 1 root root   8592 Oct  6  2018 jrunscript
-rwxr-xr-x 1 root root   8600 Oct  6  2018 jsadebugd
-rwxr-xr-x 1 root root   8648 Oct  6  2018 jstack
-rwxr-xr-x 1 root root   8584 Oct  6  2018 jstat
-rwxr-xr-x 1 root root   8584 Oct  6  2018 jstatd
-rwxr-xr-x 1 root root   5110 Jan 14  2017 jvisualvm
-rwxr-xr-x 1 root root   8584 Oct  6  2018 keytool
-rwxr-xr-x 1 root root   8592 Oct  6  2018 native2ascii
-rwxr-xr-x 1 root root   8656 Oct  6  2018 orbd
-rwxr-xr-x 1 root root   8584 Oct  6  2018 pack200
-rwxr-xr-x 1 root root   8592 Oct  6  2018 policytool
-rwxr-xr-x 1 root root   8584 Oct  6  2018 rmic
-rwxr-xr-x 1 root root   8584 Oct  6  2018 rmid
-rwxr-xr-x 1 root root   8592 Oct  6  2018 rmiregistry
-rwxr-xr-x 1 root root   8584 Oct  6  2018 schemagen
-rwxr-xr-x 1 root root   8584 Oct  6  2018 serialver
-rwxr-xr-x 1 root root   8592 Oct  6  2018 servertool
-rwxr-xr-x 1 root root   8656 Oct  6  2018 tnameserv
-rwxr-xr-x 1 root root 182536 Oct  6  2018 unpack200
-rwxr-xr-x 1 root root   8584 Oct  6  2018 wsgen
-rwxr-xr-x 1 root root   8584 Oct  6  2018 wsimport
-rwxr-xr-x 1 root root   8584 Oct  6  2018 xjc
+ /home/jenkins/tools/java/latest1.8/bin/java -version
java version "1.8.0_191"
Java(TM) SE Runtime Environment (build 1.8.0_191-b12)
Java HotSpot(TM) 64-Bit Server VM (build 25.191-b12, mixed mode)
+ echo which java
which java
+ which java
/home/jenkins/tools/java/latest1.8/bin/java
+ java -version
java version "1.8.0_191"
Java(TM) SE Runtime Environment (build 1.8.0_191-b12)
Java HotSpot(TM) 64-Bit Server VM (build 25.191-b12, mixed mode)
+ echo which javac
which javac
+ which javac
/home/jenkins/tools/java/latest1.8/bin/javac
+ javac -version
javac 1.8.0_191
+ echo Ant-Home:
Ant-Home:
+ ls -al
total 476
drwxr-xr-x  17 jenkins jenkins   4096 Aug 29 23:49 .
drwxr-xr-x 369 jenkins jenkins  20480 Aug 31 12:39 ..
drwxr-xr-x  26 jenkins jenkins   4096 Aug 29 23:59 build
-rw-r--r--   1 jenkins jenkins  11321 Aug 29 23:24 build.gradle
-rw-r--r--   1 jenkins jenkins    172 Aug 29 23:24 build.javacheck.xml
-rw-r--r--   1 jenkins jenkins 142200 Aug 29 23:24 build.xml
-rw-r--r--   1 jenkins jenkins   3279 Aug 29 23:24 .classpath
drwxr-xr-x   3 jenkins jenkins   4096 Aug 29 23:25 compile-lib
-rw-r--r--   1 jenkins jenkins   5814 Aug 15 12:58 doap_POI.rdf
-rw-r--r--   1 jenkins jenkins   2596 Aug 15 12:58 file-leak-detector.exclude
-rw-r--r--   1 jenkins jenkins   6229 Aug 15 12:58 forrest.properties
-rw-r--r--   1 jenkins jenkins     53 Aug 15 12:58 .gitattributes
-rw-r--r--   1 jenkins jenkins    493 Aug 15 12:58 .gitignore
drwxr-xr-x   3 jenkins jenkins   4096 Aug 15 12:58 gradle
-rwxr-xr-x   1 jenkins jenkins   5299 Aug 15 12:58 gradlew
-rw-r--r--   1 jenkins jenkins   2260 Aug 15 12:58 gradlew.bat
drwxr-xr-x   2 jenkins jenkins   4096 Aug 15 12:58 jenkins
-rw-r--r--   1 jenkins jenkins 166411 Aug 15 12:58 KEYS
drwxr-xr-x   2 jenkins jenkins   4096 Aug 15 12:58 legal
drwxr-xr-x   2 jenkins jenkins   4096 Aug 29 23:25 lib
drwxr-xr-x   2 jenkins jenkins   4096 Aug 29 23:24 maven
drwxr-xr-x   2 jenkins jenkins   4096 Aug 31 12:58 ooxml-lib
drwxr-xr-x   2 jenkins jenkins   4096 Aug 15 12:59 ooxml-testlib
drwxr-xr-x   4 jenkins jenkins   4096 Aug 15 12:58 osgi
-rw-r--r--   1 jenkins jenkins   4813 Aug 15 12:58 patch.xml
-rw-r--r--   1 jenkins jenkins    426 Aug 15 12:58 .project
-rw-r--r--   1 jenkins jenkins   4280 Aug 15 12:58 README.rst
drwxr-xr-x   2 jenkins jenkins   4096 Aug 15 12:58 .settings
-rw-r--r--   1 jenkins jenkins    556 Aug 15 12:58 settings.gradle
drwxr-xr-x  10 jenkins jenkins   4096 Aug 15 12:58 sonar
drwxr-xr-x  15 jenkins jenkins   4096 Aug 15 12:58 src
drwxr-xr-x   4 jenkins jenkins   4096 Aug 31 12:58 .svn
drwxr-xr-x  14 jenkins jenkins   4096 Aug 15 12:58 test-data
-rw-r--r--   1 jenkins jenkins    136 Aug 15 12:58 .travis.yml
+ echo which ant
which ant
+ which ant
/usr/bin/ant
+ ant -version
Apache Ant(TM) version 1.10.5 compiled on March 28 2019
+ echo '<project default="test"><target name="test"><echo>Java ${ant.java.version}/${java.version}</echo><exec executable="javac"><arg value="-version"/></exec></target></project>'
+ ant -f build.javacheck.xml -v
Apache Ant(TM) version 1.10.5 compiled on March 28 2019
Buildfile: <https://builds.apache.org/job/POI-DSL-1.8/ws/build.javacheck.xml>
Detected Java version: 1.8 in: /usr/local/asfpackages/java/jdk1.8.0_191/jre
Detected OS: Linux
parsing buildfile <https://builds.apache.org/job/POI-DSL-1.8/ws/build.javacheck.xml> with URI = <https://builds.apache.org/job/POI-DSL-1.8/ws/build.javacheck.xml>
Project base dir set to: <https://builds.apache.org/job/POI-DSL-1.8/ws/>
Build sequence for target(s) `test' is [test]
Complete build sequence is [test, ]

test:
parsing buildfile jar:file:/usr/share/ant/lib/ant.jar!/org/apache/tools/ant/antlib.xml with URI = jar:file:/usr/share/ant/lib/ant.jar!/org/apache/tools/ant/antlib.xml from a zip file
     [echo] Java 1.8/1.8.0_191
     [exec] Current OS is Linux
     [exec] Executing 'javac' with arguments:
     [exec] '-version'
     [exec]
     [exec] The ' characters around the executable and arguments are
     [exec] not part of the command.
     [exec] javac 1.8.0_191

BUILD SUCCESSFUL
Total time: 1 second
+ exit 0
[POI-DSL-1.8] $ /home/jenkins/tools/ant/latest1.9/bin/ant -Dcoverage.enabled=true clean jenkins
Buildfile: <https://builds.apache.org/job/POI-DSL-1.8/ws/build.xml>

clean:
   [delete] Deleting directory <https://builds.apache.org/job/POI-DSL-1.8/ws/build>

replaceVersion:

check-jars:

fetch-jars:

check-ooxml-jars:

fetch-ooxml-jars:

init:
    [mkdir] Created dir: <https://builds.apache.org/job/POI-DSL-1.8/ws/build>
    [mkdir] Created dir: <https://builds.apache.org/job/POI-DSL-1.8/ws/build/classes>
    [mkdir] Created dir: <https://builds.apache.org/job/POI-DSL-1.8/ws/build/test-classes>
    [mkdir] Created dir: <https://builds.apache.org/job/POI-DSL-1.8/ws/build/test-results>
    [mkdir] Created dir: <https://builds.apache.org/job/POI-DSL-1.8/ws/build/scratchpad-classes>
    [mkdir] Created dir: <https://builds.apache.org/job/POI-DSL-1.8/ws/build/scratchpad-test-classes>
    [mkdir] Created dir: <https://builds.apache.org/job/POI-DSL-1.8/ws/build/scratchpad-test-results>
    [mkdir] Created dir: <https://builds.apache.org/job/POI-DSL-1.8/ws/build/geometry-java>
    [mkdir] Created dir: <https://builds.apache.org/job/POI-DSL-1.8/ws/build/ooxml-classes>
    [mkdir] Created dir: <https://builds.apache.org/job/POI-DSL-1.8/ws/build/ooxml-test-classes>
    [mkdir] Created dir: <https://builds.apache.org/job/POI-DSL-1.8/ws/build/ooxml-test-results>
    [mkdir] Created dir: <https://builds.apache.org/job/POI-DSL-1.8/ws/build/excelant-classes>
    [mkdir] Created dir: <https://builds.apache.org/job/POI-DSL-1.8/ws/build/excelant-test-classes>
    [mkdir] Created dir: <https://builds.apache.org/job/POI-DSL-1.8/ws/build/excelant-test-results>
    [mkdir] Created dir: <https://builds.apache.org/job/POI-DSL-1.8/ws/build/examples-classes>
    [mkdir] Created dir: <https://builds.apache.org/job/POI-DSL-1.8/ws/build/integration-test-classes>
    [mkdir] Created dir: <https://builds.apache.org/job/POI-DSL-1.8/765/artifact/build/integration-test-results>
    [mkdir] Created dir: <https://builds.apache.org/job/POI-DSL-1.8/ws/build/dist>
    [mkdir] Created dir: <https://builds.apache.org/job/POI-DSL-1.8/ws/build/site>
     [echo] Using Ant: Apache Ant(TM) version 1.9.13 compiled on July 10 2018 from /home/jenkins/tools/ant/latest1.9, Ant detected Java 1.8 (may be different than actual Java sometimes...)
     [echo] Using Java: 1.8.0_191/1.8.0_191-b12/25.191-b12/Java HotSpot(TM) 64-Bit Server VM from Oracle Corporation on Linux: 4.15.0-55-generic

compile-main:
    [javac] Compiling 1217 source files to <https://builds.apache.org/job/POI-DSL-1.8/ws/build/classes>
    [javac] Note: Some input files use or override a deprecated API.
    [javac] Note: Recompile with -Xlint:deprecation for details.
    [javac] Note: Some input files use unchecked or unsafe operations.
    [javac] Note: Recompile with -Xlint:unchecked for details.
    [javac] Creating empty <https://builds.apache.org/job/POI-DSL-1.8/ws/build/classes/org/apache/poi/poifs/dev/package-info.class>
    [javac] Creating empty <https://builds.apache.org/job/POI-DSL-1.8/ws/build/classes/org/apache/poi/poifs/common/package-info.class>
    [javac] Creating empty <https://builds.apache.org/job/POI-DSL-1.8/ws/build/classes/org/apache/poi/poifs/filesystem/package-info.class>
    [javac] Creating empty <https://builds.apache.org/job/POI-DSL-1.8/ws/build/classes/org/apache/poi/poifs/storage/package-info.class>
    [javac] Creating empty <https://builds.apache.org/job/POI-DSL-1.8/ws/build/classes/org/apache/poi/poifs/package-info.class>
    [javac] Creating empty <https://builds.apache.org/job/POI-DSL-1.8/ws/build/classes/org/apache/poi/poifs/crypt/package-info.class>
    [javac] Creating empty <https://builds.apache.org/job/POI-DSL-1.8/ws/build/classes/org/apache/poi/poifs/eventfilesystem/package-info.class>
    [javac] Creating empty <https://builds.apache.org/job/POI-DSL-1.8/ws/build/classes/org/apache/poi/poifs/property/package-info.class>
    [javac] Compiling 548 source files to <https://builds.apache.org/job/POI-DSL-1.8/ws/build/test-classes>
    [javac] Note: Some input files use or override a deprecated API.
    [javac] Note: Recompile with -Xlint:deprecation for details.
     [copy] Copying 5 files to <https://builds.apache.org/job/POI-DSL-1.8/ws/build/classes>

check-ooxml-xsds:

fetch-ooxml-xsds:

generate-geometry:

compile-scratchpad:
    [javac] Compiling 510 source files to <https://builds.apache.org/job/POI-DSL-1.8/ws/build/scratchpad-classes>
    [javac] Note: Some input files use or override a deprecated API.
    [javac] Note: Recompile with -Xlint:deprecation for details.
    [javac] Note: Some input files use unchecked or unsafe operations.
    [javac] Note: Recompile with -Xlint:unchecked for details.
    [javac] Compiling 204 source files to <https://builds.apache.org/job/POI-DSL-1.8/ws/build/scratchpad-test-classes>
    [javac] <https://builds.apache.org/job/POI-DSL-1.8/ws/src/scratchpad/testcases/org/apache/poi/hwpf/usermodel/TestBugs.java>:49: error: package org.apache.poi.ooxml.util does not exist
    [javac] import org.apache.poi.ooxml.util.DocumentHelper;
    [javac]                                 ^
    [javac] 1 error

BUILD FAILED
<https://builds.apache.org/job/POI-DSL-1.8/ws/build.xml>:1130: Compile failed; see the compiler error output for details.

Total time: 1 minute 30 seconds
Build step 'Invoke Ant' marked build as failure
Skipping publisher since build result is FAILURE
Archiving artifacts
[Fast Archiver] Compressed 35.68 MB of artifacts by 99.8% relative to #764
Skipping publisher since build result is FAILURE
Recording test results
ERROR: Step ?Publish JUnit test result report? failed: No test report files were found. Configuration error?

---------------------------------------------------------------------
To unsubscribe, e-mail: [hidden email]
For additional commands, e-mail: [hidden email]

Reply | Threaded
Open this post in threaded view
|

Build failed in Jenkins: POI-DSL-1.8 #766

Apache Jenkins Server
See <https://builds.apache.org/job/POI-DSL-1.8/766/display/redirect?page=changes>

Changes:

[fanningpj] fix build issue

[fanningpj] upgrade xmlsec dependency

------------------------------------------
[...truncated 382.44 KB...]
drwxr-xr-x 7 root root   4096 Aug 26 09:34 ..
-rwxr-xr-x 1 root root   8592 Oct  6  2018 appletviewer
lrwxrwxrwx 1 root root      8 Oct  6  2018 ControlPanel -> jcontrol
-rwxr-xr-x 1 root root   8584 Oct  6  2018 extcheck
-rwxr-xr-x 1 root root   8584 Oct  6  2018 idlj
-rwxr-xr-x 1 root root   8584 Oct  6  2018 jar
-rwxr-xr-x 1 root root   8584 Oct  6  2018 jarsigner
-rwxr-xr-x 1 root root   8464 Oct  6  2018 java
-rwxr-xr-x 1 root root   8584 Oct  6  2018 javac
-rwxr-xr-x 1 root root   8584 Oct  6  2018 javadoc
-rwxr-xr-x 1 root root   2293 Sep 12  2018 javafxpackager
-rwxr-xr-x 1 root root   8584 Oct  6  2018 javah
-rwxr-xr-x 1 root root   8584 Oct  6  2018 javap
-rwxr-xr-x 1 root root   2293 Sep 12  2018 javapackager
-rwxr-xr-x 1 root root   1809 Oct  6  2018 java-rmi.cgi
-rwxr-xr-x 1 root root 140248 Oct  6  2018 javaws
-rwxr-xr-x 1 root root   8584 Oct  6  2018 jcmd
-rwxr-xr-x 1 root root   8608 Oct  6  2018 jconsole
-rwxr-xr-x 1 root root   6264 Oct  6  2018 jcontrol
-rwxr-xr-x 1 root root   8600 Oct  6  2018 jdb
-rwxr-xr-x 1 root root   8584 Oct  6  2018 jdeps
-rwxr-xr-x 1 root root   8584 Oct  6  2018 jhat
-rwxr-xr-x 1 root root   8648 Oct  6  2018 jinfo
-rwxr-xr-x 1 root root   8584 Oct  6  2018 jjs
-rwxr-xr-x 1 root root   8648 Oct  6  2018 jmap
-rwxr-xr-x 1 root root  74675 Dec  8  2017 jmc
-rwxr-xr-x 1 root root    402 Dec  8  2017 jmc.ini
-rwxr-xr-x 1 root root   8584 Oct  6  2018 jps
-rwxr-xr-x 1 root root   8592 Oct  6  2018 jrunscript
-rwxr-xr-x 1 root root   8600 Oct  6  2018 jsadebugd
-rwxr-xr-x 1 root root   8648 Oct  6  2018 jstack
-rwxr-xr-x 1 root root   8584 Oct  6  2018 jstat
-rwxr-xr-x 1 root root   8584 Oct  6  2018 jstatd
-rwxr-xr-x 1 root root   5110 Jan 14  2017 jvisualvm
-rwxr-xr-x 1 root root   8584 Oct  6  2018 keytool
-rwxr-xr-x 1 root root   8592 Oct  6  2018 native2ascii
-rwxr-xr-x 1 root root   8656 Oct  6  2018 orbd
-rwxr-xr-x 1 root root   8584 Oct  6  2018 pack200
-rwxr-xr-x 1 root root   8592 Oct  6  2018 policytool
-rwxr-xr-x 1 root root   8584 Oct  6  2018 rmic
-rwxr-xr-x 1 root root   8584 Oct  6  2018 rmid
-rwxr-xr-x 1 root root   8592 Oct  6  2018 rmiregistry
-rwxr-xr-x 1 root root   8584 Oct  6  2018 schemagen
-rwxr-xr-x 1 root root   8584 Oct  6  2018 serialver
-rwxr-xr-x 1 root root   8592 Oct  6  2018 servertool
-rwxr-xr-x 1 root root   8656 Oct  6  2018 tnameserv
-rwxr-xr-x 1 root root 182536 Oct  6  2018 unpack200
-rwxr-xr-x 1 root root   8584 Oct  6  2018 wsgen
-rwxr-xr-x 1 root root   8584 Oct  6  2018 wsimport
-rwxr-xr-x 1 root root   8584 Oct  6  2018 xjc
+ /home/jenkins/tools/java/latest1.8/bin/java -version
java version "1.8.0_191"
Java(TM) SE Runtime Environment (build 1.8.0_191-b12)
Java HotSpot(TM) 64-Bit Server VM (build 25.191-b12, mixed mode)
+ echo which java
which java
+ which java
/home/jenkins/tools/java/latest1.8/bin/java
+ java -version
java version "1.8.0_191"
Java(TM) SE Runtime Environment (build 1.8.0_191-b12)
Java HotSpot(TM) 64-Bit Server VM (build 25.191-b12, mixed mode)
+ echo which javac
which javac
+ which javac
/home/jenkins/tools/java/latest1.8/bin/javac
+ javac -version
javac 1.8.0_191
+ echo Ant-Home:
Ant-Home:
+ ls -al
total 464
drwxr-xr-x  15 jenkins jenkins   4096 Aug 31 13:36 .
drwxr-xr-x 238 jenkins jenkins  20480 Aug 31 13:35 ..
-rw-r--r--   1 jenkins jenkins  11321 Aug 31 13:36 build.gradle
-rw-r--r--   1 jenkins jenkins 142200 Aug 31 13:36 build.xml
-rw-r--r--   1 jenkins jenkins   3279 Aug 31 13:36 .classpath
drwxr-xr-x   2 jenkins jenkins   4096 Aug 31 13:36 compile-lib
-rw-r--r--   1 jenkins jenkins   5814 Aug 31 13:35 doap_POI.rdf
-rw-r--r--   1 jenkins jenkins   2596 Aug 31 13:36 file-leak-detector.exclude
-rw-r--r--   1 jenkins jenkins   6229 Aug 31 13:36 forrest.properties
-rw-r--r--   1 jenkins jenkins     53 Aug 31 13:35 .gitattributes
-rw-r--r--   1 jenkins jenkins    493 Aug 31 13:35 .gitignore
drwxr-xr-x   3 jenkins jenkins   4096 Aug 31 13:36 gradle
-rwxr-xr-x   1 jenkins jenkins   5299 Aug 31 13:36 gradlew
-rw-r--r--   1 jenkins jenkins   2260 Aug 31 13:36 gradlew.bat
drwxr-xr-x   2 jenkins jenkins   4096 Aug 31 13:36 jenkins
-rw-r--r--   1 jenkins jenkins 166411 Aug 31 13:35 KEYS
drwxr-xr-x   2 jenkins jenkins   4096 Aug 31 13:35 legal
drwxr-xr-x   2 jenkins jenkins   4096 Aug 31 13:35 lib
drwxr-xr-x   2 jenkins jenkins   4096 Aug 31 13:35 maven
drwxr-xr-x   2 jenkins jenkins   4096 Aug 31 13:35 ooxml-lib
drwxr-xr-x   4 jenkins jenkins   4096 Aug 31 13:36 osgi
-rw-r--r--   1 jenkins jenkins   4813 Aug 31 13:36 patch.xml
-rw-r--r--   1 jenkins jenkins    426 Aug 31 13:36 .project
-rw-r--r--   1 jenkins jenkins   4280 Aug 31 13:35 README.rst
drwxr-xr-x   2 jenkins jenkins   4096 Aug 31 13:35 .settings
-rw-r--r--   1 jenkins jenkins    556 Aug 31 13:36 settings.gradle
drwxr-xr-x  10 jenkins jenkins   4096 Aug 31 13:35 sonar
drwxr-xr-x  15 jenkins jenkins   4096 Aug 31 13:36 src
drwxr-xr-x   4 jenkins jenkins   4096 Aug 31 13:36 .svn
drwxr-xr-x  14 jenkins jenkins   4096 Aug 31 13:36 test-data
-rw-r--r--   1 jenkins jenkins    136 Aug 31 13:36 .travis.yml
+ echo which ant
which ant
+ which ant
/usr/bin/ant
+ ant -version
Apache Ant(TM) version 1.10.5 compiled on March 28 2019
+ echo '<project default="test"><target name="test"><echo>Java ${ant.java.version}/${java.version}</echo><exec executable="javac"><arg value="-version"/></exec></target></project>'
+ ant -f build.javacheck.xml -v
Apache Ant(TM) version 1.10.5 compiled on March 28 2019
Buildfile: <https://builds.apache.org/job/POI-DSL-1.8/ws/build.javacheck.xml>
Detected Java version: 1.8 in: /usr/local/asfpackages/java/jdk1.8.0_191/jre
Detected OS: Linux
parsing buildfile <https://builds.apache.org/job/POI-DSL-1.8/ws/build.javacheck.xml> with URI = <https://builds.apache.org/job/POI-DSL-1.8/ws/build.javacheck.xml>
Project base dir set to: <https://builds.apache.org/job/POI-DSL-1.8/ws/>
Build sequence for target(s) `test' is [test]
Complete build sequence is [test, ]

test:
parsing buildfile jar:file:/usr/share/ant/lib/ant.jar!/org/apache/tools/ant/antlib.xml with URI = jar:file:/usr/share/ant/lib/ant.jar!/org/apache/tools/ant/antlib.xml from a zip file
     [echo] Java 1.8/1.8.0_191
     [exec] Current OS is Linux
     [exec] Executing 'javac' with arguments:
     [exec] '-version'
     [exec]
     [exec] The ' characters around the executable and arguments are
     [exec] not part of the command.
     [exec] javac 1.8.0_191

BUILD SUCCESSFUL
Total time: 0 seconds
+ exit 0
[POI-DSL-1.8] $ /home/jenkins/tools/ant/latest1.9/bin/ant -Dcoverage.enabled=true clean jenkins
Buildfile: <https://builds.apache.org/job/POI-DSL-1.8/ws/build.xml>

clean:

replaceVersion:

check-jars:
    [mkdir] Created dir: <https://builds.apache.org/job/POI-DSL-1.8/ws/ooxml-testlib>

fetch-jars:
      [get] Getting: https://repo1.maven.org/maven2/commons-logging/commons-logging/1.2/commons-logging-1.2.jar
      [get] To: <https://builds.apache.org/job/POI-DSL-1.8/ws/lib/commons-logging-1.2.jar>
      [get] Getting: https://repo1.maven.org/maven2/commons-codec/commons-codec/1.13/commons-codec-1.13.jar
      [get] To: <https://builds.apache.org/job/POI-DSL-1.8/ws/lib/commons-codec-1.13.jar>
      [get] Getting: https://repo1.maven.org/maven2/log4j/log4j/1.2.17/log4j-1.2.17.jar
      [get] To: <https://builds.apache.org/job/POI-DSL-1.8/ws/lib/log4j-1.2.17.jar>
      [get] Getting: https://repo1.maven.org/maven2/junit/junit/4.12/junit-4.12.jar
      [get] To: <https://builds.apache.org/job/POI-DSL-1.8/ws/lib/junit-4.12.jar>
      [get] Getting: https://repo1.maven.org/maven2/org/openjdk/jmh/jmh-core/1.19/jmh-core-1.19.jar
      [get] To: <https://builds.apache.org/job/POI-DSL-1.8/ws/lib/jmh-core-1.19.jar>
      [get] Getting: https://repo1.maven.org/maven2/org/openjdk/jmh/jmh-generator-annprocess/1.19/jmh-generator-annprocess-1.19.jar
      [get] To: <https://builds.apache.org/job/POI-DSL-1.8/ws/lib/jmh-generator-annprocess-1.19.jar>
      [get] Getting: https://repo1.maven.org/maven2/org/hamcrest/hamcrest-core/1.3/hamcrest-core-1.3.jar
      [get] To: <https://builds.apache.org/job/POI-DSL-1.8/ws/lib/hamcrest-core-1.3.jar>
      [get] Getting: https://repo1.maven.org/maven2/org/xmlunit/xmlunit-core/2.5.1/xmlunit-core-2.5.1.jar
      [get] To: <https://builds.apache.org/job/POI-DSL-1.8/ws/lib/xmlunit-core-2.5.1.jar>
      [get] Getting: https://repo1.maven.org/maven2/org/mockito/mockito-core/3.0.0/mockito-core-3.0.0.jar
      [get] To: <https://builds.apache.org/job/POI-DSL-1.8/ws/lib/mockito-core-3.0.0.jar>
      [get] Getting: https://repo1.maven.org/maven2/net/bytebuddy/byte-buddy/1.10.1/byte-buddy-1.10.1.jar
      [get] To: <https://builds.apache.org/job/POI-DSL-1.8/ws/lib/byte-buddy-1.10.1.jar>
      [get] Getting: https://repo1.maven.org/maven2/net/bytebuddy/byte-buddy-agent/1.10.1/byte-buddy-agent-1.10.1.jar
      [get] To: <https://builds.apache.org/job/POI-DSL-1.8/ws/lib/byte-buddy-agent-1.10.1.jar>
      [get] Getting: https://repo1.maven.org/maven2/org/objenesis/objenesis/2.6/objenesis-2.6.jar
      [get] To: <https://builds.apache.org/job/POI-DSL-1.8/ws/lib/objenesis-2.6.jar>
      [get] Getting: https://repo1.maven.org/maven2/org/apache/ant/ant/1.10.1/ant-1.10.1.jar
      [get] To: <https://builds.apache.org/job/POI-DSL-1.8/ws/lib/ant-1.10.1.jar>
      [get] Getting: https://repo1.maven.org/maven2/org/apache/ant/ant-launcher/1.10.1/ant-launcher-1.10.1.jar
      [get] To: <https://builds.apache.org/job/POI-DSL-1.8/ws/lib/ant-launcher-1.10.1.jar>
      [get] Getting: https://repo1.maven.org/maven2/org/ow2/asm/asm/7.0/asm-7.0.jar
      [get] To: <https://builds.apache.org/job/POI-DSL-1.8/ws/lib/asm-7.0.jar>
      [get] Getting: https://repo1.maven.org/maven2/org/ow2/asm/asm-commons/7.0/asm-commons-7.0.jar
      [get] To: <https://builds.apache.org/job/POI-DSL-1.8/ws/lib/asm-commons-7.0.jar>
      [get] Getting: https://repo1.maven.org/maven2/org/ow2/asm/asm-tree/7.0/asm-tree-7.0.jar
      [get] To: <https://builds.apache.org/job/POI-DSL-1.8/ws/lib/asm-tree-7.0.jar>
      [get] Getting: https://repo1.maven.org/maven2/org/jacoco/jacoco/0.8.3/jacoco-0.8.3.zip
      [get] To: <https://builds.apache.org/job/POI-DSL-1.8/ws/lib/jacoco-0.8.3.zip>
      [get] Getting: https://repo1.maven.org/maven2/org/apache/commons/commons-collections4/4.3/commons-collections4-4.3.jar
      [get] To: <https://builds.apache.org/job/POI-DSL-1.8/ws/lib/commons-collections4-4.3.jar>
      [get] Getting: https://repo1.maven.org/maven2/org/apache/commons/commons-math3/3.6.1/commons-math3-3.6.1.jar
      [get] To: <https://builds.apache.org/job/POI-DSL-1.8/ws/lib/commons-math3-3.6.1.jar>
      [get] Getting: https://repo1.maven.org/maven2/javax/xml/bind/jaxb-api/2.3.1/jaxb-api-2.3.1.jar
      [get] To: <https://builds.apache.org/job/POI-DSL-1.8/ws/lib/jaxb-api-2.3.1.jar>
      [get] Getting: https://repo1.maven.org/maven2/com/sun/xml/bind/jaxb-impl/2.3.2/jaxb-impl-2.3.2.jar
      [get] To: <https://builds.apache.org/job/POI-DSL-1.8/ws/lib/jaxb-impl-2.3.2.jar>
      [get] Getting: https://repo1.maven.org/maven2/com/sun/xml/bind/jaxb-core/2.3.0.1/jaxb-core-2.3.0.1.jar
      [get] To: <https://builds.apache.org/job/POI-DSL-1.8/ws/lib/jaxb-core-2.3.0.1.jar>
      [get] Getting: https://repo1.maven.org/maven2/javax/activation/activation/1.1.1/activation-1.1.1.jar
      [get] To: <https://builds.apache.org/job/POI-DSL-1.8/ws/lib/activation-1.1.1.jar>
    [unzip] Expanding: <https://builds.apache.org/job/POI-DSL-1.8/ws/lib/jacoco-0.8.3.zip> into <https://builds.apache.org/job/POI-DSL-1.8/ws/>
      [get] Getting: https://repo1.maven.org/maven2/org/apache/rat/apache-rat/0.12/apache-rat-0.12.jar
      [get] To: <https://builds.apache.org/job/POI-DSL-1.8/ws/lib/apache-rat-0.12.jar>
      [get] Getting: https://repo1.maven.org/maven2/de/thetaphi/forbiddenapis/2.6/forbiddenapis-2.6.jar
      [get] To: <https://builds.apache.org/job/POI-DSL-1.8/ws/lib/forbiddenapis-2.6.jar>
      [get] Getting: https://repo1.maven.org/maven2/org/bouncycastle/bcprov-ext-jdk15on/1.62/bcprov-ext-jdk15on-1.62.jar
      [get] To: <https://builds.apache.org/job/POI-DSL-1.8/ws/compile-lib/bcprov-ext-jdk15on-1.62.jar>
      [get] Getting: https://repo1.maven.org/maven2/org/bouncycastle/bcpkix-jdk15on/1.62/bcpkix-jdk15on-1.62.jar
      [get] To: <https://builds.apache.org/job/POI-DSL-1.8/ws/compile-lib/bcpkix-jdk15on-1.62.jar>
      [get] Getting: https://repo1.maven.org/maven2/org/apache/santuario/xmlsec/2.1.2/xmlsec-2.1.2.jar
      [get] To: <https://builds.apache.org/job/POI-DSL-1.8/ws/compile-lib/xmlsec-2.1.2.jar>
      [get] Getting: https://repo1.maven.org/maven2/org/slf4j/slf4j-api/1.7.26/slf4j-api-1.7.26.jar
      [get] To: <https://builds.apache.org/job/POI-DSL-1.8/ws/compile-lib/slf4j-api-1.7.26.jar>

check-ooxml-jars:

fetch-ooxml-jars:
      [get] Getting: https://repo1.maven.org/maven2/com/github/virtuald/curvesapi/1.06/curvesapi-1.06.jar
      [get] To: <https://builds.apache.org/job/POI-DSL-1.8/766/artifact/ooxml-lib/curvesapi-1.06.jar>
      [get] Getting: https://repository.apache.org/content/repositories/releases/org/apache/xmlbeans/xmlbeans/3.1.0/xmlbeans-3.1.0.jar
      [get] To: <https://builds.apache.org/job/POI-DSL-1.8/766/artifact/ooxml-lib/xmlbeans-3.1.0.jar>
      [get] Error getting https://repository.apache.org/content/repositories/releases/org/apache/xmlbeans/xmlbeans/3.1.0/xmlbeans-3.1.0.jar to <https://builds.apache.org/job/POI-DSL-1.8/766/artifact/ooxml-lib/xmlbeans-3.1.0.jar>

BUILD FAILED
<https://builds.apache.org/job/POI-DSL-1.8/ws/build.xml>:822: The following error occurred while executing this line:
<https://builds.apache.org/job/POI-DSL-1.8/ws/build.xml>:628: java.net.ConnectException: Connection timed out (Connection timed out)
        at java.net.PlainSocketImpl.socketConnect(Native Method)
        at java.net.AbstractPlainSocketImpl.doConnect(AbstractPlainSocketImpl.java:350)
        at java.net.AbstractPlainSocketImpl.connectToAddress(AbstractPlainSocketImpl.java:206)
        at java.net.AbstractPlainSocketImpl.connect(AbstractPlainSocketImpl.java:188)
        at java.net.SocksSocketImpl.connect(SocksSocketImpl.java:392)
        at java.net.Socket.connect(Socket.java:589)
        at sun.security.ssl.SSLSocketImpl.connect(SSLSocketImpl.java:666)
        at sun.security.ssl.BaseSSLSocketImpl.connect(BaseSSLSocketImpl.java:173)
        at sun.net.NetworkClient.doConnect(NetworkClient.java:180)
        at sun.net.www.http.HttpClient.openServer(HttpClient.java:463)
        at sun.net.www.http.HttpClient.openServer(HttpClient.java:558)
        at sun.net.www.protocol.https.HttpsClient.<init>(HttpsClient.java:264)
        at sun.net.www.protocol.https.HttpsClient.New(HttpsClient.java:367)
        at sun.net.www.protocol.https.AbstractDelegateHttpsURLConnection.getNewHttpClient(AbstractDelegateHttpsURLConnection.java:191)
        at sun.net.www.protocol.http.HttpURLConnection.plainConnect0(HttpURLConnection.java:1156)
        at sun.net.www.protocol.http.HttpURLConnection.plainConnect(HttpURLConnection.java:1050)
        at sun.net.www.protocol.https.AbstractDelegateHttpsURLConnection.connect(AbstractDelegateHttpsURLConnection.java:177)
        at sun.net.www.protocol.https.HttpsURLConnectionImpl.connect(HttpsURLConnectionImpl.java:162)
        at org.apache.tools.ant.taskdefs.Get$GetThread.openConnection(Get.java:736)
        at org.apache.tools.ant.taskdefs.Get$GetThread.get(Get.java:652)
        at org.apache.tools.ant.taskdefs.Get$GetThread.run(Get.java:642)

Total time: 2 minutes 14 seconds
Build step 'Invoke Ant' marked build as failure
Skipping publisher since build result is FAILURE
Archiving artifacts
[Fast Archiver] Compressed 109.29 KB of artifacts by 58.6% relative to #764
Skipping publisher since build result is FAILURE
Recording test results
ERROR: Step ?Publish JUnit test result report? failed: No test report files were found. Configuration error?

---------------------------------------------------------------------
To unsubscribe, e-mail: [hidden email]
For additional commands, e-mail: [hidden email]

Reply | Threaded
Open this post in threaded view
|

Jenkins build is back to normal : POI-DSL-1.8 #767

Apache Jenkins Server
See <https://builds.apache.org/job/POI-DSL-1.8/767/display/redirect?page=changes>


---------------------------------------------------------------------
To unsubscribe, e-mail: [hidden email]
For additional commands, e-mail: [hidden email]