Build failed in Jenkins: POI-DSL-1.8 #349

classic Classic list List threaded Threaded
2 messages Options
Reply | Threaded
Open this post in threaded view
|

Build failed in Jenkins: POI-DSL-1.8 #349

Apache Jenkins Server
See <https://builds.apache.org/job/POI-DSL-1.8/349/display/redirect?page=changes>

Changes:

[fanningpj] [bug-62038] add mockito based unit test

------------------------------------------
[...truncated 381.18 KB...]
      [get] Getting: https://repo1.maven.org/maven2/de/thetaphi/forbiddenapis/2.3/forbiddenapis-2.3.jar
      [get] To: <https://builds.apache.org/job/POI-DSL-1.8/ws/lib/forbiddenapis-2.3.jar>
      [get] Getting: https://repo1.maven.org/maven2/org/bouncycastle/bcprov-ext-jdk15on/1.59/bcprov-ext-jdk15on-1.59.jar
      [get] To: <https://builds.apache.org/job/POI-DSL-1.8/ws/compile-lib/bcprov-ext-jdk15on-1.59.jar>
      [get] Getting: https://repo1.maven.org/maven2/org/bouncycastle/bcpkix-jdk15on/1.59/bcpkix-jdk15on-1.59.jar
      [get] To: <https://builds.apache.org/job/POI-DSL-1.8/ws/compile-lib/bcpkix-jdk15on-1.59.jar>
      [get] Getting: https://repo1.maven.org/maven2/org/apache/santuario/xmlsec/2.1.0/xmlsec-2.1.0.jar
      [get] To: <https://builds.apache.org/job/POI-DSL-1.8/ws/compile-lib/xmlsec-2.1.0.jar>
      [get] Getting: https://repo1.maven.org/maven2/org/slf4j/slf4j-api/1.7.25/slf4j-api-1.7.25.jar
      [get] To: <https://builds.apache.org/job/POI-DSL-1.8/ws/compile-lib/slf4j-api-1.7.25.jar>

check-ooxml-jars:

fetch-ooxml-jars:
      [get] Getting: https://repo1.maven.org/maven2/com/github/virtuald/curvesapi/1.05/curvesapi-1.05.jar
      [get] To: <https://builds.apache.org/job/POI-DSL-1.8/349/artifact/ooxml-lib/curvesapi-1.05.jar>
      [get] Getting: https://repo1.maven.org/maven2/org/apache/xmlbeans/xmlbeans/2.6.0/xmlbeans-2.6.0.jar
      [get] To: <https://builds.apache.org/job/POI-DSL-1.8/349/artifact/ooxml-lib/xmlbeans-2.6.0.jar.orig>
      [zip] Building zip: <https://builds.apache.org/job/POI-DSL-1.8/349/artifact/ooxml-lib/xmlbeans-2.6.0.jar>

init:
    [mkdir] Created dir: <https://builds.apache.org/job/POI-DSL-1.8/ws/build>
    [mkdir] Created dir: <https://builds.apache.org/job/POI-DSL-1.8/ws/build/classes>
    [mkdir] Created dir: <https://builds.apache.org/job/POI-DSL-1.8/ws/build/test-classes>
    [mkdir] Created dir: <https://builds.apache.org/job/POI-DSL-1.8/ws/build/test-results>
    [mkdir] Created dir: <https://builds.apache.org/job/POI-DSL-1.8/ws/build/scratchpad-classes>
    [mkdir] Created dir: <https://builds.apache.org/job/POI-DSL-1.8/ws/build/scratchpad-test-classes>
    [mkdir] Created dir: <https://builds.apache.org/job/POI-DSL-1.8/ws/build/scratchpad-test-results>
    [mkdir] Created dir: <https://builds.apache.org/job/POI-DSL-1.8/ws/build/geometry-java>
    [mkdir] Created dir: <https://builds.apache.org/job/POI-DSL-1.8/ws/build/ooxml-classes>
    [mkdir] Created dir: <https://builds.apache.org/job/POI-DSL-1.8/ws/build/ooxml-test-classes>
    [mkdir] Created dir: <https://builds.apache.org/job/POI-DSL-1.8/ws/build/ooxml-test-results>
    [mkdir] Created dir: <https://builds.apache.org/job/POI-DSL-1.8/ws/build/excelant-classes>
    [mkdir] Created dir: <https://builds.apache.org/job/POI-DSL-1.8/ws/build/excelant-test-classes>
    [mkdir] Created dir: <https://builds.apache.org/job/POI-DSL-1.8/ws/build/excelant-test-results>
    [mkdir] Created dir: <https://builds.apache.org/job/POI-DSL-1.8/ws/build/examples-classes>
    [mkdir] Created dir: <https://builds.apache.org/job/POI-DSL-1.8/ws/build/integration-test-classes>
    [mkdir] Created dir: <https://builds.apache.org/job/POI-DSL-1.8/349/artifact/build/integration-test-results>
    [mkdir] Created dir: <https://builds.apache.org/job/POI-DSL-1.8/ws/build/dist>
    [mkdir] Created dir: <https://builds.apache.org/job/POI-DSL-1.8/ws/build/tmp/site/build/site>
     [echo] Using Ant: Apache Ant(TM) version 1.9.9 compiled on February 2 2017 from /home/jenkins/tools/ant/apache-ant-1.9.9, Ant detected Java 1.8 (may be different than actual Java sometimes...)
     [echo] Using Java: 1.8.0_152/1.8.0_152-b16/25.152-b16/Java HotSpot(TM) 64-Bit Server VM from Oracle Corporation on Linux: 3.13.0-132-generic

compile-main:
    [javac] Compiling 1212 source files to <https://builds.apache.org/job/POI-DSL-1.8/ws/build/classes>
    [javac] Note: Some input files use or override a deprecated API.
    [javac] Note: Recompile with -Xlint:deprecation for details.
    [javac] Note: Some input files use unchecked or unsafe operations.
    [javac] Note: Recompile with -Xlint:unchecked for details.
    [javac] Compiling 540 source files to <https://builds.apache.org/job/POI-DSL-1.8/ws/build/test-classes>
    [javac] Note: Some input files use or override a deprecated API.
    [javac] Note: Recompile with -Xlint:deprecation for details.
     [copy] Copying 4 files to <https://builds.apache.org/job/POI-DSL-1.8/ws/build/classes>

check-ooxml-xsds:

fetch-ooxml-xsds:
      [get] Getting: http://www.ecma-international.org/publications/files/ECMA-ST/Office%20Open%20XML%201st%20edition%20Part%204%20(PDF).zip
      [get] To: <https://builds.apache.org/job/POI-DSL-1.8/349/artifact/ooxml-lib/OfficeOpenXML-Part4.zip>
      [get] Getting: http://www.ecma-international.org/publications/files/ECMA-ST/Office%20Open%20XML%201st%20edition%20Part%202%20(PDF).zip
      [get] To: <https://builds.apache.org/job/POI-DSL-1.8/349/artifact/ooxml-lib/OfficeOpenXML-Part2.zip>
      [get] Getting: https://www.w3.org/TR/2002/REC-xmldsig-core-20020212/xmldsig-core-schema.xsd
      [get] To: <https://builds.apache.org/job/POI-DSL-1.8/349/artifact/ooxml-lib/xmldsig-core-schema.xsd>
      [get] Getting: http://uri.etsi.org/01903/v1.3.2/XAdES.xsd
      [get] To: <https://builds.apache.org/job/POI-DSL-1.8/349/artifact/ooxml-lib/XAdES.xsd>
      [get] Getting: http://uri.etsi.org/01903/v1.4.1/XAdESv141.xsd
      [get] To: <https://builds.apache.org/job/POI-DSL-1.8/349/artifact/ooxml-lib/XAdESv141.xsd>
    [unzip] Expanding: <https://builds.apache.org/job/POI-DSL-1.8/349/artifact/ooxml-lib/OfficeOpenXML-Part4.zip> into <https://builds.apache.org/job/POI-DSL-1.8/349/artifact/ooxml-lib>
    [unzip] Expanding: <https://builds.apache.org/job/POI-DSL-1.8/349/artifact/ooxml-lib/OfficeOpenXML-Part2.zip> into <https://builds.apache.org/job/POI-DSL-1.8/349/artifact/ooxml-lib>
    [unzip] Expanding: <https://builds.apache.org/job/POI-DSL-1.8/349/artifact/ooxml-lib/OfficeOpenXML-Part4.zip> into <https://builds.apache.org/job/POI-DSL-1.8/349/artifact/ooxml-lib>

generate-geometry:

compile-scratchpad:
    [javac] Compiling 488 source files to <https://builds.apache.org/job/POI-DSL-1.8/ws/build/scratchpad-classes>
    [javac] Note: Some input files use or override a deprecated API.
    [javac] Note: Recompile with -Xlint:deprecation for details.
    [javac] Compiling 190 source files to <https://builds.apache.org/job/POI-DSL-1.8/ws/build/scratchpad-test-classes>
    [javac] Note: Some input files use or override a deprecated API.
    [javac] Note: Recompile with -Xlint:deprecation for details.
     [copy] Copying 2 files to <https://builds.apache.org/job/POI-DSL-1.8/ws/build/scratchpad-classes>

check-compiled-ooxml-xsds:

compile-ooxml-xsds:
    [mkdir] Created dir: <https://builds.apache.org/job/POI-DSL-1.8/ws/build/xmlbean-xsds>
    [mkdir] Created dir: <https://builds.apache.org/job/POI-DSL-1.8/ws/build/xmlbean-sources>
    [mkdir] Created dir: <https://builds.apache.org/job/POI-DSL-1.8/ws/build/xmlbean-classes>
     [copy] Copying 3 files to <https://builds.apache.org/job/POI-DSL-1.8/ws/build/xmlbean-xsds>
     [copy] Copying 87 resources to <https://builds.apache.org/job/POI-DSL-1.8/ws/build/xmlbean-xsds>
  [xmlbean] Time to build schema type system: 2.194 seconds
  [xmlbean] Time to generate code: 5.233 seconds
     [copy] Copying 9 files to <https://builds.apache.org/job/POI-DSL-1.8/ws/build/xmlbean-sources>
     [echo] Forking javac with max heap size 1536m
    [javac] Compiling 4585 source files to <https://builds.apache.org/job/POI-DSL-1.8/ws/build/xmlbean-classes>
    [javac] Note: <https://builds.apache.org/job/POI-DSL-1.8/ws/build/xmlbean-sources/org/apache/poi/POIXMLTypeLoader.java> uses or overrides a deprecated API.
    [javac] Note: Recompile with -Xlint:deprecation for details.
      [jar] Building jar: <https://builds.apache.org/job/POI-DSL-1.8/349/artifact/ooxml-lib/ooxml-schemas-1.4.jar>
      [jar] Building jar: <https://builds.apache.org/job/POI-DSL-1.8/349/artifact/ooxml-lib/ooxml-schemas-1.4-sources.jar>
   [delete] Deleting directory <https://builds.apache.org/job/POI-DSL-1.8/ws/build/xmlbean-xsds>
   [delete] Deleting directory <https://builds.apache.org/job/POI-DSL-1.8/ws/build/xmlbean-sources>
   [delete] Deleting directory <https://builds.apache.org/job/POI-DSL-1.8/ws/build/xmlbean-classes>
    [mkdir] Created dir: <https://builds.apache.org/job/POI-DSL-1.8/ws/build/xmlbean-xsds>
    [mkdir] Created dir: <https://builds.apache.org/job/POI-DSL-1.8/ws/build/xmlbean-sources>
    [mkdir] Created dir: <https://builds.apache.org/job/POI-DSL-1.8/ws/build/xmlbean-classes>
     [copy] Copying 10 files to <https://builds.apache.org/job/POI-DSL-1.8/ws/build/xmlbean-xsds>
     [copy] Copying 2 resources to <https://builds.apache.org/job/POI-DSL-1.8/ws/build/xmlbean-xsds>
  [xmlbean] Time to build schema type system: 0.756 seconds
  [xmlbean] Time to generate code: 0.308 seconds
     [copy] Copying 9 files to <https://builds.apache.org/job/POI-DSL-1.8/ws/build/xmlbean-sources>
     [echo] Forking javac with max heap size 1536m
    [javac] Compiling 381 source files to <https://builds.apache.org/job/POI-DSL-1.8/ws/build/xmlbean-classes>
    [javac] Note: <https://builds.apache.org/job/POI-DSL-1.8/ws/build/xmlbean-sources/org/apache/poi/POIXMLTypeLoader.java> uses or overrides a deprecated API.
    [javac] Note: Recompile with -Xlint:deprecation for details.
      [jar] Building jar: <https://builds.apache.org/job/POI-DSL-1.8/349/artifact/ooxml-lib/ooxml-security-1.1.jar>
      [jar] Building jar: <https://builds.apache.org/job/POI-DSL-1.8/349/artifact/ooxml-lib/ooxml-security-1.1-sources.jar>
   [delete] Deleting directory <https://builds.apache.org/job/POI-DSL-1.8/ws/build/xmlbean-xsds>
   [delete] Deleting directory <https://builds.apache.org/job/POI-DSL-1.8/ws/build/xmlbean-sources>
   [delete] Deleting directory <https://builds.apache.org/job/POI-DSL-1.8/ws/build/xmlbean-classes>

compile-ooxml:
    [javac] Compiling 539 source files to <https://builds.apache.org/job/POI-DSL-1.8/ws/build/ooxml-classes>
    [javac] Note: Some input files use or override a deprecated API.
    [javac] Note: Recompile with -Xlint:deprecation for details.
    [javac] Compiling 248 source files to <https://builds.apache.org/job/POI-DSL-1.8/ws/build/ooxml-test-classes>
    [javac] Note: Some input files use or override a deprecated API.
    [javac] Note: Recompile with -Xlint:deprecation for details.
     [copy] Copying 3 files to <https://builds.apache.org/job/POI-DSL-1.8/ws/build/ooxml-classes>

compile-examples:
    [javac] Compiling 151 source files to <https://builds.apache.org/job/POI-DSL-1.8/ws/build/examples-classes>
    [javac] Note: <https://builds.apache.org/job/POI-DSL-1.8/ws/src/examples/src/org/apache/poi/xssf/eventusermodel/examples/FromHowTo.java> uses or overrides a deprecated API.
    [javac] Note: Recompile with -Xlint:deprecation for details.
     [copy] Copying 1 file to <https://builds.apache.org/job/POI-DSL-1.8/ws/build/examples-classes>

compile-excelant:
    [javac] Compiling 14 source files to <https://builds.apache.org/job/POI-DSL-1.8/ws/build/excelant-classes>
    [javac] Compiling 13 source files to <https://builds.apache.org/job/POI-DSL-1.8/ws/build/excelant-test-classes>
     [copy] Copying 1 file to <https://builds.apache.org/job/POI-DSL-1.8/ws/build/excelant-classes>

compile:

-compile-ooxml-lite-check:

compile-ooxml-lite:
     [echo] Running ooxml-lite generator
    [mkdir] Created dir: <https://builds.apache.org/job/POI-DSL-1.8/ws/build/ooxml-lite-merged>
      [jar] Building jar: <https://builds.apache.org/job/POI-DSL-1.8/ws/build/ooxml-lite-merged/ooxml-lite-merged.jar>
     [java] Collecting unit tests from <https://builds.apache.org/job/POI-DSL-1.8/ws/build/ooxml-test-classes>
     [java] Inner class org.apache.poi.TestPOIXMLDocument$UncaughtHandler.class not included
     [java] Inner class org.apache.poi.dev.TestOOXMLPrettyPrint$1.class not included
     [java] Inner class org.apache.poi.dev.TestOOXMLLister$1.class not included
     [java] Inner class org.apache.poi.sl.TestOleShape$1.class not included
     [java] Inner class org.apache.poi.sl.TestOleShape$Api.class not included
     [java] Class org.apache.poi.benchmark.generated.AddImageBench_jmhType does not derive from TestCase and does not have a @Test annotation
     [java] Inner class org.apache.poi.xssf.usermodel.TestMatrixFormulasFromXMLSpreadsheet$1.class not included
     [java] Inner class org.apache.poi.xssf.usermodel.TestMatrixFormulasFromXMLSpreadsheet$Navigator.class not included
     [java] Inner class org.apache.poi.TestPOIXMLDocument$1.class not included
     [java] Found 225 classes
     [java] SLF4J: Failed to load class "org.slf4j.impl.StaticLoggerBinder".
     [java] SLF4J: Defaulting to no-operation (NOP) logger implementation
     [java] SLF4J: See http://www.slf4j.org/codes.html#StaticLoggerBinder for further details.
     [java] Exception in thread "main" java.lang.RuntimeException: Tests did not succeed, cannot build ooxml-lite jar
     [java] at org.apache.poi.util.OOXMLLite.build(OOXMLLite.java:151)
     [java] at org.apache.poi.util.OOXMLLite.main(OOXMLLite.java:94)
     [java] .......................I............................E.................................................................................................................III....................................................................................I............................................................................I.................................................I.............................................................................................................I.............................................I............................................................................................................................................I....I.......I.................I.................................................................................I...............................................................................................................................................................................................................................................I......II...........I.I........................I.........I.....I..........................................................................................................................................................................................I..............III.I..I.......I.......I.....I................................................................................................................................................................................................................................................................................................................................................................................................................................................................................................................................................................I.I...I...........................................................................................I.............................................................................................................................................................................................................................................................................................................................................................................................I..I..I.I......................................
     [java] Time: 130.888
     [java] There was 1 failure:
     [java] 1) testCopyNullFontSize(org.apache.poi.xslf.usermodel.TestXSLFTextRun)
     [java] java.lang.IllegalStateException: Could not initialize plugin: interface org.mockito.plugins.MockMaker
     [java] at org.mockito.internal.configuration.plugins.PluginLoader$1.invoke(PluginLoader.java:60)
     [java] at com.sun.proxy.$Proxy16.isTypeMockable(Unknown Source)
     [java] at org.mockito.internal.util.MockUtil.typeMockabilityOf(MockUtil.java:29)
     [java] at org.mockito.internal.util.MockCreationValidator.validateType(MockCreationValidator.java:22)
     [java] at org.mockito.internal.creation.MockSettingsImpl.validatedSettings(MockSettingsImpl.java:232)
     [java] at org.mockito.internal.creation.MockSettingsImpl.build(MockSettingsImpl.java:226)
     [java] at org.mockito.internal.MockitoCore.mock(MockitoCore.java:64)
     [java] at org.mockito.Mockito.mock(Mockito.java:1821)
     [java] at org.mockito.Mockito.mock(Mockito.java:1734)
     [java] at org.apache.poi.xslf.usermodel.TestXSLFTextRun.testCopyNullFontSize(TestXSLFTextRun.java:109)
     [java] at sun.reflect.NativeMethodAccessorImpl.invoke0(Native Method)
     [java] at sun.reflect.NativeMethodAccessorImpl.invoke(NativeMethodAccessorImpl.java:62)
     [java] at sun.reflect.DelegatingMethodAccessorImpl.invoke(DelegatingMethodAccessorImpl.java:43)
     [java] at java.lang.reflect.Method.invoke(Method.java:498)
     [java] at org.junit.runners.model.FrameworkMethod$1.runReflectiveCall(FrameworkMethod.java:50)
     [java] at org.junit.internal.runners.model.ReflectiveCallable.run(ReflectiveCallable.java:12)
     [java] at org.junit.runners.model.FrameworkMethod.invokeExplosively(FrameworkMethod.java:47)
     [java] at org.junit.internal.runners.statements.InvokeMethod.evaluate(InvokeMethod.java:17)
     [java] at org.junit.runners.ParentRunner.runLeaf(ParentRunner.java:325)
     [java] at org.junit.runners.BlockJUnit4ClassRunner.runChild(BlockJUnit4ClassRunner.java:78)
     [java] at org.junit.runners.BlockJUnit4ClassRunner.runChild(BlockJUnit4ClassRunner.java:57)
     [java] at org.junit.runners.ParentRunner$3.run(ParentRunner.java:290)
     [java] at org.junit.runners.ParentRunner$1.schedule(ParentRunner.java:71)
     [java] at org.junit.runners.ParentRunner.runChildren(ParentRunner.java:288)
     [java] at org.junit.runners.ParentRunner.access$000(ParentRunner.java:58)
     [java] at org.junit.runners.ParentRunner$2.evaluate(ParentRunner.java:268)
     [java] at org.junit.runners.ParentRunner.run(ParentRunner.java:363)
     [java] at org.junit.runners.Suite.runChild(Suite.java:128)
     [java] at org.junit.runners.Suite.runChild(Suite.java:27)
     [java] at org.junit.runners.ParentRunner$3.run(ParentRunner.java:290)
     [java] at org.junit.runners.ParentRunner$1.schedule(ParentRunner.java:71)
     [java] at org.junit.runners.ParentRunner.runChildren(ParentRunner.java:288)
     [java] at org.junit.runners.ParentRunner.access$000(ParentRunner.java:58)
     [java] at org.junit.runners.ParentRunner$2.evaluate(ParentRunner.java:268)
     [java] at org.junit.runners.ParentRunner.run(ParentRunner.java:363)
     [java] at org.junit.runner.JUnitCore.run(JUnitCore.java:137)
     [java] at org.junit.runner.JUnitCore.run(JUnitCore.java:115)
     [java] at org.junit.runner.JUnitCore.run(JUnitCore.java:105)
     [java] at org.junit.runner.JUnitCore.run(JUnitCore.java:94)
     [java] at org.apache.poi.util.OOXMLLite.build(OOXMLLite.java:149)
     [java] at org.apache.poi.util.OOXMLLite.main(OOXMLLite.java:94)
     [java] Caused by: java.lang.NoClassDefFoundError: net/bytebuddy/dynamic/loading/ClassLoadingStrategy
     [java] at org.mockito.internal.creation.bytebuddy.SubclassByteBuddyMockMaker.<init>(SubclassByteBuddyMockMaker.java:33)
     [java] at org.mockito.internal.creation.bytebuddy.ByteBuddyMockMaker.<init>(ByteBuddyMockMaker.java:21)
     [java] at sun.reflect.NativeConstructorAccessorImpl.newInstance0(Native Method)
     [java] at sun.reflect.NativeConstructorAccessorImpl.newInstance(NativeConstructorAccessorImpl.java:62)
     [java] at sun.reflect.DelegatingConstructorAccessorImpl.newInstance(DelegatingConstructorAccessorImpl.java:45)
     [java] at java.lang.reflect.Constructor.newInstance(Constructor.java:423)
     [java] at java.lang.Class.newInstance(Class.java:442)
     [java] at org.mockito.internal.configuration.plugins.DefaultMockitoPlugins.create(DefaultMockitoPlugins.java:57)
     [java] at org.mockito.internal.configuration.plugins.DefaultMockitoPlugins.getDefaultPlugin(DefaultMockitoPlugins.java:35)
     [java] at org.mockito.internal.configuration.plugins.PluginLoader.loadPlugin(PluginLoader.java:53)
     [java] at org.mockito.internal.configuration.plugins.PluginRegistry.<init>(PluginRegistry.java:20)
     [java] at org.mockito.internal.configuration.plugins.Plugins.<clinit>(Plugins.java:18)
     [java] at org.mockito.internal.util.MockUtil.<clinit>(MockUtil.java:24)
     [java] ... 38 more
     [java] Caused by: java.lang.ClassNotFoundException: net.bytebuddy.dynamic.loading.ClassLoadingStrategy
     [java] at java.net.URLClassLoader.findClass(URLClassLoader.java:381)
     [java] at java.lang.ClassLoader.loadClass(ClassLoader.java:424)
     [java] at sun.misc.Launcher$AppClassLoader.loadClass(Launcher.java:338)
     [java] at java.lang.ClassLoader.loadClass(ClassLoader.java:357)
     [java] ... 51 more
     [java]
     [java] FAILURES!!!
     [java] Tests run: 2356,  Failures: 1
     [java]

BUILD FAILED
<https://builds.apache.org/job/POI-DSL-1.8/ws/build.xml>:1523: Java returned: 1

Total time: 5 minutes 15 seconds
Build step 'Invoke Ant' marked build as failure
[FINDBUGS] Skipping publisher since build result is FAILURE
Archiving artifacts
[Fast Archiver] Compressed 61.69 MB of artifacts by 62.1% relative to #348
[WARNINGS] Skipping publisher since build result is FAILURE
Recording test results
ERROR: Step ?Publish JUnit test result report? failed: No test report files were found. Configuration error?


---------------------------------------------------------------------
To unsubscribe, e-mail: [hidden email]
For additional commands, e-mail: [hidden email]

Reply | Threaded
Open this post in threaded view
|

Jenkins build is back to normal : POI-DSL-1.8 #350

Apache Jenkins Server
See <https://builds.apache.org/job/POI-DSL-1.8/350/display/redirect?page=changes>


---------------------------------------------------------------------
To unsubscribe, e-mail: [hidden email]
For additional commands, e-mail: [hidden email]