Build failed in Jenkins: POI-DSL-1.8 #308

classic Classic list List threaded Threaded
4 messages Options
Reply | Threaded
Open this post in threaded view
|

Build failed in Jenkins: POI-DSL-1.8 #308

Apache Jenkins Server
See <https://builds.apache.org/job/POI-DSL-1.8/308/display/redirect?page=changes>

Changes:

[centic] Handle case where the JaCoCo zip file is available, but the extracted files are missing, not sure how that happens, but we see it on some CI machines...

------------------------------------------
[...truncated 1.26 MB...]
     [java] at org.apache.poi.ss.util.BaseTestCellUtil.setCellStyleProperty(BaseTestCellUtil.java:59)
     [java] at sun.reflect.NativeMethodAccessorImpl.invoke0(Native Method)
     [java] at sun.reflect.NativeMethodAccessorImpl.invoke(NativeMethodAccessorImpl.java:62)
     [java] at sun.reflect.DelegatingMethodAccessorImpl.invoke(DelegatingMethodAccessorImpl.java:43)
     [java] at java.lang.reflect.Method.invoke(Method.java:498)
     [java] at org.junit.runners.model.FrameworkMethod$1.runReflectiveCall(FrameworkMethod.java:50)
     [java] at org.junit.internal.runners.model.ReflectiveCallable.run(ReflectiveCallable.java:12)
     [java] at org.junit.runners.model.FrameworkMethod.invokeExplosively(FrameworkMethod.java:47)
     [java] at org.junit.internal.runners.statements.InvokeMethod.evaluate(InvokeMethod.java:17)
     [java] at org.junit.runners.ParentRunner.runLeaf(ParentRunner.java:325)
     [java] at org.junit.runners.BlockJUnit4ClassRunner.runChild(BlockJUnit4ClassRunner.java:78)
     [java] at org.junit.runners.BlockJUnit4ClassRunner.runChild(BlockJUnit4ClassRunner.java:57)
     [java] at org.junit.runners.ParentRunner$3.run(ParentRunner.java:290)
     [java] at org.junit.runners.ParentRunner$1.schedule(ParentRunner.java:71)
     [java] at org.junit.runners.ParentRunner.runChildren(ParentRunner.java:288)
     [java] at org.junit.runners.ParentRunner.access$000(ParentRunner.java:58)
     [java] at org.junit.runners.ParentRunner$2.evaluate(ParentRunner.java:268)
     [java] at org.junit.runners.ParentRunner.run(ParentRunner.java:363)
     [java] at org.junit.runners.Suite.runChild(Suite.java:128)
     [java] at org.junit.runners.Suite.runChild(Suite.java:27)
     [java] at org.junit.runners.ParentRunner$3.run(ParentRunner.java:290)
     [java] at org.junit.runners.ParentRunner$1.schedule(ParentRunner.java:71)
     [java] at org.junit.runners.ParentRunner.runChildren(ParentRunner.java:288)
     [java] at org.junit.runners.ParentRunner.access$000(ParentRunner.java:58)
     [java] at org.junit.runners.ParentRunner$2.evaluate(ParentRunner.java:268)
     [java] at org.junit.runners.ParentRunner.run(ParentRunner.java:363)
     [java] at org.junit.runner.JUnitCore.run(JUnitCore.java:137)
     [java] at org.junit.runner.JUnitCore.run(JUnitCore.java:115)
     [java] at org.junit.runner.JUnitCore.run(JUnitCore.java:105)
     [java] at org.junit.runner.JUnitCore.run(JUnitCore.java:94)
     [java] at org.apache.poi.util.OOXMLLite.build(OOXMLLite.java:149)
     [java] at org.apache.poi.util.OOXMLLite.main(OOXMLLite.java:94)
     [java] Caused by: java.io.IOException: Permission denied
     [java] at java.io.UnixFileSystem.createFileExclusively(Native Method)
     [java] at java.io.File.createTempFile(File.java:2024)
     [java] at org.apache.poi.util.DefaultTempFileCreationStrategy.createTempFile(DefaultTempFileCreationStrategy.java:110)
     [java] at org.apache.poi.util.TempFile.createTempFile(TempFile.java:66)
     [java] at org.apache.poi.xssf.streaming.SheetDataWriter.createTempFile(SheetDataWriter.java:87)
     [java] at org.apache.poi.xssf.streaming.SheetDataWriter.<init>(SheetDataWriter.java:70)
     [java] at org.apache.poi.xssf.streaming.SheetDataWriter.<init>(SheetDataWriter.java:75)
     [java] at org.apache.poi.xssf.streaming.SXSSFWorkbook.createSheetDataWriter(SXSSFWorkbook.java:324)
     [java] at org.apache.poi.xssf.streaming.SXSSFSheet.<init>(SXSSFSheet.java:80)
     [java] at org.apache.poi.xssf.streaming.SXSSFWorkbook.createAndRegisterSXSSFSheet(SXSSFWorkbook.java:646)
     [java] ... 34 more
     [java] 314) createCell(org.apache.poi.ss.util.TestSXSSFCellUtil)
     [java] java.lang.RuntimeException: java.io.IOException: Permission denied
     [java] at org.apache.poi.xssf.streaming.SXSSFWorkbook.createAndRegisterSXSSFSheet(SXSSFWorkbook.java:650)
     [java] at org.apache.poi.xssf.streaming.SXSSFWorkbook.createSheet(SXSSFWorkbook.java:638)
     [java] at org.apache.poi.xssf.streaming.SXSSFWorkbook.createSheet(SXSSFWorkbook.java:84)
     [java] at org.apache.poi.ss.util.BaseTestCellUtil.createCell(BaseTestCellUtil.java:176)
     [java] at sun.reflect.NativeMethodAccessorImpl.invoke0(Native Method)
     [java] at sun.reflect.NativeMethodAccessorImpl.invoke(NativeMethodAccessorImpl.java:62)
     [java] at sun.reflect.DelegatingMethodAccessorImpl.invoke(DelegatingMethodAccessorImpl.java:43)
     [java] at java.lang.reflect.Method.invoke(Method.java:498)
     [java] at org.junit.runners.model.FrameworkMethod$1.runReflectiveCall(FrameworkMethod.java:50)
     [java] at org.junit.internal.runners.model.ReflectiveCallable.run(ReflectiveCallable.java:12)
     [java] at org.junit.runners.model.FrameworkMethod.invokeExplosively(FrameworkMethod.java:47)
     [java] at org.junit.internal.runners.statements.InvokeMethod.evaluate(InvokeMethod.java:17)
     [java] at org.junit.runners.ParentRunner.runLeaf(ParentRunner.java:325)
     [java] at org.junit.runners.BlockJUnit4ClassRunner.runChild(BlockJUnit4ClassRunner.java:78)
     [java] at org.junit.runners.BlockJUnit4ClassRunner.runChild(BlockJUnit4ClassRunner.java:57)
     [java] at org.junit.runners.ParentRunner$3.run(ParentRunner.java:290)
     [java] at org.junit.runners.ParentRunner$1.schedule(ParentRunner.java:71)
     [java] at org.junit.runners.ParentRunner.runChildren(ParentRunner.java:288)
     [java] at org.junit.runners.ParentRunner.access$000(ParentRunner.java:58)
     [java] at org.junit.runners.ParentRunner$2.evaluate(ParentRunner.java:268)
     [java] at org.junit.runners.ParentRunner.run(ParentRunner.java:363)
     [java] at org.junit.runners.Suite.runChild(Suite.java:128)
     [java] at org.junit.runners.Suite.runChild(Suite.java:27)
     [java] at org.junit.runners.ParentRunner$3.run(ParentRunner.java:290)
     [java] at org.junit.runners.ParentRunner$1.schedule(ParentRunner.java:71)
     [java] at org.junit.runners.ParentRunner.runChildren(ParentRunner.java:288)
     [java] at org.junit.runners.ParentRunner.access$000(ParentRunner.java:58)
     [java] at org.junit.runners.ParentRunner$2.evaluate(ParentRunner.java:268)
     [java] at org.junit.runners.ParentRunner.run(ParentRunner.java:363)
     [java] at org.junit.runner.JUnitCore.run(JUnitCore.java:137)
     [java] at org.junit.runner.JUnitCore.run(JUnitCore.java:115)
     [java] at org.junit.runner.JUnitCore.run(JUnitCore.java:105)
     [java] at org.junit.runner.JUnitCore.run(JUnitCore.java:94)
     [java] at org.apache.poi.util.OOXMLLite.build(OOXMLLite.java:149)
     [java] at org.apache.poi.util.OOXMLLite.main(OOXMLLite.java:94)
     [java] Caused by: java.io.IOException: Permission denied
     [java] at java.io.UnixFileSystem.createFileExclusively(Native Method)
     [java] at java.io.File.createTempFile(File.java:2024)
     [java] at org.apache.poi.util.DefaultTempFileCreationStrategy.createTempFile(DefaultTempFileCreationStrategy.java:110)
     [java] at org.apache.poi.util.TempFile.createTempFile(TempFile.java:66)
     [java] at org.apache.poi.xssf.streaming.SheetDataWriter.createTempFile(SheetDataWriter.java:87)
     [java] at org.apache.poi.xssf.streaming.SheetDataWriter.<init>(SheetDataWriter.java:70)
     [java] at org.apache.poi.xssf.streaming.SheetDataWriter.<init>(SheetDataWriter.java:75)
     [java] at org.apache.poi.xssf.streaming.SXSSFWorkbook.createSheetDataWriter(SXSSFWorkbook.java:324)
     [java] at org.apache.poi.xssf.streaming.SXSSFSheet.<init>(SXSSFSheet.java:80)
     [java] at org.apache.poi.xssf.streaming.SXSSFWorkbook.createAndRegisterSXSSFSheet(SXSSFWorkbook.java:646)
     [java] ... 34 more
     [java] 315) setCellStyleProperties(org.apache.poi.ss.util.TestSXSSFCellUtil)
     [java] java.lang.RuntimeException: java.io.IOException: Permission denied
     [java] at org.apache.poi.xssf.streaming.SXSSFWorkbook.createAndRegisterSXSSFSheet(SXSSFWorkbook.java:650)
     [java] at org.apache.poi.xssf.streaming.SXSSFWorkbook.createSheet(SXSSFWorkbook.java:638)
     [java] at org.apache.poi.xssf.streaming.SXSSFWorkbook.createSheet(SXSSFWorkbook.java:84)
     [java] at org.apache.poi.ss.util.BaseTestCellUtil.setCellStyleProperties(BaseTestCellUtil.java:111)
     [java] at sun.reflect.NativeMethodAccessorImpl.invoke0(Native Method)
     [java] at sun.reflect.NativeMethodAccessorImpl.invoke(NativeMethodAccessorImpl.java:62)
     [java] at sun.reflect.DelegatingMethodAccessorImpl.invoke(DelegatingMethodAccessorImpl.java:43)
     [java] at java.lang.reflect.Method.invoke(Method.java:498)
     [java] at org.junit.runners.model.FrameworkMethod$1.runReflectiveCall(FrameworkMethod.java:50)
     [java] at org.junit.internal.runners.model.ReflectiveCallable.run(ReflectiveCallable.java:12)
     [java] at org.junit.runners.model.FrameworkMethod.invokeExplosively(FrameworkMethod.java:47)
     [java] at org.junit.internal.runners.statements.InvokeMethod.evaluate(InvokeMethod.java:17)
     [java] at org.junit.runners.ParentRunner.runLeaf(ParentRunner.java:325)
     [java] at org.junit.runners.BlockJUnit4ClassRunner.runChild(BlockJUnit4ClassRunner.java:78)
     [java] at org.junit.runners.BlockJUnit4ClassRunner.runChild(BlockJUnit4ClassRunner.java:57)
     [java] at org.junit.runners.ParentRunner$3.run(ParentRunner.java:290)
     [java] at org.junit.runners.ParentRunner$1.schedule(ParentRunner.java:71)
     [java] at org.junit.runners.ParentRunner.runChildren(ParentRunner.java:288)
     [java] at org.junit.runners.ParentRunner.access$000(ParentRunner.java:58)
     [java] at org.junit.runners.ParentRunner$2.evaluate(ParentRunner.java:268)
     [java] at org.junit.runners.ParentRunner.run(ParentRunner.java:363)
     [java] at org.junit.runners.Suite.runChild(Suite.java:128)
     [java] at org.junit.runners.Suite.runChild(Suite.java:27)
     [java] at org.junit.runners.ParentRunner$3.run(ParentRunner.java:290)
     [java] at org.junit.runners.ParentRunner$1.schedule(ParentRunner.java:71)
     [java] at org.junit.runners.ParentRunner.runChildren(ParentRunner.java:288)
     [java] at org.junit.runners.ParentRunner.access$000(ParentRunner.java:58)
     [java] at org.junit.runners.ParentRunner$2.evaluate(ParentRunner.java:268)
     [java] at org.junit.runners.ParentRunner.run(ParentRunner.java:363)
     [java] at org.junit.runner.JUnitCore.run(JUnitCore.java:137)
     [java] at org.junit.runner.JUnitCore.run(JUnitCore.java:115)
     [java] at org.junit.runner.JUnitCore.run(JUnitCore.java:105)
     [java] at org.junit.runner.JUnitCore.run(JUnitCore.java:94)
     [java] at org.apache.poi.util.OOXMLLite.build(OOXMLLite.java:149)
     [java] at org.apache.poi.util.OOXMLLite.main(OOXMLLite.java:94)
     [java] Caused by: java.io.IOException: Permission denied
     [java] at java.io.UnixFileSystem.createFileExclusively(Native Method)
     [java] at java.io.File.createTempFile(File.java:2024)
     [java] at org.apache.poi.util.DefaultTempFileCreationStrategy.createTempFile(DefaultTempFileCreationStrategy.java:110)
     [java] at org.apache.poi.util.TempFile.createTempFile(TempFile.java:66)
     [java] at org.apache.poi.xssf.streaming.SheetDataWriter.createTempFile(SheetDataWriter.java:87)
     [java] at org.apache.poi.xssf.streaming.SheetDataWriter.<init>(SheetDataWriter.java:70)
     [java] at org.apache.poi.xssf.streaming.SheetDataWriter.<init>(SheetDataWriter.java:75)
     [java] at org.apache.poi.xssf.streaming.SXSSFWorkbook.createSheetDataWriter(SXSSFWorkbook.java:324)
     [java] at org.apache.poi.xssf.streaming.SXSSFSheet.<init>(SXSSFSheet.java:80)
     [java] at org.apache.poi.xssf.streaming.SXSSFWorkbook.createAndRegisterSXSSFSheet(SXSSFWorkbook.java:646)
     [java] ... 34 more
     [java] 316) setFont(org.apache.poi.ss.util.TestSXSSFCellUtil)
     [java] java.lang.RuntimeException: java.io.IOException: Permission denied
     [java] at org.apache.poi.xssf.streaming.SXSSFWorkbook.createAndRegisterSXSSFSheet(SXSSFWorkbook.java:650)
     [java] at org.apache.poi.xssf.streaming.SXSSFWorkbook.createSheet(SXSSFWorkbook.java:638)
     [java] at org.apache.poi.xssf.streaming.SXSSFWorkbook.createSheet(SXSSFWorkbook.java:84)
     [java] at org.apache.poi.ss.util.BaseTestCellUtil.setFont(BaseTestCellUtil.java:301)
     [java] at sun.reflect.NativeMethodAccessorImpl.invoke0(Native Method)
     [java] at sun.reflect.NativeMethodAccessorImpl.invoke(NativeMethodAccessorImpl.java:62)
     [java] at sun.reflect.DelegatingMethodAccessorImpl.invoke(DelegatingMethodAccessorImpl.java:43)
     [java] at java.lang.reflect.Method.invoke(Method.java:498)
     [java] at org.junit.runners.model.FrameworkMethod$1.runReflectiveCall(FrameworkMethod.java:50)
     [java] at org.junit.internal.runners.model.ReflectiveCallable.run(ReflectiveCallable.java:12)
     [java] at org.junit.runners.model.FrameworkMethod.invokeExplosively(FrameworkMethod.java:47)
     [java] at org.junit.internal.runners.statements.InvokeMethod.evaluate(InvokeMethod.java:17)
     [java] at org.junit.runners.ParentRunner.runLeaf(ParentRunner.java:325)
     [java] at org.junit.runners.BlockJUnit4ClassRunner.runChild(BlockJUnit4ClassRunner.java:78)
     [java] at org.junit.runners.BlockJUnit4ClassRunner.runChild(BlockJUnit4ClassRunner.java:57)
     [java] at org.junit.runners.ParentRunner$3.run(ParentRunner.java:290)
     [java] at org.junit.runners.ParentRunner$1.schedule(ParentRunner.java:71)
     [java] at org.junit.runners.ParentRunner.runChildren(ParentRunner.java:288)
     [java] at org.junit.runners.ParentRunner.access$000(ParentRunner.java:58)
     [java] at org.junit.runners.ParentRunner$2.evaluate(ParentRunner.java:268)
     [java] at org.junit.runners.ParentRunner.run(ParentRunner.java:363)
     [java] at org.junit.runners.Suite.runChild(Suite.java:128)
     [java] at org.junit.runners.Suite.runChild(Suite.java:27)
     [java] at org.junit.runners.ParentRunner$3.run(ParentRunner.java:290)
     [java] at org.junit.runners.ParentRunner$1.schedule(ParentRunner.java:71)
     [java] at org.junit.runners.ParentRunner.runChildren(ParentRunner.java:288)
     [java] at org.junit.runners.ParentRunner.access$000(ParentRunner.java:58)
     [java] at org.junit.runners.ParentRunner$2.evaluate(ParentRunner.java:268)
     [java] at org.junit.runners.ParentRunner.run(ParentRunner.java:363)
     [java] at org.junit.runner.JUnitCore.run(JUnitCore.java:137)
     [java] at org.junit.runner.JUnitCore.run(JUnitCore.java:115)
     [java] at org.junit.runner.JUnitCore.run(JUnitCore.java:105)
     [java] at org.junit.runner.JUnitCore.run(JUnitCore.java:94)
     [java] at org.apache.poi.util.OOXMLLite.build(OOXMLLite.java:149)
     [java] at org.apache.poi.util.OOXMLLite.main(OOXMLLite.java:94)
     [java] Caused by: java.io.IOException: Permission denied
     [java] at java.io.UnixFileSystem.createFileExclusively(Native Method)
     [java] at java.io.File.createTempFile(File.java:2024)
     [java] at org.apache.poi.util.DefaultTempFileCreationStrategy.createTempFile(DefaultTempFileCreationStrategy.java:110)
     [java] at org.apache.poi.util.TempFile.createTempFile(TempFile.java:66)
     [java] at org.apache.poi.xssf.streaming.SheetDataWriter.createTempFile(SheetDataWriter.java:87)
     [java] at org.apache.poi.xssf.streaming.SheetDataWriter.<init>(SheetDataWriter.java:70)
     [java] at org.apache.poi.xssf.streaming.SheetDataWriter.<init>(SheetDataWriter.java:75)
     [java] at org.apache.poi.xssf.streaming.SXSSFWorkbook.createSheetDataWriter(SXSSFWorkbook.java:324)
     [java] at org.apache.poi.xssf.streaming.SXSSFSheet.<init>(SXSSFSheet.java:80)
     [java] at org.apache.poi.xssf.streaming.SXSSFWorkbook.createAndRegisterSXSSFSheet(SXSSFWorkbook.java:646)
     [java] ... 34 more
     [java] 317) testEmptyFile(org.apache.poi.ss.TestWorkbookFactory)
     [java] java.io.IOException: Permission denied
     [java] at java.io.UnixFileSystem.createFileExclusively(Native Method)
     [java] at java.io.File.createTempFile(File.java:2024)
     [java] at org.apache.poi.util.DefaultTempFileCreationStrategy.createTempFile(DefaultTempFileCreationStrategy.java:110)
     [java] at org.apache.poi.util.TempFile.createTempFile(TempFile.java:66)
     [java] at org.apache.poi.ss.TestWorkbookFactory.testEmptyFile(TestWorkbookFactory.java:361)
     [java] at sun.reflect.NativeMethodAccessorImpl.invoke0(Native Method)
     [java] at sun.reflect.NativeMethodAccessorImpl.invoke(NativeMethodAccessorImpl.java:62)
     [java] at sun.reflect.DelegatingMethodAccessorImpl.invoke(DelegatingMethodAccessorImpl.java:43)
     [java] at java.lang.reflect.Method.invoke(Method.java:498)
     [java] at org.junit.runners.model.FrameworkMethod$1.runReflectiveCall(FrameworkMethod.java:50)
     [java] at org.junit.internal.runners.model.ReflectiveCallable.run(ReflectiveCallable.java:12)
     [java] at org.junit.runners.model.FrameworkMethod.invokeExplosively(FrameworkMethod.java:47)
     [java] at org.junit.internal.runners.statements.InvokeMethod.evaluate(InvokeMethod.java:17)
     [java] at org.junit.runners.ParentRunner.runLeaf(ParentRunner.java:325)
     [java] at org.junit.runners.BlockJUnit4ClassRunner.runChild(BlockJUnit4ClassRunner.java:78)
     [java] at org.junit.runners.BlockJUnit4ClassRunner.runChild(BlockJUnit4ClassRunner.java:57)
     [java] at org.junit.runners.ParentRunner$3.run(ParentRunner.java:290)
     [java] at org.junit.runners.ParentRunner$1.schedule(ParentRunner.java:71)
     [java] at org.junit.runners.ParentRunner.runChildren(ParentRunner.java:288)
     [java] at org.junit.runners.ParentRunner.access$000(ParentRunner.java:58)
     [java] at org.junit.runners.ParentRunner$2.evaluate(ParentRunner.java:268)
     [java] at org.junit.runners.ParentRunner.run(ParentRunner.java:363)
     [java] at org.junit.runners.Suite.runChild(Suite.java:128)
     [java] at org.junit.runners.Suite.runChild(Suite.java:27)
     [java] at org.junit.runners.ParentRunner$3.run(ParentRunner.java:290)
     [java] at org.junit.runners.ParentRunner$1.schedule(ParentRunner.java:71)
     [java] at org.junit.runners.ParentRunner.runChildren(ParentRunner.java:288)
     [java] at org.junit.runners.ParentRunner.access$000(ParentRunner.java:58)
     [java] at org.junit.runners.ParentRunner$2.evaluate(ParentRunner.java:268)
     [java] at org.junit.runners.ParentRunner.run(ParentRunner.java:363)
     [java] at org.junit.runner.JUnitCore.run(JUnitCore.java:137)
     [java] at org.junit.runner.JUnitCore.run(JUnitCore.java:115)
     [java] at org.junit.runner.JUnitCore.run(JUnitCore.java:105)
     [java] at org.junit.runner.JUnitCore.run(JUnitCore.java:94)
     [java] at org.apache.poi.util.OOXMLLite.build(OOXMLLite.java:149)
     [java] at org.apache.poi.util.OOXMLLite.main(OOXMLLite.java:94)
     [java]
     [java] FAILURES!!!
     [java] Tests run: 2321,  Failures: 317
     [java]
     [java] Exception in thread "main" java.lang.RuntimeException: Tests did not succeed, cannot build ooxml-lite jar
     [java] at org.apache.poi.util.OOXMLLite.build(OOXMLLite.java:151)
     [java] at org.apache.poi.util.OOXMLLite.main(OOXMLLite.java:94)

BUILD FAILED
<https://builds.apache.org/job/POI-DSL-1.8/ws/build.xml>:1520: Java returned: 1

Total time: 2 minutes 21 seconds
Build step 'Invoke Ant' marked build as failure
Skipping publisher since build result is FAILURE
Archiving artifacts
[Fast Archiver] Compressed 66.32 MB of artifacts by 65.4% relative to #307
Skipping publisher since build result is FAILURE
Recording test results
ERROR: Step ‘Publish JUnit test result report’ failed: No test report files were found. Configuration error?


---------------------------------------------------------------------
To unsubscribe, e-mail: [hidden email]
For additional commands, e-mail: [hidden email]

Reply | Threaded
Open this post in threaded view
|

Build failed in Jenkins: POI-DSL-1.8 #309

Apache Jenkins Server
See <https://builds.apache.org/job/POI-DSL-1.8/309/display/redirect?page=changes>

Changes:

[fanningpj] [bug-61792] basic test

[fanningpj] [bug-61792] some changes to avoid iterating over chars of Strings

[fanningpj] upgrade to commons-codec 1.11

------------------------------------------
[...truncated 1.26 MB...]
     [java] at org.apache.poi.ss.util.BaseTestCellUtil.setCellStyleProperty(BaseTestCellUtil.java:59)
     [java] at sun.reflect.NativeMethodAccessorImpl.invoke0(Native Method)
     [java] at sun.reflect.NativeMethodAccessorImpl.invoke(NativeMethodAccessorImpl.java:62)
     [java] at sun.reflect.DelegatingMethodAccessorImpl.invoke(DelegatingMethodAccessorImpl.java:43)
     [java] at java.lang.reflect.Method.invoke(Method.java:498)
     [java] at org.junit.runners.model.FrameworkMethod$1.runReflectiveCall(FrameworkMethod.java:50)
     [java] at org.junit.internal.runners.model.ReflectiveCallable.run(ReflectiveCallable.java:12)
     [java] at org.junit.runners.model.FrameworkMethod.invokeExplosively(FrameworkMethod.java:47)
     [java] at org.junit.internal.runners.statements.InvokeMethod.evaluate(InvokeMethod.java:17)
     [java] at org.junit.runners.ParentRunner.runLeaf(ParentRunner.java:325)
     [java] at org.junit.runners.BlockJUnit4ClassRunner.runChild(BlockJUnit4ClassRunner.java:78)
     [java] at org.junit.runners.BlockJUnit4ClassRunner.runChild(BlockJUnit4ClassRunner.java:57)
     [java] at org.junit.runners.ParentRunner$3.run(ParentRunner.java:290)
     [java] at org.junit.runners.ParentRunner$1.schedule(ParentRunner.java:71)
     [java] at org.junit.runners.ParentRunner.runChildren(ParentRunner.java:288)
     [java] at org.junit.runners.ParentRunner.access$000(ParentRunner.java:58)
     [java] at org.junit.runners.ParentRunner$2.evaluate(ParentRunner.java:268)
     [java] at org.junit.runners.ParentRunner.run(ParentRunner.java:363)
     [java] at org.junit.runners.Suite.runChild(Suite.java:128)
     [java] at org.junit.runners.Suite.runChild(Suite.java:27)
     [java] at org.junit.runners.ParentRunner$3.run(ParentRunner.java:290)
     [java] at org.junit.runners.ParentRunner$1.schedule(ParentRunner.java:71)
     [java] at org.junit.runners.ParentRunner.runChildren(ParentRunner.java:288)
     [java] at org.junit.runners.ParentRunner.access$000(ParentRunner.java:58)
     [java] at org.junit.runners.ParentRunner$2.evaluate(ParentRunner.java:268)
     [java] at org.junit.runners.ParentRunner.run(ParentRunner.java:363)
     [java] at org.junit.runner.JUnitCore.run(JUnitCore.java:137)
     [java] at org.junit.runner.JUnitCore.run(JUnitCore.java:115)
     [java] at org.junit.runner.JUnitCore.run(JUnitCore.java:105)
     [java] at org.junit.runner.JUnitCore.run(JUnitCore.java:94)
     [java] at org.apache.poi.util.OOXMLLite.build(OOXMLLite.java:149)
     [java] at org.apache.poi.util.OOXMLLite.main(OOXMLLite.java:94)
     [java] Caused by: java.io.IOException: Permission denied
     [java] at java.io.UnixFileSystem.createFileExclusively(Native Method)
     [java] at java.io.File.createTempFile(File.java:2024)
     [java] at org.apache.poi.util.DefaultTempFileCreationStrategy.createTempFile(DefaultTempFileCreationStrategy.java:110)
     [java] at org.apache.poi.util.TempFile.createTempFile(TempFile.java:66)
     [java] at org.apache.poi.xssf.streaming.SheetDataWriter.createTempFile(SheetDataWriter.java:87)
     [java] at org.apache.poi.xssf.streaming.SheetDataWriter.<init>(SheetDataWriter.java:70)
     [java] at org.apache.poi.xssf.streaming.SheetDataWriter.<init>(SheetDataWriter.java:75)
     [java] at org.apache.poi.xssf.streaming.SXSSFWorkbook.createSheetDataWriter(SXSSFWorkbook.java:324)
     [java] at org.apache.poi.xssf.streaming.SXSSFSheet.<init>(SXSSFSheet.java:80)
     [java] at org.apache.poi.xssf.streaming.SXSSFWorkbook.createAndRegisterSXSSFSheet(SXSSFWorkbook.java:646)
     [java] ... 34 more
     [java] 314) createCell(org.apache.poi.ss.util.TestSXSSFCellUtil)
     [java] java.lang.RuntimeException: java.io.IOException: Permission denied
     [java] at org.apache.poi.xssf.streaming.SXSSFWorkbook.createAndRegisterSXSSFSheet(SXSSFWorkbook.java:650)
     [java] at org.apache.poi.xssf.streaming.SXSSFWorkbook.createSheet(SXSSFWorkbook.java:638)
     [java] at org.apache.poi.xssf.streaming.SXSSFWorkbook.createSheet(SXSSFWorkbook.java:84)
     [java] at org.apache.poi.ss.util.BaseTestCellUtil.createCell(BaseTestCellUtil.java:176)
     [java] at sun.reflect.NativeMethodAccessorImpl.invoke0(Native Method)
     [java] at sun.reflect.NativeMethodAccessorImpl.invoke(NativeMethodAccessorImpl.java:62)
     [java] at sun.reflect.DelegatingMethodAccessorImpl.invoke(DelegatingMethodAccessorImpl.java:43)
     [java] at java.lang.reflect.Method.invoke(Method.java:498)
     [java] at org.junit.runners.model.FrameworkMethod$1.runReflectiveCall(FrameworkMethod.java:50)
     [java] at org.junit.internal.runners.model.ReflectiveCallable.run(ReflectiveCallable.java:12)
     [java] at org.junit.runners.model.FrameworkMethod.invokeExplosively(FrameworkMethod.java:47)
     [java] at org.junit.internal.runners.statements.InvokeMethod.evaluate(InvokeMethod.java:17)
     [java] at org.junit.runners.ParentRunner.runLeaf(ParentRunner.java:325)
     [java] at org.junit.runners.BlockJUnit4ClassRunner.runChild(BlockJUnit4ClassRunner.java:78)
     [java] at org.junit.runners.BlockJUnit4ClassRunner.runChild(BlockJUnit4ClassRunner.java:57)
     [java] at org.junit.runners.ParentRunner$3.run(ParentRunner.java:290)
     [java] at org.junit.runners.ParentRunner$1.schedule(ParentRunner.java:71)
     [java] at org.junit.runners.ParentRunner.runChildren(ParentRunner.java:288)
     [java] at org.junit.runners.ParentRunner.access$000(ParentRunner.java:58)
     [java] at org.junit.runners.ParentRunner$2.evaluate(ParentRunner.java:268)
     [java] at org.junit.runners.ParentRunner.run(ParentRunner.java:363)
     [java] at org.junit.runners.Suite.runChild(Suite.java:128)
     [java] at org.junit.runners.Suite.runChild(Suite.java:27)
     [java] at org.junit.runners.ParentRunner$3.run(ParentRunner.java:290)
     [java] at org.junit.runners.ParentRunner$1.schedule(ParentRunner.java:71)
     [java] at org.junit.runners.ParentRunner.runChildren(ParentRunner.java:288)
     [java] at org.junit.runners.ParentRunner.access$000(ParentRunner.java:58)
     [java] at org.junit.runners.ParentRunner$2.evaluate(ParentRunner.java:268)
     [java] at org.junit.runners.ParentRunner.run(ParentRunner.java:363)
     [java] at org.junit.runner.JUnitCore.run(JUnitCore.java:137)
     [java] at org.junit.runner.JUnitCore.run(JUnitCore.java:115)
     [java] at org.junit.runner.JUnitCore.run(JUnitCore.java:105)
     [java] at org.junit.runner.JUnitCore.run(JUnitCore.java:94)
     [java] at org.apache.poi.util.OOXMLLite.build(OOXMLLite.java:149)
     [java] at org.apache.poi.util.OOXMLLite.main(OOXMLLite.java:94)
     [java] Caused by: java.io.IOException: Permission denied
     [java] at java.io.UnixFileSystem.createFileExclusively(Native Method)
     [java] at java.io.File.createTempFile(File.java:2024)
     [java] at org.apache.poi.util.DefaultTempFileCreationStrategy.createTempFile(DefaultTempFileCreationStrategy.java:110)
     [java] at org.apache.poi.util.TempFile.createTempFile(TempFile.java:66)
     [java] at org.apache.poi.xssf.streaming.SheetDataWriter.createTempFile(SheetDataWriter.java:87)
     [java] at org.apache.poi.xssf.streaming.SheetDataWriter.<init>(SheetDataWriter.java:70)
     [java] at org.apache.poi.xssf.streaming.SheetDataWriter.<init>(SheetDataWriter.java:75)
     [java] at org.apache.poi.xssf.streaming.SXSSFWorkbook.createSheetDataWriter(SXSSFWorkbook.java:324)
     [java] at org.apache.poi.xssf.streaming.SXSSFSheet.<init>(SXSSFSheet.java:80)
     [java] at org.apache.poi.xssf.streaming.SXSSFWorkbook.createAndRegisterSXSSFSheet(SXSSFWorkbook.java:646)
     [java] ... 34 more
     [java] 315) setCellStyleProperties(org.apache.poi.ss.util.TestSXSSFCellUtil)
     [java] java.lang.RuntimeException: java.io.IOException: Permission denied
     [java] at org.apache.poi.xssf.streaming.SXSSFWorkbook.createAndRegisterSXSSFSheet(SXSSFWorkbook.java:650)
     [java] at org.apache.poi.xssf.streaming.SXSSFWorkbook.createSheet(SXSSFWorkbook.java:638)
     [java] at org.apache.poi.xssf.streaming.SXSSFWorkbook.createSheet(SXSSFWorkbook.java:84)
     [java] at org.apache.poi.ss.util.BaseTestCellUtil.setCellStyleProperties(BaseTestCellUtil.java:111)
     [java] at sun.reflect.NativeMethodAccessorImpl.invoke0(Native Method)
     [java] at sun.reflect.NativeMethodAccessorImpl.invoke(NativeMethodAccessorImpl.java:62)
     [java] at sun.reflect.DelegatingMethodAccessorImpl.invoke(DelegatingMethodAccessorImpl.java:43)
     [java] at java.lang.reflect.Method.invoke(Method.java:498)
     [java] at org.junit.runners.model.FrameworkMethod$1.runReflectiveCall(FrameworkMethod.java:50)
     [java] at org.junit.internal.runners.model.ReflectiveCallable.run(ReflectiveCallable.java:12)
     [java] at org.junit.runners.model.FrameworkMethod.invokeExplosively(FrameworkMethod.java:47)
     [java] at org.junit.internal.runners.statements.InvokeMethod.evaluate(InvokeMethod.java:17)
     [java] at org.junit.runners.ParentRunner.runLeaf(ParentRunner.java:325)
     [java] at org.junit.runners.BlockJUnit4ClassRunner.runChild(BlockJUnit4ClassRunner.java:78)
     [java] at org.junit.runners.BlockJUnit4ClassRunner.runChild(BlockJUnit4ClassRunner.java:57)
     [java] at org.junit.runners.ParentRunner$3.run(ParentRunner.java:290)
     [java] at org.junit.runners.ParentRunner$1.schedule(ParentRunner.java:71)
     [java] at org.junit.runners.ParentRunner.runChildren(ParentRunner.java:288)
     [java] at org.junit.runners.ParentRunner.access$000(ParentRunner.java:58)
     [java] at org.junit.runners.ParentRunner$2.evaluate(ParentRunner.java:268)
     [java] at org.junit.runners.ParentRunner.run(ParentRunner.java:363)
     [java] at org.junit.runners.Suite.runChild(Suite.java:128)
     [java] at org.junit.runners.Suite.runChild(Suite.java:27)
     [java] at org.junit.runners.ParentRunner$3.run(ParentRunner.java:290)
     [java] at org.junit.runners.ParentRunner$1.schedule(ParentRunner.java:71)
     [java] at org.junit.runners.ParentRunner.runChildren(ParentRunner.java:288)
     [java] at org.junit.runners.ParentRunner.access$000(ParentRunner.java:58)
     [java] at org.junit.runners.ParentRunner$2.evaluate(ParentRunner.java:268)
     [java] at org.junit.runners.ParentRunner.run(ParentRunner.java:363)
     [java] at org.junit.runner.JUnitCore.run(JUnitCore.java:137)
     [java] at org.junit.runner.JUnitCore.run(JUnitCore.java:115)
     [java] at org.junit.runner.JUnitCore.run(JUnitCore.java:105)
     [java] at org.junit.runner.JUnitCore.run(JUnitCore.java:94)
     [java] at org.apache.poi.util.OOXMLLite.build(OOXMLLite.java:149)
     [java] at org.apache.poi.util.OOXMLLite.main(OOXMLLite.java:94)
     [java] Caused by: java.io.IOException: Permission denied
     [java] at java.io.UnixFileSystem.createFileExclusively(Native Method)
     [java] at java.io.File.createTempFile(File.java:2024)
     [java] at org.apache.poi.util.DefaultTempFileCreationStrategy.createTempFile(DefaultTempFileCreationStrategy.java:110)
     [java] at org.apache.poi.util.TempFile.createTempFile(TempFile.java:66)
     [java] at org.apache.poi.xssf.streaming.SheetDataWriter.createTempFile(SheetDataWriter.java:87)
     [java] at org.apache.poi.xssf.streaming.SheetDataWriter.<init>(SheetDataWriter.java:70)
     [java] at org.apache.poi.xssf.streaming.SheetDataWriter.<init>(SheetDataWriter.java:75)
     [java] at org.apache.poi.xssf.streaming.SXSSFWorkbook.createSheetDataWriter(SXSSFWorkbook.java:324)
     [java] at org.apache.poi.xssf.streaming.SXSSFSheet.<init>(SXSSFSheet.java:80)
     [java] at org.apache.poi.xssf.streaming.SXSSFWorkbook.createAndRegisterSXSSFSheet(SXSSFWorkbook.java:646)
     [java] ... 34 more
     [java] 316) setFont(org.apache.poi.ss.util.TestSXSSFCellUtil)
     [java] java.lang.RuntimeException: java.io.IOException: Permission denied
     [java] at org.apache.poi.xssf.streaming.SXSSFWorkbook.createAndRegisterSXSSFSheet(SXSSFWorkbook.java:650)
     [java] at org.apache.poi.xssf.streaming.SXSSFWorkbook.createSheet(SXSSFWorkbook.java:638)
     [java] at org.apache.poi.xssf.streaming.SXSSFWorkbook.createSheet(SXSSFWorkbook.java:84)
     [java] at org.apache.poi.ss.util.BaseTestCellUtil.setFont(BaseTestCellUtil.java:301)
     [java] at sun.reflect.NativeMethodAccessorImpl.invoke0(Native Method)
     [java] at sun.reflect.NativeMethodAccessorImpl.invoke(NativeMethodAccessorImpl.java:62)
     [java] at sun.reflect.DelegatingMethodAccessorImpl.invoke(DelegatingMethodAccessorImpl.java:43)
     [java] at java.lang.reflect.Method.invoke(Method.java:498)
     [java] at org.junit.runners.model.FrameworkMethod$1.runReflectiveCall(FrameworkMethod.java:50)
     [java] at org.junit.internal.runners.model.ReflectiveCallable.run(ReflectiveCallable.java:12)
     [java] at org.junit.runners.model.FrameworkMethod.invokeExplosively(FrameworkMethod.java:47)
     [java] at org.junit.internal.runners.statements.InvokeMethod.evaluate(InvokeMethod.java:17)
     [java] at org.junit.runners.ParentRunner.runLeaf(ParentRunner.java:325)
     [java] at org.junit.runners.BlockJUnit4ClassRunner.runChild(BlockJUnit4ClassRunner.java:78)
     [java] at org.junit.runners.BlockJUnit4ClassRunner.runChild(BlockJUnit4ClassRunner.java:57)
     [java] at org.junit.runners.ParentRunner$3.run(ParentRunner.java:290)
     [java] at org.junit.runners.ParentRunner$1.schedule(ParentRunner.java:71)
     [java] at org.junit.runners.ParentRunner.runChildren(ParentRunner.java:288)
     [java] at org.junit.runners.ParentRunner.access$000(ParentRunner.java:58)
     [java] at org.junit.runners.ParentRunner$2.evaluate(ParentRunner.java:268)
     [java] at org.junit.runners.ParentRunner.run(ParentRunner.java:363)
     [java] at org.junit.runners.Suite.runChild(Suite.java:128)
     [java] at org.junit.runners.Suite.runChild(Suite.java:27)
     [java] at org.junit.runners.ParentRunner$3.run(ParentRunner.java:290)
     [java] at org.junit.runners.ParentRunner$1.schedule(ParentRunner.java:71)
     [java] at org.junit.runners.ParentRunner.runChildren(ParentRunner.java:288)
     [java] at org.junit.runners.ParentRunner.access$000(ParentRunner.java:58)
     [java] at org.junit.runners.ParentRunner$2.evaluate(ParentRunner.java:268)
     [java] at org.junit.runners.ParentRunner.run(ParentRunner.java:363)
     [java] at org.junit.runner.JUnitCore.run(JUnitCore.java:137)
     [java] at org.junit.runner.JUnitCore.run(JUnitCore.java:115)
     [java] at org.junit.runner.JUnitCore.run(JUnitCore.java:105)
     [java] at org.junit.runner.JUnitCore.run(JUnitCore.java:94)
     [java] at org.apache.poi.util.OOXMLLite.build(OOXMLLite.java:149)
     [java] at org.apache.poi.util.OOXMLLite.main(OOXMLLite.java:94)
     [java] Caused by: java.io.IOException: Permission denied
     [java] at java.io.UnixFileSystem.createFileExclusively(Native Method)
     [java] at java.io.File.createTempFile(File.java:2024)
     [java] at org.apache.poi.util.DefaultTempFileCreationStrategy.createTempFile(DefaultTempFileCreationStrategy.java:110)
     [java] at org.apache.poi.util.TempFile.createTempFile(TempFile.java:66)
     [java] at org.apache.poi.xssf.streaming.SheetDataWriter.createTempFile(SheetDataWriter.java:87)
     [java] at org.apache.poi.xssf.streaming.SheetDataWriter.<init>(SheetDataWriter.java:70)
     [java] at org.apache.poi.xssf.streaming.SheetDataWriter.<init>(SheetDataWriter.java:75)
     [java] at org.apache.poi.xssf.streaming.SXSSFWorkbook.createSheetDataWriter(SXSSFWorkbook.java:324)
     [java] at org.apache.poi.xssf.streaming.SXSSFSheet.<init>(SXSSFSheet.java:80)
     [java] at org.apache.poi.xssf.streaming.SXSSFWorkbook.createAndRegisterSXSSFSheet(SXSSFWorkbook.java:646)
     [java] ... 34 more
     [java] 317) testEmptyFile(org.apache.poi.ss.TestWorkbookFactory)
     [java] java.io.IOException: Permission denied
     [java] at java.io.UnixFileSystem.createFileExclusively(Native Method)
     [java] at java.io.File.createTempFile(File.java:2024)
     [java] at org.apache.poi.util.DefaultTempFileCreationStrategy.createTempFile(DefaultTempFileCreationStrategy.java:110)
     [java] at org.apache.poi.util.TempFile.createTempFile(TempFile.java:66)
     [java] at org.apache.poi.ss.TestWorkbookFactory.testEmptyFile(TestWorkbookFactory.java:361)
     [java] at sun.reflect.NativeMethodAccessorImpl.invoke0(Native Method)
     [java] at sun.reflect.NativeMethodAccessorImpl.invoke(NativeMethodAccessorImpl.java:62)
     [java] at sun.reflect.DelegatingMethodAccessorImpl.invoke(DelegatingMethodAccessorImpl.java:43)
     [java] at java.lang.reflect.Method.invoke(Method.java:498)
     [java] at org.junit.runners.model.FrameworkMethod$1.runReflectiveCall(FrameworkMethod.java:50)
     [java] at org.junit.internal.runners.model.ReflectiveCallable.run(ReflectiveCallable.java:12)
     [java] at org.junit.runners.model.FrameworkMethod.invokeExplosively(FrameworkMethod.java:47)
     [java] at org.junit.internal.runners.statements.InvokeMethod.evaluate(InvokeMethod.java:17)
     [java] at org.junit.runners.ParentRunner.runLeaf(ParentRunner.java:325)
     [java] at org.junit.runners.BlockJUnit4ClassRunner.runChild(BlockJUnit4ClassRunner.java:78)
     [java] at org.junit.runners.BlockJUnit4ClassRunner.runChild(BlockJUnit4ClassRunner.java:57)
     [java] at org.junit.runners.ParentRunner$3.run(ParentRunner.java:290)
     [java] at org.junit.runners.ParentRunner$1.schedule(ParentRunner.java:71)
     [java] at org.junit.runners.ParentRunner.runChildren(ParentRunner.java:288)
     [java] at org.junit.runners.ParentRunner.access$000(ParentRunner.java:58)
     [java] at org.junit.runners.ParentRunner$2.evaluate(ParentRunner.java:268)
     [java] at org.junit.runners.ParentRunner.run(ParentRunner.java:363)
     [java] at org.junit.runners.Suite.runChild(Suite.java:128)
     [java] at org.junit.runners.Suite.runChild(Suite.java:27)
     [java] at org.junit.runners.ParentRunner$3.run(ParentRunner.java:290)
     [java] at org.junit.runners.ParentRunner$1.schedule(ParentRunner.java:71)
     [java] at org.junit.runners.ParentRunner.runChildren(ParentRunner.java:288)
     [java] at org.junit.runners.ParentRunner.access$000(ParentRunner.java:58)
     [java] at org.junit.runners.ParentRunner$2.evaluate(ParentRunner.java:268)
     [java] at org.junit.runners.ParentRunner.run(ParentRunner.java:363)
     [java] at org.junit.runner.JUnitCore.run(JUnitCore.java:137)
     [java] at org.junit.runner.JUnitCore.run(JUnitCore.java:115)
     [java] at org.junit.runner.JUnitCore.run(JUnitCore.java:105)
     [java] at org.junit.runner.JUnitCore.run(JUnitCore.java:94)
     [java] at org.apache.poi.util.OOXMLLite.build(OOXMLLite.java:149)
     [java] at org.apache.poi.util.OOXMLLite.main(OOXMLLite.java:94)
     [java]
     [java] FAILURES!!!
     [java] Tests run: 2322,  Failures: 317
     [java]
     [java] Exception in thread "main" java.lang.RuntimeException: Tests did not succeed, cannot build ooxml-lite jar
     [java] at org.apache.poi.util.OOXMLLite.build(OOXMLLite.java:151)
     [java] at org.apache.poi.util.OOXMLLite.main(OOXMLLite.java:94)

BUILD FAILED
<https://builds.apache.org/job/POI-DSL-1.8/ws/build.xml>:1520: Java returned: 1

Total time: 2 minutes 21 seconds
Build step 'Invoke Ant' marked build as failure
Skipping publisher since build result is FAILURE
Archiving artifacts
[Fast Archiver] Compressed 66.32 MB of artifacts by 65.4% relative to #307
Skipping publisher since build result is FAILURE
Recording test results
ERROR: Step ‘Publish JUnit test result report’ failed: No test report files were found. Configuration error?


---------------------------------------------------------------------
To unsubscribe, e-mail: [hidden email]
For additional commands, e-mail: [hidden email]

Reply | Threaded
Open this post in threaded view
|

Build failed in Jenkins: POI-DSL-1.8 #310

Apache Jenkins Server
See <https://builds.apache.org/job/POI-DSL-1.8/310/display/redirect?page=changes>

Changes:

[fanningpj] add forbidden api checks for non-Locale toLowerCase and toUpperCase

[fanningpj] add forbidden api checks for non-Locale toLowerCase and toUpperCase

[fanningpj] remove more uses of Character.toUpperCase

[fanningpj] Note the upgrade of commons-codec

[centic] Try to set java.io.tmpdir for tests to avoid the strange permission errors that we see in CI-builds

[centic] Adjust version of commons-codec in docu pages as well

[centic] Ensure that no old version of commons-codec is lingering around and causes hard to find build errors locally

[centic] Try if using a local temporary directory avoids the permission errors in unit tests in the Maven runs:
* Collect JUnit results
* Set java.io.tmpdir in Maven unit test runs

------------------------------------------
[...truncated 636.69 KB...]
  [javadoc]                                                             ^
  [javadoc] <https://builds.apache.org/job/POI-DSL-1.8/ws/src/ooxml/java/org/apache/poi/xssf/model/StylesTable.java>:93: error: malformed HTML
  [javadoc]      * @throws IllegalStateException if <code>num</code> < current number of data formats in the style table.
  [javadoc]                                                          ^
  [javadoc] <https://builds.apache.org/job/POI-DSL-1.8/ws/src/ooxml/java/org/apache/poi/xssf/streaming/SXSSFRow.java>:116: error: malformed HTML
  [javadoc]      * @throws IllegalArgumentException if columnIndex < 0 or greater than the maximum number of supported columns
  [javadoc]                                                        ^
  [javadoc] <https://builds.apache.org/job/POI-DSL-1.8/ws/src/ooxml/java/org/apache/poi/xssf/streaming/SXSSFRow.java>:133: error: malformed HTML
  [javadoc]      * @throws IllegalArgumentException if columnIndex < 0 or greate than a maximum number of supported columns
  [javadoc]                                                        ^
  [javadoc] <https://builds.apache.org/job/POI-DSL-1.8/ws/src/ooxml/java/org/apache/poi/xssf/streaming/SXSSFRow.java>:191: error: malformed HTML
  [javadoc]      * @throws IllegalArgumentException if rowNum < 0
  [javadoc]                                                   ^
  [javadoc] <https://builds.apache.org/job/POI-DSL-1.8/ws/src/ooxml/java/org/apache/poi/xssf/streaming/SXSSFRow.java>:230: error: malformed HTML
  [javadoc]      * @throws IllegalArgumentException if cellnum < 0 or the specified MissingCellPolicy is invalid
  [javadoc]                                                    ^
  [javadoc] <https://builds.apache.org/job/POI-DSL-1.8/ws/src/ooxml/java/org/apache/poi/xssf/usermodel/XSSFColor.java>:230: error: unknown tag: clrScheme
  [javadoc]      * Index into the <clrScheme> collection, referencing a particular <sysClr> or
  [javadoc]                       ^
  [javadoc] <https://builds.apache.org/job/POI-DSL-1.8/ws/src/ooxml/java/org/apache/poi/xssf/usermodel/XSSFColor.java>:230: error: unknown tag: sysClr
  [javadoc]      * Index into the <clrScheme> collection, referencing a particular <sysClr> or
  [javadoc]                                                                        ^
  [javadoc] <https://builds.apache.org/job/POI-DSL-1.8/ws/src/ooxml/java/org/apache/poi/xssf/usermodel/XSSFColor.java>:231: error: unknown tag: srgbClr
  [javadoc]      *  <srgbClr> value expressed in the Theme part.
  [javadoc]         ^
  [javadoc] <https://builds.apache.org/job/POI-DSL-1.8/ws/src/ooxml/java/org/apache/poi/xssf/usermodel/XSSFColor.java>:239: error: unknown tag: clrScheme
  [javadoc]      * Index into the <clrScheme> collection, referencing a particular <sysClr> or
  [javadoc]                       ^
  [javadoc] <https://builds.apache.org/job/POI-DSL-1.8/ws/src/ooxml/java/org/apache/poi/xssf/usermodel/XSSFColor.java>:239: error: unknown tag: sysClr
  [javadoc]      * Index into the <clrScheme> collection, referencing a particular <sysClr> or
  [javadoc]                                                                        ^
  [javadoc] <https://builds.apache.org/job/POI-DSL-1.8/ws/src/ooxml/java/org/apache/poi/xssf/usermodel/XSSFColor.java>:240: error: unknown tag: srgbClr
  [javadoc]      *  <srgbClr> value expressed in the Theme part.
  [javadoc]         ^
  [javadoc] <https://builds.apache.org/job/POI-DSL-1.8/ws/src/ooxml/java/org/apache/poi/xssf/usermodel/XSSFDxfStyleProvider.java>:42: error: bad use of '>'
  [javadoc]      * @param stripeSize 0 for non-stripe styles, > 1 for stripes
  [javadoc]                                                   ^
  [javadoc] <https://builds.apache.org/job/POI-DSL-1.8/ws/src/ooxml/java/org/apache/poi/xssf/usermodel/XSSFName.java>:146: error: tag not allowed here: <blockquote>
  [javadoc]      * <pre><blockquote>
  [javadoc]             ^
  [javadoc] <https://builds.apache.org/job/POI-DSL-1.8/ws/src/ooxml/java/org/apache/poi/xssf/usermodel/XSSFName.java>:165: error: unexpected end tag: </p>
  [javadoc]     * </p>
  [javadoc]       ^
  [javadoc] <https://builds.apache.org/job/POI-DSL-1.8/ws/src/ooxml/java/org/apache/poi/xssf/usermodel/XSSFName.java>:36: error: tag not allowed here: <blockquote>
  [javadoc]  * <pre><blockquote>
  [javadoc]         ^
  [javadoc] <https://builds.apache.org/job/POI-DSL-1.8/ws/src/ooxml/java/org/apache/poi/xssf/usermodel/XSSFName.java>:86: error: tag not allowed here: <li>
  [javadoc]      * <li> this defined name refers to a range to which an advanced filter has been
  [javadoc]        ^
  [javadoc] <https://builds.apache.org/job/POI-DSL-1.8/ws/src/ooxml/java/org/apache/poi/xssf/usermodel/XSSFName.java>:88: error: tag not allowed here: <li>
  [javadoc]      * <li> This defined name refers to a range to which an AutoFilter has been
  [javadoc]        ^
  [javadoc] <https://builds.apache.org/job/POI-DSL-1.8/ws/src/ooxml/java/org/apache/poi/xssf/usermodel/XSSFRichTextString.java>:430: error: bad use of '>'
  [javadoc]      * CTRPrElt --> CTFont adapter
  [javadoc]                   ^
  [javadoc] <https://builds.apache.org/job/POI-DSL-1.8/ws/src/ooxml/java/org/apache/poi/xssf/usermodel/XSSFRow.java>:106: error: unknown tag: Cell
  [javadoc]      * for (Iterator<Cell> it = row.cellIterator(); it.hasNext(); ) {
  [javadoc]                     ^
  [javadoc] <https://builds.apache.org/job/POI-DSL-1.8/ws/src/ooxml/java/org/apache/poi/xssf/usermodel/XSSFRow.java>:193: error: malformed HTML
  [javadoc]      * @throws IllegalArgumentException if columnIndex < 0 or greater than 16384,
  [javadoc]                                                        ^
  [javadoc] <https://builds.apache.org/job/POI-DSL-1.8/ws/src/ooxml/java/org/apache/poi/xssf/usermodel/XSSFRow.java>:207: error: malformed HTML
  [javadoc]      * @throws IllegalArgumentException if the specified cell type is invalid, columnIndex < 0
  [javadoc]                                                                                            ^
  [javadoc] <https://builds.apache.org/job/POI-DSL-1.8/ws/src/ooxml/java/org/apache/poi/xssf/usermodel/XSSFRow.java>:381: error: malformed HTML
  [javadoc]      * @throws IllegalArgumentException if rowNum < 0 or greater than 1048575
  [javadoc]                                                   ^
  [javadoc] <https://builds.apache.org/job/POI-DSL-1.8/ws/src/ooxml/java/org/apache/poi/xssf/usermodel/XSSFSheetConditionalFormatting.java>:70: error: unexpected end tag: </p>
  [javadoc]      * </p>
  [javadoc]        ^
  [javadoc] <https://builds.apache.org/job/POI-DSL-1.8/ws/src/ooxml/java/org/apache/poi/xssf/usermodel/XSSFWorkbook.java>:803: error: unexpected end tag: </p>
  [javadoc]      * </p>
  [javadoc]        ^
  [javadoc] <https://builds.apache.org/job/POI-DSL-1.8/ws/src/ooxml/java/org/apache/poi/xssf/usermodel/XSSFWorkbook.java>:820: error: unexpected end tag: </p>
  [javadoc]      * </p>
  [javadoc]        ^
  [javadoc] <https://builds.apache.org/job/POI-DSL-1.8/ws/src/ooxml/java/org/apache/poi/xssf/usermodel/XSSFWorkbook.java>:1117: error: bad HTML entity
  [javadoc]      * @param index of the sheet number (0-based physical & logical)
  [javadoc]                                                           ^
  [javadoc] <https://builds.apache.org/job/POI-DSL-1.8/ws/src/ooxml/java/org/apache/poi/xssf/usermodel/XSSFWorkbook.java>:1132: error: malformed HTML
  [javadoc]      * @return index of the sheet (0 based) or <tt>-1</tt if not found
  [javadoc]                                                      ^
  [javadoc] <https://builds.apache.org/job/POI-DSL-1.8/ws/src/ooxml/java/org/apache/poi/xssf/usermodel/XSSFWorkbook.java>:1132: error: element not closed: tt
  [javadoc]      * @return index of the sheet (0 based) or <tt>-1</tt if not found
  [javadoc]                                                ^
  [javadoc] <https://builds.apache.org/job/POI-DSL-1.8/ws/src/ooxml/java/org/apache/poi/xssf/usermodel/extensions/XSSFHeaderFooter.java>:40: error: semicolon missing
  [javadoc]  * section), and the date on the second line (center section). &CCenter
  [javadoc]                                                                ^
  [javadoc] <https://builds.apache.org/job/POI-DSL-1.8/ws/src/ooxml/java/org/apache/poi/xssf/usermodel/extensions/XSSFHeaderFooter.java>:41: error: bad HTML entity
  [javadoc]  * &"-,Bold"Bold &"-,Regular"Header_x000A_&D
  [javadoc]    ^
  [javadoc] <https://builds.apache.org/job/POI-DSL-1.8/ws/src/ooxml/java/org/apache/poi/xssf/usermodel/extensions/XSSFHeaderFooter.java>:41: error: bad HTML entity
  [javadoc]  * &"-,Bold"Bold &"-,Regular"Header_x000A_&D
  [javadoc]                  ^
  [javadoc] <https://builds.apache.org/job/POI-DSL-1.8/ws/src/ooxml/java/org/apache/poi/xssf/usermodel/extensions/XSSFHeaderFooter.java>:41: error: semicolon missing
  [javadoc]  * &"-,Bold"Bold &"-,Regular"Header_x000A_&D
  [javadoc]                                           ^
  [javadoc] <https://builds.apache.org/job/POI-DSL-1.8/ws/src/ooxml/java/org/apache/poi/xssf/usermodel/extensions/XSSFHeaderFooter.java>:48: error: semicolon missing
  [javadoc]  * <dt>&L</dt>
  [javadoc]        ^
  [javadoc] <https://builds.apache.org/job/POI-DSL-1.8/ws/src/ooxml/java/org/apache/poi/xssf/usermodel/extensions/XSSFHeaderFooter.java>:53: error: semicolon missing
  [javadoc]  * <dt>&P</dt>
  [javadoc]        ^
  [javadoc] <https://builds.apache.org/job/POI-DSL-1.8/ws/src/ooxml/java/org/apache/poi/xssf/usermodel/extensions/XSSFHeaderFooter.java>:55: error: semicolon missing
  [javadoc]  * <dt>&N</dt>
  [javadoc]        ^
  [javadoc] <https://builds.apache.org/job/POI-DSL-1.8/ws/src/ooxml/java/org/apache/poi/xssf/usermodel/extensions/XSSFHeaderFooter.java>:57: error: semicolon missing
  [javadoc]  * <dt>&font size</dt>
  [javadoc]        ^
  [javadoc] 100 errors
  [javadoc] 100 warnings
      [jar] Building jar: <https://builds.apache.org/job/POI-DSL-1.8/ws/build/dist/maven/poi-ooxml/poi-ooxml-4.0.0-SNAPSHOT-javadoc.jar>

assemble:
      [zip] Building zip: <https://builds.apache.org/job/POI-DSL-1.8/ws/build/dist/poi-bin-4.0.0-SNAPSHOT-20171122.zip>
      [tar] Building tar: <https://builds.apache.org/job/POI-DSL-1.8/310/artifact/build/dist/poi-bin-4.0.0-SNAPSHOT-20171122.tar.gz>
      [zip] Building zip: <https://builds.apache.org/job/POI-DSL-1.8/ws/build/dist/poi-src-4.0.0-SNAPSHOT-20171122.zip>
      [tar] Building tar: <https://builds.apache.org/job/POI-DSL-1.8/310/artifact/build/dist/poi-src-4.0.0-SNAPSHOT-20171122.tar.gz>
     [echo] Creating Maven POMs

maven-poms:
     [copy] Copying 6 files to <https://builds.apache.org/job/POI-DSL-1.8/ws/build/dist/maven>
     [echo] Maven POMs are located in <https://builds.apache.org/job/POI-DSL-1.8/ws/build/dist>
     [echo] Use ant dist-nexus to deploy the artifacts in the remote repository
     [echo] Distribution located in <https://builds.apache.org/job/POI-DSL-1.8/ws/build/dist>
     [echo] Use "ant dist-checksum" to create md5/sha1/sha512 checksums and GPG signatures

findbugs:
      [get] Destination already exists (skipping): <https://builds.apache.org/job/POI-DSL-1.8/ws/lib/findbugs-noUpdateChecks-3.0.1.zip>
    [unzip] Expanding: <https://builds.apache.org/job/POI-DSL-1.8/ws/lib/findbugs-noUpdateChecks-3.0.1.zip> into <https://builds.apache.org/job/POI-DSL-1.8/ws/build/findbugs>
 [findbugs] Executing findbugs FindBugsTask from ant task
 [findbugs] Running FindBugs...
 [findbugs] Warnings generated: 44
 [findbugs] Calculating exit code...
 [findbugs] Setting 'bugs found' flag (1)
 [findbugs] Exit code set to: 1
 [findbugs] Java Result: 1
 [findbugs] Output saved to build/findbugs.xml
     [xslt] Transforming into <https://builds.apache.org/job/POI-DSL-1.8/ws/build>
     [xslt] Processing <https://builds.apache.org/job/POI-DSL-1.8/ws/build/findbugs.xml> to <https://builds.apache.org/job/POI-DSL-1.8/310/artifact/build/findbugs.html>
     [xslt] Loading stylesheet jar:<https://builds.apache.org/job/POI-DSL-1.8/ws/build/findbugs/lib/findbugs.jar!/fancy-hist.xsl>

release-notes:
     [copy] Copying 1 file to <https://builds.apache.org/job/POI-DSL-1.8/ws/build/dist>

rat-check:
    [mkdir] Created dir: <https://builds.apache.org/job/POI-DSL-1.8/ws/build/rat>
     [echo]
     [echo] *****************************************************
     [echo] Summary
     [echo] -------
     [echo] Generated at: 2017-11-22T01:14:23+00:00
     [echo]
     [echo] Notes: 1
     [echo] Binaries: 119
     [echo] Archives: 0
     [echo] Standards: 3620
     [echo]
     [echo] Apache Licensed: 3619
     [echo] Generated Documents: 0
     [echo]
     [echo] JavaDocs are generated, thus a license header is optional.
     [echo] Generated files do not require license headers.
     [echo]
     [echo] 1 Unknown Licenses
     [echo]
     [echo] *****************************************************
     [echo]
     [echo] Files with unapproved licenses:
     [echo]
     [echo]   <https://builds.apache.org/job/POI-DSL-1.8/ws/src/integrationtest/hs_err_pid12721.log>
     [echo]
     [echo] *****************************************************
     [echo]
     [echo] *****************************************************
     [echo]   Files with Apache License headers will be marked AL
     [echo]   Binary files (which do not require any license headers) will be marked B
     [echo]   Compressed archives will be marked A
     [echo]   Notices, licenses etc. will be marked N
     [echo]  !????? <https://builds.apache.org/job/POI-DSL-1.8/ws/src/integrationtest/hs_err_pid12721.log>
     [echo]  
     [echo] *****************************************************
     [echo]
     [echo]  Printing headers for text files without a valid license header...
     [echo]  
     [echo] =====================================================
     [echo] == File: <https://builds.apache.org/job/POI-DSL-1.8/ws/src/integrationtest/hs_err_pid12721.log>
     [echo] =====================================================
     [echo] #
     [echo] # A fatal error has been detected by the Java Runtime Environment:
     [echo] #
     [echo] #  SIGSEGV (0xb) at pc=0x00007f21ad10f1e0, pid=12721, tid=0x00007f21c559a700
     [echo] #
     [echo] # JRE version: Java(TM) SE Runtime Environment (8.0_152-b16) (build 1.8.0_152-b16)
     [echo] # Java VM: Java HotSpot(TM) 64-Bit Server VM (25.152-b16 mixed mode linux-amd64 compressed oops)
     [echo] # Problematic frame:
     [echo] # v  ~BufferBlob::vtable chunks
     [echo] #
     [echo] # Failed to write core dump. Core dumps have been disabled. To enable core dumping, try "ulimit -c unlimited" before starting Java again
     [echo] #
     [echo] # If you would like to submit a bug report, please visit:
     [echo] #   http://bugreport.java.com/bugreport/crash.jsp
     [echo] #
     [echo]
     [echo] ---------------  T H R E A D  ---------------
     [echo]
     [echo] Current thread (0x00007f21bc00a000):  JavaThread "main" [_thread_in_Java, id=12724, stack(0x00007f21c549a000,0x00007f21c559b000)]
     [echo]
     [echo] siginfo: si_signo: 11 (SIGSEGV), si_code: 1 (SEGV_MAPERR), si_addr: 0x0000000800000000
     [echo]
     [echo] Registers:
     [echo] RAX=0xffffffffffffffff, RBX=0x0000000000000f80, RCX=0x0000000000000000, RDX=0x00000006c5259a70
     [echo] RSP=0x00007f21c5598898, RBP=0x00007f21c5598948, RSI=0x00000007fffffff8, RDI=0x00000007fffffff8
     [echo] R8 =0x0000000000000000, R9 =0x0000000000000004, R10=0x00007f21c4964d20, R11=0x00007f21ad3e51a0
     [echo] R12=0x0000000000000000, R13=0x00007f21c55988f0, R14=0x00007f21c5598968, R15=0x00007f21bc00a000
     [echo] RIP=0x00007f21ad10f1e0, EFLAGS=0x0000000000010202, CSGSFS=0x0000000000000033, ERR=0x0000000000000004
     [echo]   TRAPNO=0x000000000000000e
     [echo]
     [echo] Top of Stack: (sp=0x00007f21c5598898)
     [echo] 0x00007f21c5598898:   00007f21ad3e51f4 00007f21bc00a000
     [echo] 0x00007f21c55988a8:   00000000000000b6 0000000000000000
     [echo] 0x00007f21c55988b8:   00007f21c0c737f6 00007f21c5598968
     [echo] 0x00007f21c55988c8:   00007f21bc00a000 00007f21c5598948
     [echo] 0x00007f21c55988d8:   00007f21ad007d80 00007f21c5598948
     [echo] 0x00007f21c55988e8:   00007f21ad007d80 0000000000000000
     [echo] 0x00007f21c55988f8:   00000007fffffff8 00000006c5259a70
     [echo] 0x00007f21c5598908:   00007f21c5598908 00007f21c0c737f6
     [echo] 0x00007f21c5598918:   00007f21c5598968 00007f21c0c8e488
     [echo] 0x00007f21c5598928:   0000000000000000 00007f21c0c73808
     [echo] 0x00007f21c5598938:   00007f21c55988f0 00007f21c5598970
     [echo] 0x00007f21c5598948:   00007f21c55990f0 00007f21ad4fb28c
     [echo] 0x00007f21c5598958:   0000000000000000 00000006c616b8a0
     [echo] 0x00007f21c5598968:   00000006c5259a70 00007f21c0be2b00
     [echo] 0x00007f21c5598978:   00000006c5259a70 0000000000000000
     [echo] 0x00007f21c5598988:   00007f21ad4fb1a0 cafebabecafebabe
     [echo] 0x00007f21c5598998:   0000000000000202 00007f21c55990f0
     [echo] 0x00007f21c55989a8:   00007f21ad3cf3e4 00007f21bc1dc52e
     [echo] 0x00007f21c55989b8:   0000000000000000 00007f21c55990f0

BUILD FAILED
<https://builds.apache.org/job/POI-DSL-1.8/ws/build.xml>:2075: condition satisfied

Total time: 15 minutes 18 seconds
Build step 'Invoke Ant' marked build as failure
Skipping publisher since build result is FAILURE
Archiving artifacts
[Fast Archiver] Compressed 234.76 MB of artifacts by 41.2% relative to #307
Skipping publisher since build result is FAILURE
Recording test results

---------------------------------------------------------------------
To unsubscribe, e-mail: [hidden email]
For additional commands, e-mail: [hidden email]

Reply | Threaded
Open this post in threaded view
|

Jenkins build is back to normal : POI-DSL-1.8 #311

Apache Jenkins Server
See <https://builds.apache.org/job/POI-DSL-1.8/311/display/redirect?page=changes>


---------------------------------------------------------------------
To unsubscribe, e-mail: [hidden email]
For additional commands, e-mail: [hidden email]