Build failed in Jenkins: POI-DSL-1.8 #283

classic Classic list List threaded Threaded
3 messages Options
Reply | Threaded
Open this post in threaded view
|

Build failed in Jenkins: POI-DSL-1.8 #283

Apache Jenkins Server
See <https://builds.apache.org/job/POI-DSL-1.8/283/display/redirect?page=changes>

Changes:

[onealj] IntelliJ: simplify boolean logic

[onealj] remove deprecated XSSFRowShifter.shiftMerged(int,int,int) method; replaced with RowShifter.shiftMergedRegions(int,int,int) in POI 3.15 beta 2

[onealj] ignore gradle/, gradlew, and gradlew.bat

------------------------------------------
[...truncated 643.77 KB...]
 [findbugs] Setting 'bugs found' flag (1)
 [findbugs] Exit code set to: 1
 [findbugs] Java Result: 1
 [findbugs] Output saved to build/findbugs.xml
     [xslt] Transforming into <https://builds.apache.org/job/POI-DSL-1.8/ws/build>
     [xslt] Processing <https://builds.apache.org/job/POI-DSL-1.8/ws/build/findbugs.xml> to <https://builds.apache.org/job/POI-DSL-1.8/283/artifact/build/findbugs.html>
     [xslt] Loading stylesheet jar:<https://builds.apache.org/job/POI-DSL-1.8/ws/build/findbugs/lib/findbugs.jar!/fancy-hist.xsl>

release-notes:
     [copy] Copying 1 file to <https://builds.apache.org/job/POI-DSL-1.8/ws/build/dist>

rat-check:
    [mkdir] Created dir: <https://builds.apache.org/job/POI-DSL-1.8/ws/build/rat>
     [echo]
     [echo] *****************************************************
     [echo] Summary
     [echo] -------
     [echo] Generated at: 2017-10-17T13:20:13+00:00
     [echo]
     [echo] Notes: 1
     [echo] Binaries: 119
     [echo] Archives: 0
     [echo] Standards: 3602
     [echo]
     [echo] Apache Licensed: 3602
     [echo] Generated Documents: 0
     [echo]
     [echo] JavaDocs are generated, thus a license header is optional.
     [echo] Generated files do not require license headers.
     [echo]
     [echo] 0 Unknown Licenses
     [echo]
     [echo] *****************************************************
     [echo]   Files with Apache License headers will be marked AL
     [echo]   Binary files (which do not require any license headers) will be marked B
     [echo]   Compressed archives will be marked A
     [echo]   Notices, licenses etc. will be marked N
     [echo]  
     [echo] *****************************************************

forbidden-apis-check:
[forbiddenapis] Reading bundled API signatures: jdk-unsafe-1.8
[forbiddenapis] Reading bundled API signatures: jdk-deprecated-1.8
[forbiddenapis] Reading bundled API signatures: jdk-internal-1.8
[forbiddenapis] Reading bundled API signatures: jdk-non-portable
[forbiddenapis] Reading bundled API signatures: jdk-reflection
[forbiddenapis] Reading API signatures: <https://builds.apache.org/job/POI-DSL-1.8/ws/src/resources/devtools/forbidden-signatures.txt>
[forbiddenapis] Loading classes to check...
[forbiddenapis] Scanning classes for violations...
[forbiddenapis] Scanned 3986 (and 1850 related) class file(s) for forbidden API invocations (in 7.93s), 0 error(s).
[forbiddenapis] Reading API signatures: <https://builds.apache.org/job/POI-DSL-1.8/ws/src/resources/devtools/forbidden-signatures-prod.txt>
[forbiddenapis] Loading classes to check...
[forbiddenapis] Scanning classes for violations...
[forbiddenapis] Scanned 3091 (and 1445 related) class file(s) for forbidden API invocations (in 1.36s), 0 error(s).

jenkins:

BUILD SUCCESSFUL
Total time: 15 minutes 22 seconds
[integrationtest] $ /home/jenkins/tools/ant/apache-ant-1.9.9/bin/ant -file build.xml run
Buildfile: <https://builds.apache.org/job/POI-DSL-1.8/ws/src/integrationtest/build.xml>

init:

runSourceBuild:
    [mkdir] Created dir: <https://builds.apache.org/job/POI-DSL-1.8/ws/build/distsourcebuild>
     [echo] Found source package at <https://builds.apache.org/job/POI-DSL-1.8/ws/build/dist/poi-src-4.0.0-SNAPSHOT-20171017.zip>
    [unzip] Expanding: <https://builds.apache.org/job/POI-DSL-1.8/ws/build/dist/poi-src-4.0.0-SNAPSHOT-20171017.zip> into <https://builds.apache.org/job/POI-DSL-1.8/ws/build/distsourcebuild>
    [mkdir] Created dir: <https://builds.apache.org/job/POI-DSL-1.8/ws/build/distsourcebuild/poi-4.0.0-SNAPSHOT/lib>
    [mkdir] Created dir: <https://builds.apache.org/job/POI-DSL-1.8/ws/build/distsourcebuild/poi-4.0.0-SNAPSHOT/ooxml-lib>
    [mkdir] Created dir: <https://builds.apache.org/job/POI-DSL-1.8/ws/build/distsourcebuild/poi-4.0.0-SNAPSHOT/compile-lib>
     [copy] Copying 22 files to <https://builds.apache.org/job/POI-DSL-1.8/ws/build/distsourcebuild/poi-4.0.0-SNAPSHOT/lib>
     [copy] Copying 16 files to <https://builds.apache.org/job/POI-DSL-1.8/ws/build/distsourcebuild/poi-4.0.0-SNAPSHOT/ooxml-lib>
     [copy] Copying 4 files to <https://builds.apache.org/job/POI-DSL-1.8/ws/build/distsourcebuild/poi-4.0.0-SNAPSHOT/compile-lib>
     [echo] Building in temporary dir <https://builds.apache.org/job/POI-DSL-1.8/ws/build/distsourcebuild/poi-4.0.0-SNAPSHOT/>

check-jars:

fetch-jars:

check-ooxml-jars:

fetch-ooxml-jars:

init:
    [mkdir] Created dir: <https://builds.apache.org/job/POI-DSL-1.8/ws/build/distsourcebuild/poi-4.0.0-SNAPSHOT/build>
    [mkdir] Created dir: <https://builds.apache.org/job/POI-DSL-1.8/ws/build/distsourcebuild/poi-4.0.0-SNAPSHOT/build/classes>
    [mkdir] Created dir: <https://builds.apache.org/job/POI-DSL-1.8/ws/build/distsourcebuild/poi-4.0.0-SNAPSHOT/build/test-classes>
    [mkdir] Created dir: <https://builds.apache.org/job/POI-DSL-1.8/ws/build/distsourcebuild/poi-4.0.0-SNAPSHOT/build/test-results>
    [mkdir] Created dir: <https://builds.apache.org/job/POI-DSL-1.8/ws/build/distsourcebuild/poi-4.0.0-SNAPSHOT/build/scratchpad-classes>
    [mkdir] Created dir: <https://builds.apache.org/job/POI-DSL-1.8/ws/build/distsourcebuild/poi-4.0.0-SNAPSHOT/build/scratchpad-test-classes>
    [mkdir] Created dir: <https://builds.apache.org/job/POI-DSL-1.8/ws/build/distsourcebuild/poi-4.0.0-SNAPSHOT/build/scratchpad-test-results>
    [mkdir] Created dir: <https://builds.apache.org/job/POI-DSL-1.8/ws/build/distsourcebuild/poi-4.0.0-SNAPSHOT/build/geometry-java>
    [mkdir] Created dir: <https://builds.apache.org/job/POI-DSL-1.8/ws/build/distsourcebuild/poi-4.0.0-SNAPSHOT/build/ooxml-classes>
    [mkdir] Created dir: <https://builds.apache.org/job/POI-DSL-1.8/ws/build/distsourcebuild/poi-4.0.0-SNAPSHOT/build/ooxml-test-classes>
    [mkdir] Created dir: <https://builds.apache.org/job/POI-DSL-1.8/ws/build/distsourcebuild/poi-4.0.0-SNAPSHOT/build/ooxml-test-results>
    [mkdir] Created dir: <https://builds.apache.org/job/POI-DSL-1.8/ws/build/distsourcebuild/poi-4.0.0-SNAPSHOT/build/excelant-classes>
    [mkdir] Created dir: <https://builds.apache.org/job/POI-DSL-1.8/ws/build/distsourcebuild/poi-4.0.0-SNAPSHOT/build/excelant-test-classes>
    [mkdir] Created dir: <https://builds.apache.org/job/POI-DSL-1.8/ws/build/distsourcebuild/poi-4.0.0-SNAPSHOT/build/excelant-test-results>
    [mkdir] Created dir: <https://builds.apache.org/job/POI-DSL-1.8/ws/build/distsourcebuild/poi-4.0.0-SNAPSHOT/build/examples-classes>
    [mkdir] Created dir: <https://builds.apache.org/job/POI-DSL-1.8/ws/build/distsourcebuild/poi-4.0.0-SNAPSHOT/build/integration-test-classes>
    [mkdir] Created dir: <https://builds.apache.org/job/POI-DSL-1.8/ws/build/distsourcebuild/poi-4.0.0-SNAPSHOT/build/integration-test-results>
    [mkdir] Created dir: <https://builds.apache.org/job/POI-DSL-1.8/ws/build/distsourcebuild/poi-4.0.0-SNAPSHOT/build/dist>
    [mkdir] Created dir: <https://builds.apache.org/job/POI-DSL-1.8/ws/build/distsourcebuild/poi-4.0.0-SNAPSHOT/build/tmp/site/build/site>
     [echo] Using Ant: Apache Ant(TM) version 1.9.9 compiled on February 2 2017 from /home/jenkins/tools/ant/apache-ant-1.9.9, Ant detected Java 1.8 (may be different than actual Java sometimes...)
     [echo] Using Java: 1.8.0_144/1.8.0_144-b01/25.144-b01/Java HotSpot(TM) 64-Bit Server VM from Oracle Corporation on Linux: 3.19.0-25-generic

compile-main:
    [javac] Compiling 1200 source files to <https://builds.apache.org/job/POI-DSL-1.8/ws/build/distsourcebuild/poi-4.0.0-SNAPSHOT/build/classes>
    [javac] Note: Some input files use or override a deprecated API.
    [javac] Note: Recompile with -Xlint:deprecation for details.
    [javac] Note: Some input files use unchecked or unsafe operations.
    [javac] Note: Recompile with -Xlint:unchecked for details.
    [javac] Compiling 537 source files to <https://builds.apache.org/job/POI-DSL-1.8/ws/build/distsourcebuild/poi-4.0.0-SNAPSHOT/build/test-classes>
    [javac] Note: Some input files use or override a deprecated API.
    [javac] Note: Recompile with -Xlint:deprecation for details.
     [copy] Copying 4 files to <https://builds.apache.org/job/POI-DSL-1.8/ws/build/distsourcebuild/poi-4.0.0-SNAPSHOT/build/classes>

check-ooxml-xsds:

fetch-ooxml-xsds:

generate-geometry:

compile-scratchpad:
    [javac] Compiling 489 source files to <https://builds.apache.org/job/POI-DSL-1.8/ws/build/distsourcebuild/poi-4.0.0-SNAPSHOT/build/scratchpad-classes>
    [javac] Note: Some input files use or override a deprecated API.
    [javac] Note: Recompile with -Xlint:deprecation for details.
    [javac] Compiling 190 source files to <https://builds.apache.org/job/POI-DSL-1.8/ws/build/distsourcebuild/poi-4.0.0-SNAPSHOT/build/scratchpad-test-classes>
    [javac] Note: Some input files use or override a deprecated API.
    [javac] Note: Recompile with -Xlint:deprecation for details.
     [copy] Copying 2 files to <https://builds.apache.org/job/POI-DSL-1.8/ws/build/distsourcebuild/poi-4.0.0-SNAPSHOT/build/scratchpad-classes>

check-compiled-ooxml-xsds:

compile-ooxml-xsds:

compile-ooxml:
    [javac] Compiling 433 source files to <https://builds.apache.org/job/POI-DSL-1.8/ws/build/distsourcebuild/poi-4.0.0-SNAPSHOT/build/ooxml-classes>
    [javac] Note: Some input files use or override a deprecated API.
    [javac] Note: Recompile with -Xlint:deprecation for details.
    [javac] Compiling 234 source files to <https://builds.apache.org/job/POI-DSL-1.8/ws/build/distsourcebuild/poi-4.0.0-SNAPSHOT/build/ooxml-test-classes>
    [javac] Note: Some input files use or override a deprecated API.
    [javac] Note: Recompile with -Xlint:deprecation for details.
     [copy] Copying 3 files to <https://builds.apache.org/job/POI-DSL-1.8/ws/build/distsourcebuild/poi-4.0.0-SNAPSHOT/build/ooxml-classes>

compile-examples:
    [javac] Compiling 149 source files to <https://builds.apache.org/job/POI-DSL-1.8/ws/build/distsourcebuild/poi-4.0.0-SNAPSHOT/build/examples-classes>
     [copy] Copying 1 file to <https://builds.apache.org/job/POI-DSL-1.8/ws/build/distsourcebuild/poi-4.0.0-SNAPSHOT/build/examples-classes>

compile-excelant:
    [javac] Compiling 14 source files to <https://builds.apache.org/job/POI-DSL-1.8/ws/build/distsourcebuild/poi-4.0.0-SNAPSHOT/build/excelant-classes>
    [javac] Compiling 13 source files to <https://builds.apache.org/job/POI-DSL-1.8/ws/build/distsourcebuild/poi-4.0.0-SNAPSHOT/build/excelant-test-classes>
     [copy] Copying 1 file to <https://builds.apache.org/job/POI-DSL-1.8/ws/build/distsourcebuild/poi-4.0.0-SNAPSHOT/build/excelant-classes>

compile:

-compile-ooxml-lite-check:

compile-ooxml-lite:
     [echo] Running ooxml-lite generator
    [mkdir] Created dir: <https://builds.apache.org/job/POI-DSL-1.8/ws/build/distsourcebuild/poi-4.0.0-SNAPSHOT/build/ooxml-lite-merged>
      [jar] Building jar: <https://builds.apache.org/job/POI-DSL-1.8/ws/build/distsourcebuild/poi-4.0.0-SNAPSHOT/build/ooxml-lite-merged/ooxml-lite-merged.jar>
     [java] Collecting unit tests from <https://builds.apache.org/job/POI-DSL-1.8/ws/build/distsourcebuild/poi-4.0.0-SNAPSHOT/build/ooxml-test-classes>
     [java] Inner class org.apache.poi.TestPOIXMLDocument$1.class not included
     [java] Inner class org.apache.poi.xssf.usermodel.TestMatrixFormulasFromXMLSpreadsheet$1.class not included
     [java] Inner class org.apache.poi.xssf.usermodel.TestMatrixFormulasFromXMLSpreadsheet$Navigator.class not included
     [java] Inner class org.apache.poi.TestPOIXMLDocument$UncaughtHandler.class not included
     [java] Inner class org.apache.poi.dev.TestOOXMLPrettyPrint$1.class not included
     [java] Inner class org.apache.poi.dev.TestOOXMLLister$1.class not included
     [java] Class org.apache.poi.benchmark.generated.AddImageBench_jmhType does not derive from TestCase and does not have a @Test annotation
     [java] Found 211 classes
     [java] SLF4J: Failed to load class "org.slf4j.impl.StaticLoggerBinder".
     [java] SLF4J: Defaulting to no-operation (NOP) logger implementation
     [java] SLF4J: See http://www.slf4j.org/codes.html#StaticLoggerBinder for further details.
     [java] Exception in thread "main" java.lang.RuntimeException: Tests did not succeed, cannot build ooxml-lite jar
     [java] ................................................................I.................................................I..........................................................................................................I................I......................................................................E......................................................................................I......................................................................................................I..I..I.I.................................................................................................................................................................................................................................................................................................................................................................................................................................................................................................................................................................................................................................................................................................................................I................................................................................I......II........I.I........................I.........I.....I...........................................................................................................................................................................................................................................................................I..............III.I.I.......I.......I.....I........................................................I....I............................................................................................................................................................................................................................................................................................................I..................................................................I..................................................................................................................................III...............................................................................................
     [java] Time: 87.388
     [java] There was 1 failure:
     [java] 1) changeEncryption[password.xls](org.apache.poi.poifs.crypt.TestHxxFEncryption)
     [java] org.apache.poi.util.RecordFormatException: The content of an excel record cannot exceed 8224 bytes
     [java] at org.apache.poi.hssf.record.RecordInputStream.nextRecord(RecordInputStream.java:227)
     [java] at org.apache.poi.hssf.record.RecordFactoryInputStream.nextRecord(RecordFactoryInputStream.java:252)
     [java] at org.apache.poi.hssf.record.RecordFactory.createRecords(RecordFactory.java:494)
     [java] at org.apache.poi.hssf.usermodel.HSSFWorkbook.<init>(HSSFWorkbook.java:356)
     [java] at org.apache.poi.hssf.extractor.ExcelExtractor.<init>(ExcelExtractor.java:74)
     [java] at org.apache.poi.extractor.OLE2ExtractorFactory.createExtractor(OLE2ExtractorFactory.java:183)
     [java] at org.apache.poi.extractor.OLE2ExtractorFactory.createExtractor(OLE2ExtractorFactory.java:124)
     [java] at org.apache.poi.extractor.ExtractorFactory.createExtractor(ExtractorFactory.java:300)
     [java] at org.apache.poi.extractor.ExtractorFactory.createExtractor(ExtractorFactory.java:185)
     [java] at org.apache.poi.poifs.crypt.TestHxxFEncryption.changeEncryption(TestHxxFEncryption.java:160)
     [java] at sun.reflect.NativeMethodAccessorImpl.invoke0(Native Method)
     [java] at sun.reflect.NativeMethodAccessorImpl.invoke(NativeMethodAccessorImpl.java:62)
     [java] at sun.reflect.DelegatingMethodAccessorImpl.invoke(DelegatingMethodAccessorImpl.java:43)
     [java] at java.lang.reflect.Method.invoke(Method.java:498)
     [java] at org.junit.runners.model.FrameworkMethod$1.runReflectiveCall(FrameworkMethod.java:50)
     [java] at org.junit.internal.runners.model.ReflectiveCallable.run(ReflectiveCallable.java:12)
     [java] at org.junit.runners.model.FrameworkMethod.invokeExplosively(FrameworkMethod.java:47)
     [java] at org.junit.internal.runners.statements.InvokeMethod.evaluate(InvokeMethod.java:17)
     [java] at org.junit.runners.ParentRunner.runLeaf(ParentRunner.java:325)
     [java] at org.junit.runners.BlockJUnit4ClassRunner.runChild(BlockJUnit4ClassRunner.java:78)
     [java] at org.junit.runners.BlockJUnit4ClassRunner.runChild(BlockJUnit4ClassRunner.java:57)
     [java] at org.junit.runners.ParentRunner$3.run(ParentRunner.java:290)
     [java] at org.junit.runners.ParentRunner$1.schedule(ParentRunner.java:71)
     [java] at org.junit.runners.ParentRunner.runChildren(ParentRunner.java:288)
     [java] at org.junit.runners.ParentRunner.access$000(ParentRunner.java:58)
     [java] at org.junit.runners.ParentRunner$2.evaluate(ParentRunner.java:268)
     [java] at org.junit.runners.ParentRunner.run(ParentRunner.java:363)
     [java] at org.junit.runners.Suite.runChild(Suite.java:128)
     [java] at org.junit.runners.Suite.runChild(Suite.java:27)
     [java] at org.junit.runners.ParentRunner$3.run(ParentRunner.java:290)
     [java] at org.junit.runners.ParentRunner$1.schedule(ParentRunner.java:71)
     [java] at org.junit.runners.ParentRunner.runChildren(ParentRunner.java:288)
     [java] at org.junit.runners.ParentRunner.access$000(ParentRunner.java:58)
     [java] at org.junit.runners.ParentRunner$2.evaluate(ParentRunner.java:268)
     [java] at org.junit.internal.runners.statements.RunAfters.evaluate(RunAfters.java:27)
     [java] at org.junit.runners.ParentRunner.run(ParentRunner.java:363)
     [java] at org.junit.runners.Suite.runChild(Suite.java:128)
     [java] at org.junit.runners.Suite.runChild(Suite.java:27)
     [java] at org.junit.runners.ParentRunner$3.run(ParentRunner.java:290)
     [java] at org.junit.runners.ParentRunner$1.schedule(ParentRunner.java:71)
     [java] at org.junit.runners.ParentRunner.runChildren(ParentRunner.java:288)
     [java] at org.junit.runners.ParentRunner.access$000(ParentRunner.java:58)
     [java] at org.junit.runners.ParentRunner$2.evaluate(ParentRunner.java:268)
     [java] at org.junit.runners.ParentRunner.run(ParentRunner.java:363)
     [java] at org.junit.runner.JUnitCore.run(JUnitCore.java:137)
     [java] at org.junit.runner.JUnitCore.run(JUnitCore.java:115)
     [java] at org.junit.runner.JUnitCore.run(JUnitCore.java:105)
     [java] at org.junit.runner.JUnitCore.run(JUnitCore.java:94)
     [java] at org.apache.poi.util.OOXMLLite.build(OOXMLLite.java:149)
     [java] at org.apache.poi.util.OOXMLLite.main(OOXMLLite.java:94)
     [java]
     [java] FAILURES!!!
     [java] Tests run: 2289,  Failures: 1
     [java]
     [java] at org.apache.poi.util.OOXMLLite.build(OOXMLLite.java:151)
     [java] at org.apache.poi.util.OOXMLLite.main(OOXMLLite.java:94)

BUILD FAILED
<https://builds.apache.org/job/POI-DSL-1.8/ws/src/integrationtest/build.xml>:80: The following error occurred while executing this line:
<https://builds.apache.org/job/POI-DSL-1.8/ws/build/distsourcebuild/poi-4.0.0-SNAPSHOT/build.xml>:1679: Java returned: 1

Total time: 2 minutes 28 seconds
Build step 'Invoke Ant' marked build as failure
Skipping publisher since build result is FAILURE
Archiving artifacts
[Fast Archiver] Compressed 234.33 MB of artifacts by 54.7% relative to #282
Skipping publisher since build result is FAILURE
Recording test results

---------------------------------------------------------------------
To unsubscribe, e-mail: [hidden email]
For additional commands, e-mail: [hidden email]

Reply | Threaded
Open this post in threaded view
|

Build failed in Jenkins: POI-DSL-1.8 #284

Apache Jenkins Server
See <https://builds.apache.org/job/POI-DSL-1.8/284/display/redirect?page=changes>

Changes:

[onealj] replace "".equals(string) with string.isEmpty() to avoid null strings silently evaluating to false; most code should probably check string for null  if it is not already

[onealj] prefer literal.equals(variable) over variable.equals(literal)

[onealj] convert "".equals(string) to string.isEmpty()

[onealj] simplfy PackagingURIHelper#combine boolean logic using xor and replacing +FORWARD_SLASH_CHAR with FORWARD_SLASH_STRING

[onealj] fix typo

[onealj] string.equals("") -> string.isEmpty() or "".equals(string)

[onealj] for -> foreach
string.equals() -> string.isEmpty() or .equals(string)
ArrayList -> List

------------------------------------------
[...truncated 45.89 KB...]
    [junit] Running org.apache.poi.hssf.record.chart.TestSeriesToChartGroupRecord
    [junit] Tests run: 2, Failures: 0, Errors: 0, Skipped: 0, Time elapsed: 0.001 sec
    [junit] Running org.apache.poi.hssf.record.chart.TestSheetPropertiesRecord
    [junit] Tests run: 2, Failures: 0, Errors: 0, Skipped: 0, Time elapsed: 0.002 sec
    [junit] Running org.apache.poi.hssf.record.chart.TestTextRecord
    [junit] Tests run: 2, Failures: 0, Errors: 0, Skipped: 0, Time elapsed: 0.003 sec
    [junit] Running org.apache.poi.hssf.record.chart.TestTickRecord
    [junit] Tests run: 2, Failures: 0, Errors: 0, Skipped: 0, Time elapsed: 0.004 sec
    [junit] Running org.apache.poi.hssf.record.chart.TestUnitsRecord
    [junit] Tests run: 2, Failures: 0, Errors: 0, Skipped: 0, Time elapsed: 0.002 sec
    [junit] Running org.apache.poi.hssf.record.chart.TestValueRangeRecord
    [junit] Tests run: 2, Failures: 0, Errors: 0, Skipped: 0, Time elapsed: 0.002 sec
    [junit] Running org.apache.poi.hssf.record.common.TestUnicodeString
    [junit] Tests run: 10, Failures: 0, Errors: 0, Skipped: 0, Time elapsed: 0.01 sec
    [junit] Running org.apache.poi.hssf.record.pivot.TestExtendedPivotTableViewFieldsRecord
    [junit] Tests run: 2, Failures: 0, Errors: 0, Skipped: 0, Time elapsed: 0.003 sec
    [junit] Running org.apache.poi.hssf.record.pivot.TestPageItemRecord
    [junit] Tests run: 2, Failures: 0, Errors: 0, Skipped: 0, Time elapsed: 0.003 sec
    [junit] Running org.apache.poi.hssf.record.pivot.TestViewFieldsRecord
    [junit] Tests run: 2, Failures: 0, Errors: 0, Skipped: 0, Time elapsed: 0.002 sec
    [junit] Running org.apache.poi.hssf.usermodel.TestBug42464
    [junit] Tests run: 2, Failures: 0, Errors: 0, Skipped: 0, Time elapsed: 0.165 sec
    [junit] Running org.apache.poi.hssf.usermodel.TestBugs
    [junit] Tests run: 184, Failures: 0, Errors: 0, Skipped: 4, Time elapsed: 4.291 sec
    [junit] Running org.apache.poi.hssf.usermodel.TestCellStyle
    [junit] Tests run: 12, Failures: 0, Errors: 0, Skipped: 0, Time elapsed: 3.034 sec
    [junit] Running org.apache.poi.hssf.usermodel.TestCloneSheet
    [junit] Tests run: 7, Failures: 0, Errors: 0, Skipped: 0, Time elapsed: 0.007 sec
    [junit] Running org.apache.poi.hssf.usermodel.TestCryptoAPI
    [junit] Tests run: 1, Failures: 0, Errors: 0, Skipped: 0, Time elapsed: 0.018 sec
    [junit] Running org.apache.poi.hssf.usermodel.TestDataValidation
    [junit] Tests run: 10, Failures: 0, Errors: 0, Skipped: 0, Time elapsed: 0.021 sec
    [junit] Running org.apache.poi.hssf.usermodel.TestEmbeddedObjects
    [junit] Tests run: 3, Failures: 0, Errors: 0, Skipped: 0, Time elapsed: 0.011 sec
    [junit] Running org.apache.poi.hssf.usermodel.TestEscherGraphics
    [junit] Tests run: 7, Failures: 0, Errors: 0, Skipped: 0, Time elapsed: 0.022 sec
    [junit] Running org.apache.poi.hssf.usermodel.TestEscherGraphics2d
    [junit] Tests run: 7, Failures: 0, Errors: 0, Skipped: 0, Time elapsed: 0.016 sec
    [junit] Running org.apache.poi.hssf.usermodel.TestExternalReferenceChange
    [junit] Tests run: 1, Failures: 0, Errors: 0, Skipped: 0, Time elapsed: 0.006 sec
    [junit] Running org.apache.poi.hssf.usermodel.TestFontDetails
    [junit] Tests run: 3, Failures: 0, Errors: 0, Skipped: 0, Time elapsed: 0.002 sec
    [junit] Running org.apache.poi.hssf.usermodel.TestFormulaEvaluatorBugs
    [junit] Tests run: 9, Failures: 0, Errors: 0, Skipped: 0, Time elapsed: 0.135 sec
    [junit] Running org.apache.poi.hssf.usermodel.TestFormulaEvaluatorDocs
    [junit] Tests run: 1, Failures: 0, Errors: 0, Skipped: 0, Time elapsed: 0.003 sec
    [junit] Running org.apache.poi.hssf.usermodel.TestFormulas
    [junit] Tests run: 33, Failures: 0, Errors: 0, Skipped: 0, Time elapsed: 0.899 sec
    [junit] Running org.apache.poi.hssf.usermodel.TestHSSFCell
    [junit] Tests run: 41, Failures: 0, Errors: 0, Skipped: 0, Time elapsed: 0.052 sec
    [junit] Running org.apache.poi.hssf.usermodel.TestHSSFClientAnchor
    [junit] Tests run: 9, Failures: 0, Errors: 0, Skipped: 0, Time elapsed: 0.01 sec
    [junit] Running org.apache.poi.hssf.usermodel.TestHSSFComment
    [junit] Tests run: 21, Failures: 0, Errors: 0, Skipped: 0, Time elapsed: 0.995 sec
    [junit] Running org.apache.poi.hssf.usermodel.TestHSSFConditionalFormatting
    [junit] Tests run: 23, Failures: 0, Errors: 0, Skipped: 0, Time elapsed: 0.078 sec
    [junit] Running org.apache.poi.hssf.usermodel.TestHSSFDataFormat
    [junit] Tests run: 7, Failures: 0, Errors: 0, Skipped: 0, Time elapsed: 0.015 sec
    [junit] Running org.apache.poi.hssf.usermodel.TestHSSFDataFormatter
    [junit] Oct 18, 2017 1:02:55 PM org.apache.poi.ss.format.CellFormatPart getColor
    [junit] WARNING: Unknown color: "BLUE"
    [junit] Oct 18, 2017 1:02:55 PM org.apache.poi.ss.format.CellFormatPart getColor
    [junit] WARNING: Unknown color: "RED"
    [junit] Oct 18, 2017 1:02:55 PM org.apache.poi.ss.format.CellFormatPart getColor
    [junit] WARNING: Unknown color: "GREEN"
    [junit] Tests run: 5, Failures: 0, Errors: 0, Skipped: 0, Time elapsed: 0.034 sec
    [junit] Running org.apache.poi.hssf.usermodel.TestHSSFDateUtil
    [junit] Tests run: 20, Failures: 0, Errors: 0, Skipped: 0, Time elapsed: 0.026 sec
    [junit] Running org.apache.poi.hssf.usermodel.TestHSSFExternalFunctions
    [junit] Tests run: 2, Failures: 0, Errors: 0, Skipped: 0, Time elapsed: 0.004 sec
    [junit] Running org.apache.poi.hssf.usermodel.TestHSSFFont
    [junit] Tests run: 4, Failures: 0, Errors: 0, Skipped: 0, Time elapsed: 0.005 sec
    [junit] Running org.apache.poi.hssf.usermodel.TestHSSFFormulaEvaluator
    [junit] Tests run: 26, Failures: 0, Errors: 0, Skipped: 0, Time elapsed: 0.151 sec
    [junit] Running org.apache.poi.hssf.usermodel.TestHSSFHeaderFooter
    [junit] Tests run: 8, Failures: 0, Errors: 0, Skipped: 0, Time elapsed: 0.012 sec
    [junit] Running org.apache.poi.hssf.usermodel.TestHSSFHyperlink
    [junit] Tests run: 8, Failures: 0, Errors: 0, Skipped: 0, Time elapsed: 0.241 sec
    [junit] Running org.apache.poi.hssf.usermodel.TestHSSFName
    [junit] Tests run: 30, Failures: 0, Errors: 0, Skipped: 0, Time elapsed: 0.036 sec
    [junit] Running org.apache.poi.hssf.usermodel.TestHSSFOptimiser
    [junit] Tests run: 4, Failures: 0, Errors: 0, Skipped: 0, Time elapsed: 0.004 sec
    [junit] Running org.apache.poi.hssf.usermodel.TestHSSFPalette
    [junit] Tests run: 7, Failures: 0, Errors: 0, Skipped: 0, Time elapsed: 0.008 sec
    [junit] Running org.apache.poi.hssf.usermodel.TestHSSFPatriarch
    [junit] Tests run: 2, Failures: 0, Errors: 0, Skipped: 0, Time elapsed: 0.002 sec
    [junit] Running org.apache.poi.hssf.usermodel.TestHSSFPicture
    [junit] Tests run: 9, Failures: 0, Errors: 0, Skipped: 0, Time elapsed: 0.05 sec
    [junit] Running org.apache.poi.hssf.usermodel.TestHSSFPictureData
    [junit] Tests run: 3, Failures: 0, Errors: 0, Skipped: 0, Time elapsed: 0.199 sec
    [junit] Running org.apache.poi.hssf.usermodel.TestHSSFRichTextString
    [junit] Tests run: 5, Failures: 0, Errors: 0, Skipped: 0, Time elapsed: 0.26 sec
    [junit] Running org.apache.poi.hssf.usermodel.TestHSSFRow
    [junit] Tests run: 12, Failures: 0, Errors: 0, Skipped: 0, Time elapsed: 0.015 sec
    [junit] Running org.apache.poi.hssf.usermodel.TestHSSFSheet
    [junit] Tests run: 84, Failures: 0, Errors: 0, Skipped: 0, Time elapsed: 0.5 sec
    [junit] Running org.apache.poi.hssf.usermodel.TestHSSFSheetAutosizeColumn
    [junit] Tests run: 7, Failures: 0, Errors: 0, Skipped: 0, Time elapsed: 0.033 sec
    [junit] Running org.apache.poi.hssf.usermodel.TestHSSFSheetShiftRows
    [junit] Tests run: 17, Failures: 0, Errors: 0, Skipped: 2, Time elapsed: 0.61 sec
    [junit] Running org.apache.poi.hssf.usermodel.TestHSSFSheetUpdateArrayFormulas
    [junit] Tests run: 18, Failures: 0, Errors: 0, Skipped: 1, Time elapsed: 0.026 sec
    [junit] Running org.apache.poi.hssf.usermodel.TestHSSFTextbox
    [junit] Tests run: 2, Failures: 0, Errors: 0, Skipped: 0, Time elapsed: 0.003 sec
    [junit] Running org.apache.poi.hssf.usermodel.TestHSSFWorkbook
    [junit] Tests run: 57, Failures: 0, Errors: 0, Skipped: 1, Time elapsed: 0.153 sec
    [junit] Running org.apache.poi.hssf.usermodel.TestMatrixFormulasFromBinarySpreadsheet
    [junit] Tests run: 34, Failures: 0, Errors: 0, Skipped: 0, Time elapsed: 0.139 sec
    [junit] Running org.apache.poi.hssf.usermodel.TestNonStandardWorkbookStreamNames
    [junit] Tests run: 4, Failures: 0, Errors: 0, Skipped: 0, Time elapsed: 0.029 sec
    [junit] Running org.apache.poi.hssf.usermodel.TestOLE2Embeding
    [junit] Tests run: 3, Failures: 0, Errors: 0, Skipped: 0, Time elapsed: 0.013 sec
    [junit] Running org.apache.poi.hssf.usermodel.TestPOIFSProperties
    [junit] Tests run: 2, Failures: 0, Errors: 0, Skipped: 0, Time elapsed: 0.005 sec
    [junit] Running org.apache.poi.hssf.usermodel.TestPatriarch
    [junit] Tests run: 1, Failures: 0, Errors: 0, Skipped: 0, Time elapsed: 0.002 sec
    [junit] Running org.apache.poi.hssf.usermodel.TestPolygon
    [junit] Tests run: 6, Failures: 0, Errors: 0, Skipped: 0, Time elapsed: 0.013 sec
    [junit] Running org.apache.poi.hssf.usermodel.TestReadWriteChart
    [junit] Tests run: 1, Failures: 0, Errors: 0, Skipped: 0, Time elapsed: 0.003 sec
    [junit] Running org.apache.poi.hssf.usermodel.TestRowStyle
    [junit] Tests run: 3, Failures: 0, Errors: 0, Skipped: 0, Time elapsed: 0.009 sec
    [junit] Running org.apache.poi.hssf.usermodel.TestSanityChecker
    [junit] Tests run: 1, Failures: 0, Errors: 0, Skipped: 0, Time elapsed: 0.003 sec
    [junit] Running org.apache.poi.hssf.usermodel.TestShapeGroup
    [junit] Tests run: 6, Failures: 0, Errors: 0, Skipped: 0, Time elapsed: 0.011 sec
    [junit] Running org.apache.poi.hssf.usermodel.TestSheetHiding
    [junit] Tests run: 5, Failures: 0, Errors: 0, Skipped: 0, Time elapsed: 0.01 sec
    [junit] Running org.apache.poi.hssf.usermodel.TestText
    [junit] Tests run: 4, Failures: 0, Errors: 0, Skipped: 0, Time elapsed: 0.017 sec
    [junit] Running org.apache.poi.hssf.usermodel.TestUnicodeWorkbook
    [junit] Tests run: 1, Failures: 0, Errors: 0, Skipped: 0, Time elapsed: 0.002 sec
    [junit] Running org.apache.poi.hssf.usermodel.TestWorkbook
    [junit] Tests run: 19, Failures: 0, Errors: 0, Skipped: 0, Time elapsed: 0.058 sec
    [junit] Running org.apache.poi.hssf.util.TestAreaReference
    [junit] Tests run: 6, Failures: 0, Errors: 0, Skipped: 0, Time elapsed: 0.009 sec
    [junit] Running org.apache.poi.hssf.util.TestCellReference
    [junit] Tests run: 12, Failures: 0, Errors: 0, Skipped: 0, Time elapsed: 0.016 sec
    [junit] Running org.apache.poi.hssf.util.TestHSSFColor
    [junit] Tests run: 3, Failures: 0, Errors: 0, Skipped: 0, Time elapsed: 0.004 sec
    [junit] Running org.apache.poi.hssf.util.TestRKUtil
    [junit] Tests run: 1, Failures: 0, Errors: 0, Skipped: 0, Time elapsed: 0.001 sec
    [junit] Running org.apache.poi.poifs.crypt.TestBiff8DecryptingStream
    [junit] Tests run: 4, Failures: 0, Errors: 0, Skipped: 0, Time elapsed: 0.029 sec
    [junit] Running org.apache.poi.poifs.crypt.TestCipherAlgorithm
    [junit] Tests run: 4, Failures: 0, Errors: 0, Skipped: 0, Time elapsed: 0.005 sec
    [junit] Running org.apache.poi.poifs.crypt.TestXorEncryption
    [junit] Tests run: 2, Failures: 0, Errors: 0, Skipped: 0, Time elapsed: 0.004 sec
    [junit] Running org.apache.poi.poifs.crypt.binaryrc4.TestBinaryRC4
    [junit] Tests run: 3, Failures: 0, Errors: 0, Skipped: 0, Time elapsed: 0.006 sec
    [junit] Running org.apache.poi.poifs.dev.TestPOIFSDump
    [junit] Tests run: 4, Failures: 0, Errors: 0, Skipped: 1, Time elapsed: 0.025 sec
    [junit] Running org.apache.poi.poifs.eventfilesystem.TestPOIFSReaderRegistry
    [junit] Tests run: 2, Failures: 0, Errors: 0, Skipped: 0, Time elapsed: 0.003 sec
    [junit] Running org.apache.poi.poifs.filesystem.TestDirectoryNode
    [junit] Tests run: 4, Failures: 0, Errors: 0, Skipped: 0, Time elapsed: 0.007 sec
    [junit] Running org.apache.poi.poifs.filesystem.TestDocument
    [junit] Tests run: 1, Failures: 0, Errors: 0, Skipped: 0, Time elapsed: 0.175 sec
    [junit] Running org.apache.poi.poifs.filesystem.TestDocumentDescriptor
    [junit] Tests run: 1, Failures: 0, Errors: 0, Skipped: 0, Time elapsed: 0.002 sec
    [junit] Running org.apache.poi.poifs.filesystem.TestDocumentInputStream
    [junit] Tests run: 8, Failures: 0, Errors: 0, Skipped: 0, Time elapsed: 0.484 sec
    [junit] Running org.apache.poi.poifs.filesystem.TestDocumentNode
    [junit] Tests run: 1, Failures: 0, Errors: 0, Skipped: 0, Time elapsed: 0.001 sec
    [junit] Running org.apache.poi.poifs.filesystem.TestDocumentOutputStream
    [junit] Tests run: 4, Failures: 0, Errors: 0, Skipped: 0, Time elapsed: 0.005 sec
    [junit] Running org.apache.poi.poifs.filesystem.TestEmptyDocument
    [junit] Tests run: 5, Failures: 0, Errors: 0, Skipped: 0, Time elapsed: 0.006 sec
    [junit] Running org.apache.poi.poifs.filesystem.TestEntryUtils
    [junit] Tests run: 3, Failures: 0, Errors: 0, Skipped: 0, Time elapsed: 0.003 sec
    [junit] Running org.apache.poi.poifs.filesystem.TestFileSystemBugs
    [junit] Tests run: 3, Failures: 0, Errors: 0, Skipped: 0, Time elapsed: 0.011 sec
    [junit] Running org.apache.poi.poifs.filesystem.TestFilteringDirectoryNode
    [junit] Tests run: 3, Failures: 0, Errors: 0, Skipped: 0, Time elapsed: 0.003 sec
    [junit] Running org.apache.poi.poifs.filesystem.TestNPOIFSFileSystem
    [junit] Tests run: 17, Failures: 0, Errors: 0, Skipped: 2, Time elapsed: 0.323 sec
    [junit] Running org.apache.poi.poifs.filesystem.TestNPOIFSMiniStore
    [junit] Tests run: 7, Failures: 0, Errors: 0, Skipped: 0, Time elapsed: 0.015 sec
    [junit] Running org.apache.poi.poifs.filesystem.TestNPOIFSStream
    [junit] Tests run: 16, Failures: 0, Errors: 0, Skipped: 0, Time elapsed: 0.021 sec
    [junit] Running org.apache.poi.poifs.filesystem.TestNotOLE2Exception
    [junit] Tests run: 4, Failures: 0, Errors: 0, Skipped: 0, Time elapsed: 0.005 sec
    [junit] Running org.apache.poi.poifs.filesystem.TestOfficeXMLException
    [junit] Tests run: 5, Failures: 0, Errors: 0, Skipped: 0, Time elapsed: 0.004 sec
    [junit] Running org.apache.poi.poifs.filesystem.TestOle10Native
    [junit] Tests run: 3, Failures: 0, Errors: 0, Skipped: 0, Time elapsed: 0.11 sec
    [junit] Running org.apache.poi.poifs.filesystem.TestPOIFSDocumentPath
    [junit] Tests run: 4, Failures: 0, Errors: 0, Skipped: 0, Time elapsed: 0.004 sec
    [junit] Running org.apache.poi.poifs.filesystem.TestPOIFSFileSystem
    [junit] Tests run: 5, Failures: 0, Errors: 0, Skipped: 0, Time elapsed: 0.053 sec
    [junit] Running org.apache.poi.poifs.filesystem.TestPropertySorter
    [junit] Tests run: 2, Failures: 0, Errors: 0, Skipped: 0, Time elapsed: 0.003 sec
    [junit] Running org.apache.poi.poifs.macros.TestVBAMacroReader
    [junit] Tests run: 25, Failures: 0, Errors: 0, Skipped: 6, Time elapsed: 0.089 sec
    [junit] Running org.apache.poi.poifs.nio.TestDataSource
    [junit] Tests run: 4, Failures: 0, Errors: 0, Skipped: 0, Time elapsed: 0.008 sec
    [junit] Running org.apache.poi.poifs.property.TestDirectoryProperty
    [junit] Tests run: 6, Failures: 0, Errors: 0, Skipped: 0, Time elapsed: 0.019 sec
    [junit] Running org.apache.poi.poifs.property.TestDocumentProperty
    [junit] Tests run: 2, Failures: 0, Errors: 0, Skipped: 0, Time elapsed: 0.003 sec
    [junit] Running org.apache.poi.poifs.property.TestPropertyFactory
    [junit] Tests run: 1, Failures: 0, Errors: 0, Skipped: 0, Time elapsed: 0.002 sec
    [junit] Running org.apache.poi.poifs.property.TestPropertyTable
    [junit] Tests run: 1, Failures: 0, Errors: 0, Skipped: 0, Time elapsed: 0.001 sec
    [junit] Running org.apache.poi.poifs.property.TestRootProperty
    [junit] Tests run: 3, Failures: 0, Errors: 0, Skipped: 0, Time elapsed: 0.002 sec
    [junit] Running org.apache.poi.poifs.storage.TestBATBlock
    [junit] Tests run: 9, Failures: 0, Errors: 0, Skipped: 0, Time elapsed: 0.016 sec
    [junit] Running org.apache.poi.poifs.storage.TestBlockAllocationTableReader
    [junit] Tests run: 4, Failures: 0, Errors: 0, Skipped: 0, Time elapsed: 0.021 sec
    [junit] Running org.apache.poi.poifs.storage.TestBlockAllocationTableWriter
    [junit] Tests run: 3, Failures: 0, Errors: 0, Skipped: 0, Time elapsed: 0.008 sec
    [junit] Running org.apache.poi.poifs.storage.TestBlockListImpl
    [junit] Tests run: 4, Failures: 0, Errors: 0, Skipped: 0, Time elapsed: 0.006 sec
    [junit] Running org.apache.poi.poifs.storage.TestDocumentBlock
    [junit] Tests run: 2, Failures: 0, Errors: 0, Skipped: 0, Time elapsed: 0.003 sec
    [junit] Running org.apache.poi.poifs.storage.TestHeaderBlockReading
    [junit] Tests run: 1, Failures: 0, Errors: 0, Skipped: 0, Time elapsed: 0.001 sec
    [junit] Running org.apache.poi.poifs.storage.TestHeaderBlockWriting
    [junit] Tests run: 4, Failures: 0, Errors: 0, Skipped: 0, Time elapsed: 0.018 sec
    [junit] Running org.apache.poi.poifs.storage.TestPropertyBlock
    [junit] Tests run: 1, Failures: 0, Errors: 0, Skipped: 0, Time elapsed: 0.003 sec
    [junit] Running org.apache.poi.poifs.storage.TestRawDataBlock
    [junit] Tests run: 4, Failures: 0, Errors: 0, Skipped: 0, Time elapsed: 0.032 sec
    [junit] Running org.apache.poi.poifs.storage.TestRawDataBlockList
    [junit] Tests run: 3, Failures: 0, Errors: 0, Skipped: 0, Time elapsed: 0.019 sec
    [junit] Running org.apache.poi.poifs.storage.TestSmallBlockTableReader
    [junit] Tests run: 1, Failures: 0, Errors: 0, Skipped: 0, Time elapsed: 0.002 sec
    [junit] Running org.apache.poi.poifs.storage.TestSmallBlockTableWriter
    [junit] Tests run: 1, Failures: 0, Errors: 0, Skipped: 0, Time elapsed: 0.001 sec
    [junit] Running org.apache.poi.poifs.storage.TestSmallDocumentBlock
    [junit] Tests run: 5, Failures: 0, Errors: 0, Skipped: 0, Time elapsed: 0.016 sec
    [junit] Running org.apache.poi.poifs.storage.TestSmallDocumentBlockList
    [junit] Tests run: 1, Failures: 0, Errors: 0, Skipped: 0, Time elapsed: 0.004 sec
    [junit] Running org.apache.poi.sl.TestCommonSL
    [junit] Tests run: 1, Failures: 0, Errors: 0, Skipped: 1, Time elapsed: 0.001 sec
    [junit] Running org.apache.poi.sl.draw.geom.TestPresetGeometries
    [junit] Tests run: 2, Failures: 0, Errors: 1, Skipped: 1, Time elapsed: 0.454 sec

BUILD FAILED
<https://builds.apache.org/job/POI-DSL-1.8/ws/build.xml>:1310: Tests failed

Total time: 3 minutes 42 seconds
Build step 'Invoke Ant' marked build as failure
Skipping publisher since build result is FAILURE
Archiving artifacts
[Fast Archiver] Compressed 66.32 MB of artifacts by 99.9% relative to #282
Skipping publisher since build result is FAILURE
Recording test results

---------------------------------------------------------------------
To unsubscribe, e-mail: [hidden email]
For additional commands, e-mail: [hidden email]

Reply | Threaded
Open this post in threaded view
|

Jenkins build is back to normal : POI-DSL-1.8 #285

Apache Jenkins Server
See <https://builds.apache.org/job/POI-DSL-1.8/285/display/redirect?page=changes>


---------------------------------------------------------------------
To unsubscribe, e-mail: [hidden email]
For additional commands, e-mail: [hidden email]