Build failed in Jenkins: POI-DSL-1.8 #1049

classic Classic list List threaded Threaded
2 messages Options
Reply | Threaded
Open this post in threaded view
|

Build failed in Jenkins: POI-DSL-1.8 #1049

Apache Jenkins Server
See <https://builds.apache.org/job/POI-DSL-1.8/1049/display/redirect>

Changes:


------------------------------------------
[...truncated 615.23 KB...]
      [get] Destination already exists (skipping): <https://builds.apache.org/job/POI-DSL-1.8/ws/lib/util/maven-ant-tasks-2.1.3.jar>

mvn-install:
[mvn:install] [INFO] Installing <https://builds.apache.org/job/POI-DSL-1.8/ws/build/dist/maven/poi/poi-5.0.0-SNAPSHOT.jar> to /home/jenkins/.m2/repository/org/apache/poi/poi/5.0.0-SNAPSHOT/poi-5.0.0-SNAPSHOT.jar
[mvn:install] [INFO] Installing <https://builds.apache.org/job/POI-DSL-1.8/ws/build/dist/maven/poi-scratchpad/poi-scratchpad-5.0.0-SNAPSHOT.jar> to /home/jenkins/.m2/repository/org/apache/poi/poi-scratchpad/5.0.0-SNAPSHOT/poi-scratchpad-5.0.0-SNAPSHOT.jar
[mvn:install] [INFO] Installing <https://builds.apache.org/job/POI-DSL-1.8/ws/build/dist/maven/poi-ooxml/poi-ooxml-5.0.0-SNAPSHOT.jar> to /home/jenkins/.m2/repository/org/apache/poi/poi-ooxml/5.0.0-SNAPSHOT/poi-ooxml-5.0.0-SNAPSHOT.jar
[mvn:install] [INFO] Installing <https://builds.apache.org/job/POI-DSL-1.8/ws/build/dist/maven/poi-examples/poi-examples-5.0.0-SNAPSHOT.jar> to /home/jenkins/.m2/repository/org/apache/poi/poi-examples/5.0.0-SNAPSHOT/poi-examples-5.0.0-SNAPSHOT.jar
[mvn:install] [INFO] Installing <https://builds.apache.org/job/POI-DSL-1.8/ws/build/dist/maven/poi-ooxml-schemas/poi-ooxml-schemas-5.0.0-SNAPSHOT.jar> to /home/jenkins/.m2/repository/org/apache/poi/poi-ooxml-schemas/5.0.0-SNAPSHOT/poi-ooxml-schemas-5.0.0-SNAPSHOT.jar
[mvn:install] [INFO] Installing <https://builds.apache.org/job/POI-DSL-1.8/ws/build/dist/maven/poi-excelant/poi-excelant-5.0.0-SNAPSHOT.jar> to /home/jenkins/.m2/repository/org/apache/poi/poi-excelant/5.0.0-SNAPSHOT/poi-excelant-5.0.0-SNAPSHOT.jar

jenkins:

BUILD SUCCESSFUL
Total time: 34 minutes 2 seconds
[integrationtest] $ /home/jenkins/tools/ant/latest1.10/bin/ant -file build.xml run
Buildfile: <https://builds.apache.org/job/POI-DSL-1.8/ws/src/integrationtest/build.xml>

init:

runSourceBuild:
    [mkdir] Created dir: <https://builds.apache.org/job/POI-DSL-1.8/ws/build/distsourcebuild>
     [echo] Found source package at <https://builds.apache.org/job/POI-DSL-1.8/ws/build/dist/poi-src-5.0.0-SNAPSHOT-20200725.zip>
    [unzip] Expanding: <https://builds.apache.org/job/POI-DSL-1.8/ws/build/dist/poi-src-5.0.0-SNAPSHOT-20200725.zip> into <https://builds.apache.org/job/POI-DSL-1.8/ws/build/distsourcebuild>
    [mkdir] Created dir: <https://builds.apache.org/job/POI-DSL-1.8/ws/build/distsourcebuild/poi-5.0.0-SNAPSHOT/lib>
     [copy] Copying 56 files to <https://builds.apache.org/job/POI-DSL-1.8/ws/build/distsourcebuild/poi-5.0.0-SNAPSHOT/lib>
     [echo] Building in temporary dir <https://builds.apache.org/job/POI-DSL-1.8/ws/build/distsourcebuild/poi-5.0.0-SNAPSHOT/>

check-jars:

fetch-jars:

check-ooxml-jars:

fetch-ooxml-jars:

init:
    [mkdir] Created dir: <https://builds.apache.org/job/POI-DSL-1.8/ws/build/distsourcebuild/poi-5.0.0-SNAPSHOT/build>
    [mkdir] Created dir: <https://builds.apache.org/job/POI-DSL-1.8/ws/build/distsourcebuild/poi-5.0.0-SNAPSHOT/build/classes>
    [mkdir] Created dir: <https://builds.apache.org/job/POI-DSL-1.8/ws/build/distsourcebuild/poi-5.0.0-SNAPSHOT/build/test-classes>
    [mkdir] Created dir: <https://builds.apache.org/job/POI-DSL-1.8/ws/build/distsourcebuild/poi-5.0.0-SNAPSHOT/build/test-results>
    [mkdir] Created dir: <https://builds.apache.org/job/POI-DSL-1.8/ws/build/distsourcebuild/poi-5.0.0-SNAPSHOT/build/scratchpad-classes>
    [mkdir] Created dir: <https://builds.apache.org/job/POI-DSL-1.8/ws/build/distsourcebuild/poi-5.0.0-SNAPSHOT/build/scratchpad-test-classes>
    [mkdir] Created dir: <https://builds.apache.org/job/POI-DSL-1.8/ws/build/distsourcebuild/poi-5.0.0-SNAPSHOT/build/scratchpad-test-results>
    [mkdir] Created dir: <https://builds.apache.org/job/POI-DSL-1.8/ws/build/distsourcebuild/poi-5.0.0-SNAPSHOT/build/geometry-java>
    [mkdir] Created dir: <https://builds.apache.org/job/POI-DSL-1.8/ws/build/distsourcebuild/poi-5.0.0-SNAPSHOT/build/ooxml-classes>
    [mkdir] Created dir: <https://builds.apache.org/job/POI-DSL-1.8/ws/build/distsourcebuild/poi-5.0.0-SNAPSHOT/build/ooxml-test-classes>
    [mkdir] Created dir: <https://builds.apache.org/job/POI-DSL-1.8/ws/build/distsourcebuild/poi-5.0.0-SNAPSHOT/build/ooxml-test-results>
    [mkdir] Created dir: <https://builds.apache.org/job/POI-DSL-1.8/ws/build/distsourcebuild/poi-5.0.0-SNAPSHOT/build/excelant-classes>
    [mkdir] Created dir: <https://builds.apache.org/job/POI-DSL-1.8/ws/build/distsourcebuild/poi-5.0.0-SNAPSHOT/build/excelant-test-classes>
    [mkdir] Created dir: <https://builds.apache.org/job/POI-DSL-1.8/ws/build/distsourcebuild/poi-5.0.0-SNAPSHOT/build/excelant-test-results>
    [mkdir] Created dir: <https://builds.apache.org/job/POI-DSL-1.8/ws/build/distsourcebuild/poi-5.0.0-SNAPSHOT/build/examples-classes>
    [mkdir] Created dir: <https://builds.apache.org/job/POI-DSL-1.8/ws/build/distsourcebuild/poi-5.0.0-SNAPSHOT/build/integration-test-classes>
    [mkdir] Created dir: <https://builds.apache.org/job/POI-DSL-1.8/ws/build/distsourcebuild/poi-5.0.0-SNAPSHOT/build/integration-test-results>
    [mkdir] Created dir: <https://builds.apache.org/job/POI-DSL-1.8/ws/build/distsourcebuild/poi-5.0.0-SNAPSHOT/build/dist>
    [mkdir] Created dir: <https://builds.apache.org/job/POI-DSL-1.8/ws/build/distsourcebuild/poi-5.0.0-SNAPSHOT/build/site>
     [echo] Using Ant: Apache Ant(TM) version 1.10.7 compiled on September 1 2019 from /home/jenkins/tools/ant/latest1.10, Ant detected Java 1.8 (may be different than actual Java sometimes...)
     [echo] Using Java: 1.8.0_252/1.8.0_252-b09/25.252-b09/OpenJDK 64-Bit Server VM from Oracle Corporation on Linux: 4.15.0-74-generic
     [echo] Building Apache POI version 5.0.0-SNAPSHOT and RC: RC1

-version-java-check:

compile-version:
     [copy] Copying 1 file to <https://builds.apache.org/job/POI-DSL-1.8/ws/build/distsourcebuild/poi-5.0.0-SNAPSHOT/build/classes/org/apache/poi>
    [javac] Compiling 1 source file to <https://builds.apache.org/job/POI-DSL-1.8/ws/build/distsourcebuild/poi-5.0.0-SNAPSHOT/build/classes>
   [delete] Deleting: <https://builds.apache.org/job/POI-DSL-1.8/ws/build/distsourcebuild/poi-5.0.0-SNAPSHOT/build/classes/org/apache/poi/Version.java>

compile-main:
    [javac] Compiling 1174 source files to <https://builds.apache.org/job/POI-DSL-1.8/ws/build/distsourcebuild/poi-5.0.0-SNAPSHOT/build/classes>
    [javac] Support for javac --release has been added in Java9 ignoring it
    [javac] Note: Some input files use or override a deprecated API.
    [javac] Note: Recompile with -Xlint:deprecation for details.
    [javac] Note: Some input files use unchecked or unsafe operations.
    [javac] Note: Recompile with -Xlint:unchecked for details.
    [javac] Creating empty <https://builds.apache.org/job/POI-DSL-1.8/ws/build/distsourcebuild/poi-5.0.0-SNAPSHOT/build/classes/org/apache/poi/ddf/package-info.class>
    [javac] Creating empty <https://builds.apache.org/job/POI-DSL-1.8/ws/build/distsourcebuild/poi-5.0.0-SNAPSHOT/build/classes/org/apache/poi/hssf/package-info.class>
    [javac] Creating empty <https://builds.apache.org/job/POI-DSL-1.8/ws/build/distsourcebuild/poi-5.0.0-SNAPSHOT/build/classes/org/apache/poi/poifs/dev/package-info.class>
    [javac] Creating empty <https://builds.apache.org/job/POI-DSL-1.8/ws/build/distsourcebuild/poi-5.0.0-SNAPSHOT/build/classes/org/apache/poi/util/package-info.class>
    [javac] Creating empty <https://builds.apache.org/job/POI-DSL-1.8/ws/build/distsourcebuild/poi-5.0.0-SNAPSHOT/build/classes/org/apache/poi/poifs/common/package-info.class>
    [javac] Creating empty <https://builds.apache.org/job/POI-DSL-1.8/ws/build/distsourcebuild/poi-5.0.0-SNAPSHOT/build/classes/org/apache/poi/hssf/record/package-info.class>
    [javac] Creating empty <https://builds.apache.org/job/POI-DSL-1.8/ws/build/distsourcebuild/poi-5.0.0-SNAPSHOT/build/classes/org/apache/poi/poifs/package-info.class>
    [javac] Creating empty <https://builds.apache.org/job/POI-DSL-1.8/ws/build/distsourcebuild/poi-5.0.0-SNAPSHOT/build/classes/org/apache/poi/poifs/crypt/package-info.class>
    [javac] Creating empty <https://builds.apache.org/job/POI-DSL-1.8/ws/build/distsourcebuild/poi-5.0.0-SNAPSHOT/build/classes/org/apache/poi/hpsf/wellknown/package-info.class>
    [javac] Creating empty <https://builds.apache.org/job/POI-DSL-1.8/ws/build/distsourcebuild/poi-5.0.0-SNAPSHOT/build/classes/org/apache/poi/hssf/dev/package-info.class>
    [javac] Creating empty <https://builds.apache.org/job/POI-DSL-1.8/ws/build/distsourcebuild/poi-5.0.0-SNAPSHOT/build/classes/org/apache/poi/ss/formula/package-info.class>
    [javac] Creating empty <https://builds.apache.org/job/POI-DSL-1.8/ws/build/distsourcebuild/poi-5.0.0-SNAPSHOT/build/classes/org/apache/poi/hpsf/package-info.class>
    [javac] Creating empty <https://builds.apache.org/job/POI-DSL-1.8/ws/build/distsourcebuild/poi-5.0.0-SNAPSHOT/build/classes/org/apache/poi/poifs/property/package-info.class>
    [javac] Creating empty <https://builds.apache.org/job/POI-DSL-1.8/ws/build/distsourcebuild/poi-5.0.0-SNAPSHOT/build/classes/org/apache/poi/poifs/filesystem/package-info.class>
    [javac] Creating empty <https://builds.apache.org/job/POI-DSL-1.8/ws/build/distsourcebuild/poi-5.0.0-SNAPSHOT/build/classes/org/apache/poi/ss/formula/ptg/package-info.class>
    [javac] Creating empty <https://builds.apache.org/job/POI-DSL-1.8/ws/build/distsourcebuild/poi-5.0.0-SNAPSHOT/build/classes/org/apache/poi/poifs/storage/package-info.class>
    [javac] Creating empty <https://builds.apache.org/job/POI-DSL-1.8/ws/build/distsourcebuild/poi-5.0.0-SNAPSHOT/build/classes/org/apache/poi/hssf/eventusermodel/package-info.class>
    [javac] Creating empty <https://builds.apache.org/job/POI-DSL-1.8/ws/build/distsourcebuild/poi-5.0.0-SNAPSHOT/build/classes/org/apache/poi/hssf/record/aggregates/package-info.class>
    [javac] Creating empty <https://builds.apache.org/job/POI-DSL-1.8/ws/build/distsourcebuild/poi-5.0.0-SNAPSHOT/build/classes/org/apache/poi/ss/format/package-info.class>
    [javac] Creating empty <https://builds.apache.org/job/POI-DSL-1.8/ws/build/distsourcebuild/poi-5.0.0-SNAPSHOT/build/classes/org/apache/poi/hssf/model/package-info.class>
    [javac] Creating empty <https://builds.apache.org/job/POI-DSL-1.8/ws/build/distsourcebuild/poi-5.0.0-SNAPSHOT/build/classes/org/apache/poi/hssf/usermodel/package-info.class>
    [javac] Creating empty <https://builds.apache.org/job/POI-DSL-1.8/ws/build/distsourcebuild/poi-5.0.0-SNAPSHOT/build/classes/org/apache/poi/hssf/util/package-info.class>
    [javac] Creating empty <https://builds.apache.org/job/POI-DSL-1.8/ws/build/distsourcebuild/poi-5.0.0-SNAPSHOT/build/classes/org/apache/poi/poifs/eventfilesystem/package-info.class>
    [mkdir] Created dir: <https://builds.apache.org/job/POI-DSL-1.8/ws/build/distsourcebuild/poi-5.0.0-SNAPSHOT/build/dist/maven/poi>
      [jar] Building jar: <https://builds.apache.org/job/POI-DSL-1.8/ws/build/distsourcebuild/poi-5.0.0-SNAPSHOT/build/dist/maven/poi/poi-5.0.0-SNAPSHOT.jar>
    [javac] Compiling 549 source files to <https://builds.apache.org/job/POI-DSL-1.8/ws/build/distsourcebuild/poi-5.0.0-SNAPSHOT/build/test-classes>
    [javac] Support for javac --release has been added in Java9 ignoring it
    [javac] Note: Some input files use or override a deprecated API.
    [javac] Note: Recompile with -Xlint:deprecation for details.
      [jar] Building jar: <https://builds.apache.org/job/POI-DSL-1.8/ws/build/distsourcebuild/poi-5.0.0-SNAPSHOT/build/dist/maven/poi-tests/poi-5.0.0-SNAPSHOT-tests.jar>
      [jar] Building jar: <https://builds.apache.org/job/POI-DSL-1.8/ws/build/distsourcebuild/poi-5.0.0-SNAPSHOT/build/dist/maven/poi/poi-5.0.0-SNAPSHOT-sources.jar>

compile-scratchpad:
    [javac] Compiling 513 source files to <https://builds.apache.org/job/POI-DSL-1.8/ws/build/distsourcebuild/poi-5.0.0-SNAPSHOT/build/scratchpad-classes>
    [javac] Support for javac --release has been added in Java9 ignoring it
    [javac] Note: Some input files use or override a deprecated API.
    [javac] Note: Recompile with -Xlint:deprecation for details.
    [javac] Note: Some input files use unchecked or unsafe operations.
    [javac] Note: Recompile with -Xlint:unchecked for details.
    [mkdir] Created dir: <https://builds.apache.org/job/POI-DSL-1.8/ws/build/distsourcebuild/poi-5.0.0-SNAPSHOT/build/dist/maven/poi-scratchpad>
      [jar] Building jar: <https://builds.apache.org/job/POI-DSL-1.8/ws/build/distsourcebuild/poi-5.0.0-SNAPSHOT/build/dist/maven/poi-scratchpad/poi-scratchpad-5.0.0-SNAPSHOT.jar>
    [javac] Compiling 202 source files to <https://builds.apache.org/job/POI-DSL-1.8/ws/build/distsourcebuild/poi-5.0.0-SNAPSHOT/build/scratchpad-test-classes>
    [javac] Support for javac --release has been added in Java9 ignoring it
    [javac] Note: Some input files use or override a deprecated API.
    [javac] Note: Recompile with -Xlint:deprecation for details.
    [javac] Note: <https://builds.apache.org/job/POI-DSL-1.8/ws/build/distsourcebuild/poi-5.0.0-SNAPSHOT/src/scratchpad/testcases/org/apache/poi/hslf/usermodel/TestBugs.java> uses unchecked or unsafe operations.
    [javac] Note: Recompile with -Xlint:unchecked for details.
      [jar] Building jar: <https://builds.apache.org/job/POI-DSL-1.8/ws/build/distsourcebuild/poi-5.0.0-SNAPSHOT/build/dist/maven/poi-scratchpad-tests/poi-scratchpad-5.0.0-SNAPSHOT-tests.jar>
      [jar] Building jar: <https://builds.apache.org/job/POI-DSL-1.8/ws/build/distsourcebuild/poi-5.0.0-SNAPSHOT/build/dist/maven/poi-scratchpad/poi-scratchpad-5.0.0-SNAPSHOT-sources.jar>

check-compiled-ooxml-xsds:

compile-ooxml-xsds:
    [mkdir] Created dir: <https://builds.apache.org/job/POI-DSL-1.8/ws/build/distsourcebuild/poi-5.0.0-SNAPSHOT/build/xmlbean-xsds>
     [copy] Copying 7 files to <https://builds.apache.org/job/POI-DSL-1.8/ws/build/distsourcebuild/poi-5.0.0-SNAPSHOT/build/xmlbean-xsds>
     [copy] Copying 89 resources to <https://builds.apache.org/job/POI-DSL-1.8/ws/build/distsourcebuild/poi-5.0.0-SNAPSHOT/build/xmlbean-xsds>
    [mkdir] Created dir: <https://builds.apache.org/job/POI-DSL-1.8/ws/build/distsourcebuild/poi-5.0.0-SNAPSHOT/build/xmlbean-sources>
    [mkdir] Created dir: <https://builds.apache.org/job/POI-DSL-1.8/ws/build/distsourcebuild/poi-5.0.0-SNAPSHOT/build/xmlbean-classes>
  [xmlbean] SchemaCompiler  Metadata LOAD:org/apache/xmlbeans/metadata GEN:org/apache/poi/schemas/ooxml
  [xmlbean] Time to build schema type system: 2.201 seconds
  [xmlbean] Time to generate code: 5.368 seconds
    [javac] Compiling 4908 source files to <https://builds.apache.org/job/POI-DSL-1.8/ws/build/distsourcebuild/poi-5.0.0-SNAPSHOT/build/xmlbean-classes>
    [javac] Support for javac --release has been added in Java9 ignoring it
    [mkdir] Created dir: <https://builds.apache.org/job/POI-DSL-1.8/ws/build/distsourcebuild/poi-5.0.0-SNAPSHOT/build/dist/maven/ooxml-schemas>
      [jar] Building jar: <https://builds.apache.org/job/POI-DSL-1.8/ws/build/distsourcebuild/poi-5.0.0-SNAPSHOT/build/dist/maven/ooxml-schemas/ooxml-schemas-1.5.jar>
      [jar] Building jar: <https://builds.apache.org/job/POI-DSL-1.8/ws/build/distsourcebuild/poi-5.0.0-SNAPSHOT/build/dist/maven/ooxml-schemas/ooxml-schemas-1.5-sources.jar>

compile-ooxml:
    [javac] Compiling 612 source files to <https://builds.apache.org/job/POI-DSL-1.8/ws/build/distsourcebuild/poi-5.0.0-SNAPSHOT/build/ooxml-classes>
    [javac] Support for javac --release has been added in Java9 ignoring it
    [javac] Note: Some input files use or override a deprecated API.
    [javac] Note: Recompile with -Xlint:deprecation for details.
    [javac] Note: <https://builds.apache.org/job/POI-DSL-1.8/ws/build/distsourcebuild/poi-5.0.0-SNAPSHOT/src/ooxml/java/org/apache/poi/xslf/draw/SVGImageRenderer.java> uses unchecked or unsafe operations.
    [javac] Note: Recompile with -Xlint:unchecked for details.
    [javac] Creating empty <https://builds.apache.org/job/POI-DSL-1.8/ws/build/distsourcebuild/poi-5.0.0-SNAPSHOT/build/ooxml-classes/org/apache/poi/xwpf/package-info.class>
    [javac] Creating empty <https://builds.apache.org/job/POI-DSL-1.8/ws/build/distsourcebuild/poi-5.0.0-SNAPSHOT/build/ooxml-classes/org/apache/poi/xssf/binary/package-info.class>
    [mkdir] Created dir: <https://builds.apache.org/job/POI-DSL-1.8/ws/build/distsourcebuild/poi-5.0.0-SNAPSHOT/build/dist/maven/poi-ooxml>
      [jar] Building jar: <https://builds.apache.org/job/POI-DSL-1.8/ws/build/distsourcebuild/poi-5.0.0-SNAPSHOT/build/dist/maven/poi-ooxml/poi-ooxml-5.0.0-SNAPSHOT.jar>
    [javac] Compiling 270 source files to <https://builds.apache.org/job/POI-DSL-1.8/ws/build/distsourcebuild/poi-5.0.0-SNAPSHOT/build/ooxml-test-classes>
    [javac] Support for javac --release has been added in Java9 ignoring it
    [javac] Note: Some input files use or override a deprecated API.
    [javac] Note: Recompile with -Xlint:deprecation for details.
    [javac] Note: Some input files use unchecked or unsafe operations.
    [javac] Note: Recompile with -Xlint:unchecked for details.
      [jar] Building jar: <https://builds.apache.org/job/POI-DSL-1.8/ws/build/distsourcebuild/poi-5.0.0-SNAPSHOT/build/dist/maven/poi-ooxml-tests/poi-ooxml-5.0.0-SNAPSHOT-tests.jar>
      [jar] Building jar: <https://builds.apache.org/job/POI-DSL-1.8/ws/build/distsourcebuild/poi-5.0.0-SNAPSHOT/build/dist/maven/poi-ooxml/poi-ooxml-5.0.0-SNAPSHOT-sources.jar>
      [jar] Building jar: <https://builds.apache.org/job/POI-DSL-1.8/ws/build/distsourcebuild/poi-5.0.0-SNAPSHOT/lib/ooxml-tests/ooxml-lite-agent.jar>

compile-examples:
    [javac] Compiling 133 source files to <https://builds.apache.org/job/POI-DSL-1.8/ws/build/distsourcebuild/poi-5.0.0-SNAPSHOT/build/examples-classes>
    [javac] Support for javac --release has been added in Java9 ignoring it
    [javac] Note: Some input files use or override a deprecated API.
    [javac] Note: Recompile with -Xlint:deprecation for details.
    [javac] Creating empty <https://builds.apache.org/job/POI-DSL-1.8/ws/build/distsourcebuild/poi-5.0.0-SNAPSHOT/build/examples-classes/org/apache/poi/examples/ss/html/package-info.class>
    [mkdir] Created dir: <https://builds.apache.org/job/POI-DSL-1.8/ws/build/distsourcebuild/poi-5.0.0-SNAPSHOT/build/dist/maven/poi-examples>
      [jar] Building jar: <https://builds.apache.org/job/POI-DSL-1.8/ws/build/distsourcebuild/poi-5.0.0-SNAPSHOT/build/dist/maven/poi-examples/poi-examples-5.0.0-SNAPSHOT.jar>
      [jar] Building jar: <https://builds.apache.org/job/POI-DSL-1.8/ws/build/distsourcebuild/poi-5.0.0-SNAPSHOT/build/dist/maven/poi-examples/poi-examples-5.0.0-SNAPSHOT-sources.jar>

compile-excelant:
    [javac] Compiling 14 source files to <https://builds.apache.org/job/POI-DSL-1.8/ws/build/distsourcebuild/poi-5.0.0-SNAPSHOT/build/excelant-classes>
    [javac] Support for javac --release has been added in Java9 ignoring it
    [mkdir] Created dir: <https://builds.apache.org/job/POI-DSL-1.8/ws/build/distsourcebuild/poi-5.0.0-SNAPSHOT/build/dist/maven/poi-excelant>
      [jar] Building jar: <https://builds.apache.org/job/POI-DSL-1.8/ws/build/distsourcebuild/poi-5.0.0-SNAPSHOT/build/dist/maven/poi-excelant/poi-excelant-5.0.0-SNAPSHOT.jar>
    [javac] Compiling 12 source files to <https://builds.apache.org/job/POI-DSL-1.8/ws/build/distsourcebuild/poi-5.0.0-SNAPSHOT/build/excelant-test-classes>
    [javac] Support for javac --release has been added in Java9 ignoring it
      [jar] Building jar: <https://builds.apache.org/job/POI-DSL-1.8/ws/build/distsourcebuild/poi-5.0.0-SNAPSHOT/build/dist/maven/poi-excelant-tests/poi-excelant-5.0.0-SNAPSHOT-tests.jar>
      [jar] Building jar: <https://builds.apache.org/job/POI-DSL-1.8/ws/build/distsourcebuild/poi-5.0.0-SNAPSHOT/build/dist/maven/poi-excelant/poi-excelant-5.0.0-SNAPSHOT-sources.jar>

compile:

-test-ooxml-check:

jacocotask:
     [echo] Coverage reporting: ${coverage.enabled}

test-ooxml:
    [junit] Running org.apache.poi.extractor.ooxml.TestExtractorFactory
    [junit] Tests run: 14, Failures: 0, Errors: 0, Skipped: 0, Time elapsed: 3.602 sec
    [junit] Running org.apache.poi.ooxml.TestDetectAsOOXML
    [junit] Tests run: 3, Failures: 0, Errors: 0, Skipped: 0, Time elapsed: 0.015 sec
    [junit] Running org.apache.poi.ooxml.TestEmbedded
    [junit] Tests run: 3, Failures: 0, Errors: 0, Skipped: 0, Time elapsed: 0.378 sec
    [junit] Running org.apache.poi.ooxml.TestPOIXMLDocument
    [junit] Tests run: 11, Failures: 0, Errors: 0, Skipped: 0, Time elapsed: 1.677 sec
    [junit] Running org.apache.poi.ooxml.TestPOIXMLProperties
    [junit] Tests run: 10, Failures: 0, Errors: 0, Skipped: 1, Time elapsed: 0.31 sec
    [junit] Running org.apache.poi.ooxml.TestXMLPropertiesTextExtractor
    [junit] Tests run: 5, Failures: 0, Errors: 0, Skipped: 0, Time elapsed: 0.118 sec
    [junit] Running org.apache.poi.openxml4j.opc.TestContentType
    [junit] Tests run: 7, Failures: 0, Errors: 0, Skipped: 0, Time elapsed: 0.113 sec
    [junit] Running org.apache.poi.openxml4j.opc.TestFileHelper
    [junit] Tests run: 1, Failures: 0, Errors: 0, Skipped: 0, Time elapsed: 0.003 sec
    [junit] Running org.apache.poi.openxml4j.opc.TestListParts
    [junit] Tests run: 1, Failures: 0, Errors: 0, Skipped: 0, Time elapsed: 0.005 sec
    [junit] Running org.apache.poi.openxml4j.opc.TestPackage
    [junit] Tests run: 46, Failures: 0, Errors: 0, Skipped: 1, Time elapsed: 1.518 sec
    [junit] Running org.apache.poi.openxml4j.opc.TestPackageCoreProperties
    [junit] Tests run: 7, Failures: 0, Errors: 0, Skipped: 0, Time elapsed: 0.066 sec
    [junit] Running org.apache.poi.openxml4j.opc.TestPackagePartName
    [junit] Tests run: 1, Failures: 0, Errors: 0, Skipped: 0, Time elapsed: 0.001 sec
    [junit] Running org.apache.poi.openxml4j.opc.TestPackageThumbnail
    [junit] Tests run: 1, Failures: 0, Errors: 0, Skipped: 0, Time elapsed: 0.013 sec
    [junit] Running org.apache.poi.openxml4j.opc.TestPackagingURIHelper
    [junit] Tests run: 5, Failures: 0, Errors: 0, Skipped: 0, Time elapsed: 0.004 sec
    [junit] Running org.apache.poi.openxml4j.opc.TestRelationships
    [junit] Tests run: 9, Failures: 0, Errors: 0, Skipped: 0, Time elapsed: 0.057 sec
    [junit] Running org.apache.poi.openxml4j.opc.compliance.TestOPCComplianceCoreProperties
    [junit] Tests run: 11, Failures: 0, Errors: 0, Skipped: 0, Time elapsed: 0.069 sec
    [junit] Running org.apache.poi.openxml4j.opc.compliance.TestOPCCompliancePackageModel
    [junit] Tests run: 5, Failures: 0, Errors: 0, Skipped: 0, Time elapsed: 0.005 sec
    [junit] Running org.apache.poi.openxml4j.opc.compliance.TestOPCCompliancePartName
    [junit] Tests run: 10, Failures: 0, Errors: 0, Skipped: 0, Time elapsed: 0.005 sec
    [junit] Running org.apache.poi.openxml4j.opc.internal.TestContentTypeManager
    [junit] Tests run: 5, Failures: 0, Errors: 0, Skipped: 1, Time elapsed: 0.155 sec
    [junit] Running org.apache.poi.openxml4j.opc.internal.marshallers.TestZipPackagePropertiesMarshaller
    [junit] Tests run: 4, Failures: 0, Errors: 0, Skipped: 0, Time elapsed: 0.004 sec
    [junit] Running org.apache.poi.openxml4j.util.TestZipSecureFile
    [junit] Tests run: 1, Failures: 0, Errors: 0, Skipped: 0, Time elapsed: 0.003 sec
    [junit] Running org.apache.poi.poifs.crypt.dsig.TestSignatureConfig
    [junit] Tests run: 2, Failures: 0, Errors: 0, Skipped: 1, Time elapsed: 0.005 sec
    [junit] Running org.apache.poi.poifs.crypt.dsig.TestSignatureInfo
    [junit] Tests run: 14, Failures: 0, Errors: 1, Skipped: 1, Time elapsed: 6.779 sec

BUILD FAILED
<https://builds.apache.org/job/POI-DSL-1.8/ws/src/integrationtest/build.xml>:72: The following error occurred while executing this line:
<https://builds.apache.org/job/POI-DSL-1.8/ws/build/distsourcebuild/poi-5.0.0-SNAPSHOT/build.xml>:1518: The following error occurred while executing this line:
<https://builds.apache.org/job/POI-DSL-1.8/ws/build/distsourcebuild/poi-5.0.0-SNAPSHOT/build.xml>:1486: The following error occurred while executing this line:
<https://builds.apache.org/job/POI-DSL-1.8/ws/build/distsourcebuild/poi-5.0.0-SNAPSHOT/build.xml>:1114: Tests failed

Total time: 2 minutes 35 seconds
Build step 'Invoke Ant' marked build as failure
Skipping publisher since build result is FAILURE
Archiving artifacts
[Fast Archiver] Compressed 219.67 MB of artifacts by 34.7% relative to #1048
Skipping publisher since build result is FAILURE
Recording test results

---------------------------------------------------------------------
To unsubscribe, e-mail: [hidden email]
For additional commands, e-mail: [hidden email]

Reply | Threaded
Open this post in threaded view
|

Jenkins build is back to normal : POI-DSL-1.8 #1050

Apache Jenkins Server
See <https://builds.apache.org/job/POI-DSL-1.8/1050/display/redirect?page=changes>


---------------------------------------------------------------------
To unsubscribe, e-mail: [hidden email]
For additional commands, e-mail: [hidden email]