Build failed in Jenkins: POI-DSL-1.8 #1041

classic Classic list List threaded Threaded
8 messages Options
Reply | Threaded
Open this post in threaded view
|

Build failed in Jenkins: POI-DSL-1.8 #1041

Apache Jenkins Server
See <https://builds.apache.org/job/POI-DSL-1.8/1041/display/redirect?page=changes>

Changes:

[kiwiwings] #64411 - Provide JigSaw modules
- use classpath-build for Java 8, otherwise use modulepath
- save module-info classes to source, when using Java 9+ environment
- rename example packages - otherwise package clashes occured in the tests
- move agile encryption from ooxml to main.
  remove EncryptionInfo XmlBeans and schema and use custom xml marshalling
- move ooxml test classes which reside in the same package as their tested main class
- rename base test classes to "BaseTest..." - temporarily I've used a light version of the main test classes to test scratchpad / ooxml
- build.xml - fixed the Rhino javascript errors of the dependency-macros
- DrawTextParagraph - fixed StringIndexOutOfBounds when logging set to debug level
- use JigSaw provider interface (= Java ServiceLoader), i.e. it wasn't possible (without openening everything), to access ooxml factory classes from main factory stub


------------------------------------------
[...truncated 38.62 KB...]
Project base dir set to: <https://builds.apache.org/job/POI-DSL-1.8/ws/>
Build sequence for target(s) `test' is [test]
Complete build sequence is [test, ]

test:
parsing buildfile jar:file:/usr/share/ant/lib/ant.jar!/org/apache/tools/ant/antlib.xml with URI = jar:file:/usr/share/ant/lib/ant.jar!/org/apache/tools/ant/antlib.xml from a zip file
     [echo] Java 1.8/1.8.0_252
     [exec] Current OS is Linux
     [exec] Executing 'javac' with arguments:
     [exec] '-version'
     [exec]
     [exec] The ' characters around the executable and arguments are
     [exec] not part of the command.
     [exec] javac 1.8.0_252

BUILD SUCCESSFUL
Total time: 0 seconds
+ exit 0
[POI-DSL-1.8] $ /home/jenkins/tools/ant/latest1.9/bin/ant -Dcoverage.enabled=true clean jenkins
Buildfile: <https://builds.apache.org/job/POI-DSL-1.8/ws/build.xml>

clean:
   [delete] Deleting directory <https://builds.apache.org/job/POI-DSL-1.8/ws/build>

replaceVersion:

check-jars:
   [delete] Deleting <https://builds.apache.org/job/POI-DSL-1.8/ws/lib/ooxml-tests/guava-20.0.jar>

fetch-jars:
      [get] Destination already exists (skipping): <https://builds.apache.org/job/POI-DSL-1.8/ws/lib/main/commons-logging-1.2.jar>
      [get] Destination already exists (skipping): <https://builds.apache.org/job/POI-DSL-1.8/ws/lib/main/commons-codec-1.14.jar>
      [get] Destination already exists (skipping): <https://builds.apache.org/job/POI-DSL-1.8/ws/lib/main/log4j-1.2.17.jar>
      [get] Destination already exists (skipping): <https://builds.apache.org/job/POI-DSL-1.8/ws/lib/main-tests/junit-4.13.jar>
      [get] Destination already exists (skipping): <https://builds.apache.org/job/POI-DSL-1.8/ws/lib/main-tests/jmh-core-1.19.jar>
      [get] Destination already exists (skipping): <https://builds.apache.org/job/POI-DSL-1.8/ws/lib/main-tests/jmh-generator-annprocess-1.19.jar>
      [get] Destination already exists (skipping): <https://builds.apache.org/job/POI-DSL-1.8/ws/lib/main-tests/hamcrest-core-1.3.jar>
      [get] Destination already exists (skipping): <https://builds.apache.org/job/POI-DSL-1.8/ws/lib/main-tests/xmlunit-core-2.5.1.jar>
      [get] Destination already exists (skipping): <https://builds.apache.org/job/POI-DSL-1.8/ws/lib/main-tests/mockito-core-3.3.3.jar>
      [get] Destination already exists (skipping): <https://builds.apache.org/job/POI-DSL-1.8/ws/lib/main-tests/byte-buddy-1.10.1.jar>
      [get] Destination already exists (skipping): <https://builds.apache.org/job/POI-DSL-1.8/ws/lib/main-tests/byte-buddy-agent-1.10.1.jar>
      [get] Destination already exists (skipping): <https://builds.apache.org/job/POI-DSL-1.8/ws/lib/main-tests/objenesis-2.6.jar>
      [get] Getting: https://repo1.maven.org/maven2/org/apache/ant/ant/1.10.8/ant-1.10.8.jar
      [get] To: <https://builds.apache.org/job/POI-DSL-1.8/ws/lib/excelant/ant-1.10.8.jar>
      [get] Getting: https://repo1.maven.org/maven2/org/apache/ant/ant-launcher/1.10.8/ant-launcher-1.10.8.jar
      [get] To: <https://builds.apache.org/job/POI-DSL-1.8/ws/lib/excelant/ant-launcher-1.10.8.jar>
      [get] Destination already exists (skipping): <https://builds.apache.org/job/POI-DSL-1.8/ws/lib/util/asm-8.0.1.jar>
      [get] Destination already exists (skipping): <https://builds.apache.org/job/POI-DSL-1.8/ws/lib/util/asm-commons-8.0.1.jar>
      [get] Destination already exists (skipping): <https://builds.apache.org/job/POI-DSL-1.8/ws/lib/util/asm-tree-8.0.1.jar>
      [get] Destination already exists (skipping): <https://builds.apache.org/job/POI-DSL-1.8/ws/lib/util/jacoco-0.8.5.zip>
      [get] Destination already exists (skipping): <https://builds.apache.org/job/POI-DSL-1.8/ws/lib/main/commons-collections4-4.4.jar>
      [get] Destination already exists (skipping): <https://builds.apache.org/job/POI-DSL-1.8/ws/lib/main/commons-math3-3.6.1.jar>
      [get] Destination already exists (skipping): <https://builds.apache.org/job/POI-DSL-1.8/ws/lib/main/SparseBitSet-1.2.jar>
    [unzip] Expanding: <https://builds.apache.org/job/POI-DSL-1.8/ws/lib/util/jacoco-0.8.5.zip> into <https://builds.apache.org/job/POI-DSL-1.8/ws/lib/util>
      [get] Destination already exists (skipping): <https://builds.apache.org/job/POI-DSL-1.8/ws/lib/util/apache-rat-0.12.jar>
      [get] Destination already exists (skipping): <https://builds.apache.org/job/POI-DSL-1.8/ws/lib/util/forbiddenapis-2.6.jar>
      [get] Getting: https://repo1.maven.org/maven2/org/bouncycastle/bcprov-ext-jdk15on/1.66/bcprov-ext-jdk15on-1.66.jar
      [get] To: <https://builds.apache.org/job/POI-DSL-1.8/ws/lib/ooxml-provided/bcprov-ext-jdk15on-1.66.jar>
      [get] Getting: https://repo1.maven.org/maven2/org/bouncycastle/bcpkix-jdk15on/1.66/bcpkix-jdk15on-1.66.jar
      [get] To: <https://builds.apache.org/job/POI-DSL-1.8/ws/lib/ooxml-provided/bcpkix-jdk15on-1.66.jar>
      [get] Destination already exists (skipping): <https://builds.apache.org/job/POI-DSL-1.8/ws/lib/ooxml-provided/xmlsec-2.1.5.jar>
      [get] Destination already exists (skipping): <https://builds.apache.org/job/POI-DSL-1.8/ws/lib/ooxml-provided/slf4j-api-1.7.30.jar>

check-ooxml-jars:

fetch-ooxml-jars:
      [get] Destination already exists (skipping): <https://builds.apache.org/job/POI-DSL-1.8/1041/artifact/lib/ooxml/curvesapi-1.06.jar>
      [get] Getting: https://builds.apache.org/view/P/view/POI/job/POI-XMLBeans-DSL-1.8/lastSuccessfulBuild/artifact/build/xmlbeans-4.0.0.jar
      [get] To: <https://builds.apache.org/job/POI-DSL-1.8/1041/artifact/lib/ooxml/xmlbeans-4.0.0.jar>
      [get] Destination already exists (skipping): <https://builds.apache.org/job/POI-DSL-1.8/1041/artifact/lib/ooxml/commons-compress-1.20.jar>
      [get] Destination already exists (skipping): <https://builds.apache.org/job/POI-DSL-1.8/ws/lib/ooxml-tests/reflections-0.9.11.jar>
      [get] Getting: https://repo1.maven.org/maven2/com/google/guava/guava/29.0-jre/guava-29.0-jre.jar
      [get] To: <https://builds.apache.org/job/POI-DSL-1.8/ws/lib/ooxml-tests/guava-29.0-jre.jar>
      [get] Destination already exists (skipping): <https://builds.apache.org/job/POI-DSL-1.8/ws/lib/ooxml-tests/javassist-3.21.0-GA.jar>
      [get] Destination already exists (skipping): <https://builds.apache.org/job/POI-DSL-1.8/ws/lib/ooxml-provided/batik-all-1.12.jar>
      [get] Destination already exists (skipping): <https://builds.apache.org/job/POI-DSL-1.8/ws/lib/ooxml-provided/xml-apis-ext-1.3.04.jar>
      [get] Destination already exists (skipping): <https://builds.apache.org/job/POI-DSL-1.8/ws/lib/ooxml-provided/xmlgraphics-commons-2.3.jar>

init:
    [mkdir] Created dir: <https://builds.apache.org/job/POI-DSL-1.8/ws/build>
    [mkdir] Created dir: <https://builds.apache.org/job/POI-DSL-1.8/ws/build/classes>
    [mkdir] Created dir: <https://builds.apache.org/job/POI-DSL-1.8/ws/build/test-classes>
    [mkdir] Created dir: <https://builds.apache.org/job/POI-DSL-1.8/ws/build/test-results>
    [mkdir] Created dir: <https://builds.apache.org/job/POI-DSL-1.8/ws/build/scratchpad-classes>
    [mkdir] Created dir: <https://builds.apache.org/job/POI-DSL-1.8/ws/build/scratchpad-test-classes>
    [mkdir] Created dir: <https://builds.apache.org/job/POI-DSL-1.8/ws/build/scratchpad-test-results>
    [mkdir] Created dir: <https://builds.apache.org/job/POI-DSL-1.8/ws/build/geometry-java>
    [mkdir] Created dir: <https://builds.apache.org/job/POI-DSL-1.8/ws/build/ooxml-classes>
    [mkdir] Created dir: <https://builds.apache.org/job/POI-DSL-1.8/ws/build/ooxml-test-classes>
    [mkdir] Created dir: <https://builds.apache.org/job/POI-DSL-1.8/ws/build/ooxml-test-results>
    [mkdir] Created dir: <https://builds.apache.org/job/POI-DSL-1.8/ws/build/excelant-classes>
    [mkdir] Created dir: <https://builds.apache.org/job/POI-DSL-1.8/ws/build/excelant-test-classes>
    [mkdir] Created dir: <https://builds.apache.org/job/POI-DSL-1.8/ws/build/excelant-test-results>
    [mkdir] Created dir: <https://builds.apache.org/job/POI-DSL-1.8/ws/build/examples-classes>
    [mkdir] Created dir: <https://builds.apache.org/job/POI-DSL-1.8/ws/build/integration-test-classes>
    [mkdir] Created dir: <https://builds.apache.org/job/POI-DSL-1.8/1041/artifact/build/integration-test-results>
    [mkdir] Created dir: <https://builds.apache.org/job/POI-DSL-1.8/ws/build/dist>
    [mkdir] Created dir: <https://builds.apache.org/job/POI-DSL-1.8/ws/build/site>
     [echo] Using Ant: Apache Ant(TM) version 1.9.14 compiled on March 12 2019 from /home/jenkins/tools/ant/latest1.9, Ant detected Java 1.8 (may be different than actual Java sometimes...)
     [echo] Using Java: 1.8.0_252/1.8.0_252-b09/25.252-b09/OpenJDK 64-Bit Server VM from Oracle Corporation on Linux: 4.15.0-58-generic
     [echo] Building Apache POI version 5.0.0-SNAPSHOT and RC: RC1

-version-java-check:

compile-version:
     [copy] Copying 1 file to <https://builds.apache.org/job/POI-DSL-1.8/ws/build/classes/org/apache/poi>
    [javac] Compiling 1 source file to <https://builds.apache.org/job/POI-DSL-1.8/ws/build/classes>
   [delete] Deleting: <https://builds.apache.org/job/POI-DSL-1.8/ws/build/classes/org/apache/poi/Version.java>

compile-main:
    [javac] Compiling 1174 source files to <https://builds.apache.org/job/POI-DSL-1.8/ws/build/classes>
    [javac] Support for javac --release has been added in Java9 ignoring it
    [javac] Note: Some input files use or override a deprecated API.
    [javac] Note: Recompile with -Xlint:deprecation for details.
    [javac] Note: Some input files use unchecked or unsafe operations.
    [javac] Note: Recompile with -Xlint:unchecked for details.
    [javac] Creating empty <https://builds.apache.org/job/POI-DSL-1.8/ws/build/classes/org/apache/poi/ddf/package-info.class>
    [javac] Creating empty <https://builds.apache.org/job/POI-DSL-1.8/ws/build/classes/org/apache/poi/hssf/package-info.class>
    [javac] Creating empty <https://builds.apache.org/job/POI-DSL-1.8/ws/build/classes/org/apache/poi/poifs/dev/package-info.class>
    [javac] Creating empty <https://builds.apache.org/job/POI-DSL-1.8/ws/build/classes/org/apache/poi/util/package-info.class>
    [javac] Creating empty <https://builds.apache.org/job/POI-DSL-1.8/ws/build/classes/org/apache/poi/poifs/common/package-info.class>
    [javac] Creating empty <https://builds.apache.org/job/POI-DSL-1.8/ws/build/classes/org/apache/poi/hssf/record/package-info.class>
    [javac] Creating empty <https://builds.apache.org/job/POI-DSL-1.8/ws/build/classes/org/apache/poi/poifs/package-info.class>
    [javac] Creating empty <https://builds.apache.org/job/POI-DSL-1.8/ws/build/classes/org/apache/poi/poifs/crypt/package-info.class>
    [javac] Creating empty <https://builds.apache.org/job/POI-DSL-1.8/ws/build/classes/org/apache/poi/hpsf/wellknown/package-info.class>
    [javac] Creating empty <https://builds.apache.org/job/POI-DSL-1.8/ws/build/classes/org/apache/poi/hssf/dev/package-info.class>
    [javac] Creating empty <https://builds.apache.org/job/POI-DSL-1.8/ws/build/classes/org/apache/poi/ss/formula/package-info.class>
    [javac] Creating empty <https://builds.apache.org/job/POI-DSL-1.8/ws/build/classes/org/apache/poi/hpsf/package-info.class>
    [javac] Creating empty <https://builds.apache.org/job/POI-DSL-1.8/ws/build/classes/org/apache/poi/poifs/property/package-info.class>
    [javac] Creating empty <https://builds.apache.org/job/POI-DSL-1.8/ws/build/classes/org/apache/poi/poifs/filesystem/package-info.class>
    [javac] Creating empty <https://builds.apache.org/job/POI-DSL-1.8/ws/build/classes/org/apache/poi/ss/formula/ptg/package-info.class>
    [javac] Creating empty <https://builds.apache.org/job/POI-DSL-1.8/ws/build/classes/org/apache/poi/poifs/storage/package-info.class>
    [javac] Creating empty <https://builds.apache.org/job/POI-DSL-1.8/ws/build/classes/org/apache/poi/hssf/eventusermodel/package-info.class>
    [javac] Creating empty <https://builds.apache.org/job/POI-DSL-1.8/ws/build/classes/org/apache/poi/hssf/record/aggregates/package-info.class>
    [javac] Creating empty <https://builds.apache.org/job/POI-DSL-1.8/ws/build/classes/org/apache/poi/ss/format/package-info.class>
    [javac] Creating empty <https://builds.apache.org/job/POI-DSL-1.8/ws/build/classes/org/apache/poi/hssf/model/package-info.class>
    [javac] Creating empty <https://builds.apache.org/job/POI-DSL-1.8/ws/build/classes/org/apache/poi/hssf/usermodel/package-info.class>
    [javac] Creating empty <https://builds.apache.org/job/POI-DSL-1.8/ws/build/classes/org/apache/poi/hssf/util/package-info.class>
    [javac] Creating empty <https://builds.apache.org/job/POI-DSL-1.8/ws/build/classes/org/apache/poi/poifs/eventfilesystem/package-info.class>
    [mkdir] Created dir: <https://builds.apache.org/job/POI-DSL-1.8/ws/build/dist/maven/poi>
      [jar] Building jar: <https://builds.apache.org/job/POI-DSL-1.8/ws/build/dist/maven/poi/poi-5.0.0-SNAPSHOT.jar>
    [javac] Compiling 549 source files to <https://builds.apache.org/job/POI-DSL-1.8/ws/build/test-classes>
    [javac] Support for javac --release has been added in Java9 ignoring it
    [javac] Note: Some input files use or override a deprecated API.
    [javac] Note: Recompile with -Xlint:deprecation for details.
      [jar] Building jar: <https://builds.apache.org/job/POI-DSL-1.8/ws/build/dist/maven/poi-tests/poi-5.0.0-SNAPSHOT-tests.jar>
      [jar] Building jar: <https://builds.apache.org/job/POI-DSL-1.8/ws/build/dist/maven/poi/poi-5.0.0-SNAPSHOT-sources.jar>

compile-scratchpad:
    [javac] Compiling 513 source files to <https://builds.apache.org/job/POI-DSL-1.8/ws/build/scratchpad-classes>
    [javac] Support for javac --release has been added in Java9 ignoring it
    [javac] Note: Some input files use or override a deprecated API.
    [javac] Note: Recompile with -Xlint:deprecation for details.
    [javac] Note: Some input files use unchecked or unsafe operations.
    [javac] Note: Recompile with -Xlint:unchecked for details.
    [mkdir] Created dir: <https://builds.apache.org/job/POI-DSL-1.8/ws/build/dist/maven/poi-scratchpad>
      [jar] Building jar: <https://builds.apache.org/job/POI-DSL-1.8/ws/build/dist/maven/poi-scratchpad/poi-scratchpad-5.0.0-SNAPSHOT.jar>
    [javac] Compiling 202 source files to <https://builds.apache.org/job/POI-DSL-1.8/ws/build/scratchpad-test-classes>
    [javac] Support for javac --release has been added in Java9 ignoring it
    [javac] Note: Some input files use or override a deprecated API.
    [javac] Note: Recompile with -Xlint:deprecation for details.
    [javac] Note: <https://builds.apache.org/job/POI-DSL-1.8/ws/src/scratchpad/testcases/org/apache/poi/hslf/usermodel/TestBugs.java> uses unchecked or unsafe operations.
    [javac] Note: Recompile with -Xlint:unchecked for details.
      [jar] Building jar: <https://builds.apache.org/job/POI-DSL-1.8/ws/build/dist/maven/poi-scratchpad-tests/poi-scratchpad-5.0.0-SNAPSHOT-tests.jar>
      [jar] Building jar: <https://builds.apache.org/job/POI-DSL-1.8/ws/build/dist/maven/poi-scratchpad/poi-scratchpad-5.0.0-SNAPSHOT-sources.jar>

check-compiled-ooxml-xsds:

compile-ooxml-xsds:
    [mkdir] Created dir: <https://builds.apache.org/job/POI-DSL-1.8/ws/build/xmlbean-xsds>
     [copy] Copying 7 files to <https://builds.apache.org/job/POI-DSL-1.8/ws/build/xmlbean-xsds>
     [copy] Copying 89 resources to <https://builds.apache.org/job/POI-DSL-1.8/ws/build/xmlbean-xsds>
    [mkdir] Created dir: <https://builds.apache.org/job/POI-DSL-1.8/ws/build/xmlbean-sources>
    [mkdir] Created dir: <https://builds.apache.org/job/POI-DSL-1.8/ws/build/xmlbean-classes>
  [xmlbean] SchemaCompiler  Metadata LOAD:org/apache/xmlbeans/metadata GEN:org/apache/poi/schemas/ooxml
  [xmlbean] Time to build schema type system: 1.818 seconds
  [xmlbean] Time to generate code: 5.785 seconds
    [javac] Compiling 4908 source files to <https://builds.apache.org/job/POI-DSL-1.8/ws/build/xmlbean-classes>
    [javac] Support for javac --release has been added in Java9 ignoring it
    [mkdir] Created dir: <https://builds.apache.org/job/POI-DSL-1.8/ws/build/dist/maven/ooxml-schemas>
      [jar] Building jar: <https://builds.apache.org/job/POI-DSL-1.8/ws/build/dist/maven/ooxml-schemas/ooxml-schemas-1.5.jar>
      [jar] Building jar: <https://builds.apache.org/job/POI-DSL-1.8/ws/build/dist/maven/ooxml-schemas/ooxml-schemas-1.5-sources.jar>

compile-ooxml:
    [javac] Compiling 612 source files to <https://builds.apache.org/job/POI-DSL-1.8/ws/build/ooxml-classes>
    [javac] Support for javac --release has been added in Java9 ignoring it
    [javac] Note: Some input files use or override a deprecated API.
    [javac] Note: Recompile with -Xlint:deprecation for details.
    [javac] Note: <https://builds.apache.org/job/POI-DSL-1.8/ws/src/ooxml/java/org/apache/poi/xslf/draw/SVGImageRenderer.java> uses unchecked or unsafe operations.
    [javac] Note: Recompile with -Xlint:unchecked for details.
    [javac] Creating empty <https://builds.apache.org/job/POI-DSL-1.8/ws/build/ooxml-classes/org/apache/poi/xwpf/package-info.class>
    [javac] Creating empty <https://builds.apache.org/job/POI-DSL-1.8/ws/build/ooxml-classes/org/apache/poi/xssf/binary/package-info.class>
    [mkdir] Created dir: <https://builds.apache.org/job/POI-DSL-1.8/ws/build/dist/maven/poi-ooxml>
      [jar] Building jar: <https://builds.apache.org/job/POI-DSL-1.8/ws/build/dist/maven/poi-ooxml/poi-ooxml-5.0.0-SNAPSHOT.jar>
    [javac] Compiling 270 source files to <https://builds.apache.org/job/POI-DSL-1.8/ws/build/ooxml-test-classes>
    [javac] Support for javac --release has been added in Java9 ignoring it
    [javac] Note: Some input files use or override a deprecated API.
    [javac] Note: Recompile with -Xlint:deprecation for details.
    [javac] Note: Some input files use unchecked or unsafe operations.
    [javac] Note: Recompile with -Xlint:unchecked for details.
      [jar] Building jar: <https://builds.apache.org/job/POI-DSL-1.8/ws/build/dist/maven/poi-ooxml-tests/poi-ooxml-5.0.0-SNAPSHOT-tests.jar>
      [jar] Building jar: <https://builds.apache.org/job/POI-DSL-1.8/ws/build/dist/maven/poi-ooxml/poi-ooxml-5.0.0-SNAPSHOT-sources.jar>
      [jar] Building jar: <https://builds.apache.org/job/POI-DSL-1.8/ws/lib/ooxml-tests/ooxml-lite-agent.jar>

compile-examples:
    [javac] Compiling 132 source files to <https://builds.apache.org/job/POI-DSL-1.8/ws/build/examples-classes>
    [javac] Support for javac --release has been added in Java9 ignoring it
    [javac] <https://builds.apache.org/job/POI-DSL-1.8/ws/src/examples/src/org/apache/poi/examples/xssf/streaming/SavePasswordProtectedXlsx.java>:27: error: package org.apache.poi.examples.util does not exist
    [javac] import org.apache.poi.examples.util.TempFileUtils;
    [javac]                                    ^
    [javac] <https://builds.apache.org/job/POI-DSL-1.8/ws/src/examples/src/org/apache/poi/examples/xssf/usermodel/LoadPasswordProtectedXlsx.java>:25: error: package org.apache.poi.examples.util does not exist
    [javac] import org.apache.poi.examples.util.TempFileUtils;
    [javac]                                    ^
    [javac] <https://builds.apache.org/job/POI-DSL-1.8/ws/src/examples/src/org/apache/poi/examples/xssf/streaming/SavePasswordProtectedXlsx.java>:58: error: cannot find symbol
    [javac]         TempFileUtils.checkTempFiles();
    [javac]         ^
    [javac]   symbol:   variable TempFileUtils
    [javac]   location: class SavePasswordProtectedXlsx
    [javac] <https://builds.apache.org/job/POI-DSL-1.8/ws/src/examples/src/org/apache/poi/examples/xssf/streaming/SavePasswordProtectedXlsx.java>:85: error: cannot find symbol
    [javac]         TempFileUtils.checkTempFiles();
    [javac]         ^
    [javac]   symbol:   variable TempFileUtils
    [javac]   location: class SavePasswordProtectedXlsx
    [javac] <https://builds.apache.org/job/POI-DSL-1.8/ws/src/examples/src/org/apache/poi/examples/xssf/usermodel/LoadPasswordProtectedXlsx.java>:57: error: cannot find symbol
    [javac]         TempFileUtils.checkTempFiles();
    [javac]         ^
    [javac]   symbol:   variable TempFileUtils
    [javac]   location: class LoadPasswordProtectedXlsx
    [javac] <https://builds.apache.org/job/POI-DSL-1.8/ws/src/examples/src/org/apache/poi/examples/xssf/usermodel/LoadPasswordProtectedXlsx.java>:71: error: cannot find symbol
    [javac]         TempFileUtils.checkTempFiles();
    [javac]         ^
    [javac]   symbol:   variable TempFileUtils
    [javac]   location: class LoadPasswordProtectedXlsx
    [javac] Note: Some input files use or override a deprecated API.
    [javac] Note: Recompile with -Xlint:deprecation for details.
    [javac] 6 errors

BUILD FAILED
<https://builds.apache.org/job/POI-DSL-1.8/ws/build.xml>:1022: The following error occurred while executing this line:
<https://builds.apache.org/job/POI-DSL-1.8/ws/build.xml>:869: Compile failed; see the compiler error output for details.

Total time: 2 minutes 29 seconds
Build step 'Invoke Ant' marked build as failure
Skipping publisher since build result is FAILURE
Archiving artifacts
[Fast Archiver] Compressed 3.04 MB of artifacts by 98.7% relative to #1040
Skipping publisher since build result is FAILURE
Recording test results
ERROR: Step ?Publish JUnit test result report? failed: No test report files were found. Configuration error?

---------------------------------------------------------------------
To unsubscribe, e-mail: [hidden email]
For additional commands, e-mail: [hidden email]

Reply | Threaded
Open this post in threaded view
|

Build failed in Jenkins: POI-DSL-1.8 #1042

Apache Jenkins Server
See <https://builds.apache.org/job/POI-DSL-1.8/1042/display/redirect?page=changes>

Changes:

[fanningpj] add back TempFileUtils.java due to broken build


------------------------------------------
[...truncated 179.57 KB...]
    [junit] Tests run: 29, Failures: 0, Errors: 0, Skipped: 1, Time elapsed: 0.794 sec
    [junit] Running org.apache.poi.xssf.streaming.TestSXSSFHyperlink
    [junit] Tests run: 2, Failures: 0, Errors: 0, Skipped: 0, Time elapsed: 0.018 sec
    [junit] Running org.apache.poi.xssf.streaming.TestSXSSFRow
    [junit] Tests run: 14, Failures: 0, Errors: 0, Skipped: 2, Time elapsed: 0.17 sec
    [junit] Running org.apache.poi.xssf.streaming.TestSXSSFSheet
    [junit] Tests run: 50, Failures: 0, Errors: 0, Skipped: 0, Time elapsed: 0.652 sec
    [junit] Running org.apache.poi.xssf.streaming.TestSXSSFSheetAutoSizeColumn
    [junit] Tests run: 26, Failures: 0, Errors: 0, Skipped: 0, Time elapsed: 0.115 sec
    [junit] Running org.apache.poi.xssf.streaming.TestSXSSFUnicodeSurrogates
    [junit] Tests run: 1, Failures: 0, Errors: 0, Skipped: 0, Time elapsed: 0.017 sec
    [junit] Running org.apache.poi.xssf.streaming.TestSXSSFWorkbook
    [junit] Tests run: 37, Failures: 0, Errors: 0, Skipped: 4, Time elapsed: 0.697 sec
    [junit] Running org.apache.poi.xssf.streaming.TestSXSSFWorkbookWithCustomZipEntrySource
    [junit] Tests run: 3, Failures: 0, Errors: 0, Skipped: 0, Time elapsed: 0.052 sec
    [junit] Running org.apache.poi.xssf.streaming.TestSheetDataWriter
    [junit] Tests run: 3, Failures: 0, Errors: 0, Skipped: 0, Time elapsed: 0.009 sec
    [junit] Running org.apache.poi.xssf.usermodel.TestFormulaEvaluatorOnXSSF
    [junit] Tests run: 369, Failures: 0, Errors: 0, Skipped: 90, Time elapsed: 0.37 sec
    [junit] Running org.apache.poi.xssf.usermodel.TestMatrixFormulasFromXMLSpreadsheet
    [junit] Tests run: 34, Failures: 0, Errors: 0, Skipped: 0, Time elapsed: 0.131 sec
    [junit] Running org.apache.poi.xssf.usermodel.TestMissingWorkbookOnXSSF
    [junit] Tests run: 3, Failures: 0, Errors: 0, Skipped: 0, Time elapsed: 0.042 sec
    [junit] Running org.apache.poi.xssf.usermodel.TestMultiSheetFormulaEvaluatorOnXSSF
    [junit] Tests run: 2, Failures: 0, Errors: 0, Skipped: 0, Time elapsed: 0.003 sec
    [junit] Running org.apache.poi.xssf.usermodel.TestSXSSFBugs
    [junit] Tests run: 43, Failures: 0, Errors: 0, Skipped: 9, Time elapsed: 4.889 sec
    [junit] Running org.apache.poi.xssf.usermodel.TestSheetHiding
    [junit] Tests run: 5, Failures: 0, Errors: 0, Skipped: 0, Time elapsed: 0.103 sec
    [junit] Running org.apache.poi.xssf.usermodel.TestTableStyles
    [junit] Tests run: 2, Failures: 0, Errors: 0, Skipped: 0, Time elapsed: 0.286 sec
    [junit] Running org.apache.poi.xssf.usermodel.TestXSSFBugs
    [junit] Tests run: 155, Failures: 0, Errors: 0, Skipped: 8, Time elapsed: 12.051 sec
    [junit] Running org.apache.poi.xssf.usermodel.TestXSSFCell
    [junit] Tests run: 76, Failures: 0, Errors: 0, Skipped: 0, Time elapsed: 0.658 sec
    [junit] Running org.apache.poi.xssf.usermodel.TestXSSFCellStyle
    [junit] Tests run: 43, Failures: 0, Errors: 0, Skipped: 0, Time elapsed: 0.135 sec
    [junit] Running org.apache.poi.xssf.usermodel.TestXSSFChart
    [junit] Tests run: 3, Failures: 0, Errors: 0, Skipped: 0, Time elapsed: 0.068 sec
    [junit] Running org.apache.poi.xssf.usermodel.TestXSSFChartSheet
    [junit] Tests run: 3, Failures: 0, Errors: 0, Skipped: 0, Time elapsed: 0.034 sec
    [junit] Running org.apache.poi.xssf.usermodel.TestXSSFColGrouping
    [junit] Tests run: 6, Failures: 0, Errors: 0, Skipped: 0, Time elapsed: 0.039 sec
    [junit] Running org.apache.poi.xssf.usermodel.TestXSSFColor
    [junit] Tests run: 4, Failures: 0, Errors: 0, Skipped: 0, Time elapsed: 0.039 sec
    [junit] Running org.apache.poi.xssf.usermodel.TestXSSFComment
    [junit] Tests run: 19, Failures: 0, Errors: 0, Skipped: 1, Time elapsed: 0.141 sec
    [junit] Running org.apache.poi.xssf.usermodel.TestXSSFConditionalFormatting
    [junit] Tests run: 23, Failures: 0, Errors: 0, Skipped: 0, Time elapsed: 0.114 sec
    [junit] Running org.apache.poi.xssf.usermodel.TestXSSFDataFormat
    [junit] Tests run: 8, Failures: 0, Errors: 0, Skipped: 0, Time elapsed: 0.061 sec
    [junit] Running org.apache.poi.xssf.usermodel.TestXSSFDataValidation
    [junit] Tests run: 9, Failures: 0, Errors: 0, Skipped: 0, Time elapsed: 0.251 sec
    [junit] Running org.apache.poi.xssf.usermodel.TestXSSFDataValidationConstraint
    [junit] Tests run: 4, Failures: 0, Errors: 0, Skipped: 0, Time elapsed: 0.002 sec
    [junit] Running org.apache.poi.xssf.usermodel.TestXSSFDialogSheet
    [junit] Tests run: 14, Failures: 0, Errors: 0, Skipped: 0, Time elapsed: 0.042 sec
    [junit] Running org.apache.poi.xssf.usermodel.TestXSSFDrawing
    [junit] Tests run: 21, Failures: 0, Errors: 0, Skipped: 0, Time elapsed: 0.337 sec
    [junit] Running org.apache.poi.xssf.usermodel.TestXSSFEvaluationSheet
    [junit] Tests run: 2, Failures: 0, Errors: 0, Skipped: 0, Time elapsed: 0.003 sec
    [junit] Running org.apache.poi.xssf.usermodel.TestXSSFEvenFooter
    [junit] Tests run: 1, Failures: 0, Errors: 0, Skipped: 0, Time elapsed: 0.002 sec
    [junit] Running org.apache.poi.xssf.usermodel.TestXSSFEvenHeader
    [junit] Tests run: 1, Failures: 0, Errors: 0, Skipped: 0, Time elapsed: 0.003 sec
    [junit] Running org.apache.poi.xssf.usermodel.TestXSSFExternalFunctions
    [junit] Tests run: 2, Failures: 0, Errors: 0, Skipped: 0, Time elapsed: 0.011 sec
    [junit] Running org.apache.poi.xssf.usermodel.TestXSSFFirstFooter
    [junit] Tests run: 1, Failures: 0, Errors: 0, Skipped: 0, Time elapsed: 0.002 sec
    [junit] Running org.apache.poi.xssf.usermodel.TestXSSFFirstHeader
    [junit] Tests run: 1, Failures: 0, Errors: 0, Skipped: 0, Time elapsed: 0.002 sec
    [junit] Running org.apache.poi.xssf.usermodel.TestXSSFFont
    [junit] Tests run: 23, Failures: 0, Errors: 0, Skipped: 0, Time elapsed: 0.044 sec
    [junit] Running org.apache.poi.xssf.usermodel.TestXSSFForkedEvaluator
    [junit] Tests run: 2, Failures: 0, Errors: 0, Skipped: 0, Time elapsed: 0.014 sec
    [junit] Running org.apache.poi.xssf.usermodel.TestXSSFFormulaEvaluation
    [junit] Tests run: 38, Failures: 0, Errors: 0, Skipped: 3, Time elapsed: 0.871 sec
    [junit] Running org.apache.poi.xssf.usermodel.TestXSSFFormulaParser
    [junit] Tests run: 12, Failures: 0, Errors: 0, Skipped: 0, Time elapsed: 0.099 sec
    [junit] Running org.apache.poi.xssf.usermodel.TestXSSFHeaderFooterProperties
    [junit] Tests run: 8, Failures: 0, Errors: 0, Skipped: 0, Time elapsed: 0.016 sec
    [junit] Running org.apache.poi.xssf.usermodel.TestXSSFHyperlink
    [junit] Tests run: 12, Failures: 0, Errors: 0, Skipped: 0, Time elapsed: 0.169 sec
    [junit] Running org.apache.poi.xssf.usermodel.TestXSSFName
    [junit] Tests run: 26, Failures: 0, Errors: 0, Skipped: 0, Time elapsed: 0.107 sec
    [junit] Running org.apache.poi.xssf.usermodel.TestXSSFOddFooter
    [junit] Tests run: 1, Failures: 0, Errors: 0, Skipped: 0, Time elapsed: 0.003 sec
    [junit] Running org.apache.poi.xssf.usermodel.TestXSSFOddHeader
    [junit] Tests run: 1, Failures: 0, Errors: 0, Skipped: 0, Time elapsed: 0.003 sec
    [junit] Running org.apache.poi.xssf.usermodel.TestXSSFPicture
    [junit] Tests run: 7, Failures: 0, Errors: 0, Skipped: 0, Time elapsed: 0.243 sec
    [junit] Running org.apache.poi.xssf.usermodel.TestXSSFPictureData
    [junit] Tests run: 3, Failures: 0, Errors: 0, Skipped: 0, Time elapsed: 0.052 sec
    [junit] Running org.apache.poi.xssf.usermodel.TestXSSFPivotTableName
    [junit] Tests run: 18, Failures: 0, Errors: 0, Skipped: 0, Time elapsed: 0.443 sec
    [junit] Running org.apache.poi.xssf.usermodel.TestXSSFPivotTableRef
    [junit] Tests run: 18, Failures: 0, Errors: 0, Skipped: 0, Time elapsed: 0.355 sec
    [junit] Running org.apache.poi.xssf.usermodel.TestXSSFPrintSetup
    [junit] Tests run: 19, Failures: 0, Errors: 0, Skipped: 0, Time elapsed: 0.02 sec
    [junit] Running org.apache.poi.xssf.usermodel.TestXSSFRichTextString
    [junit] Tests run: 20, Failures: 0, Errors: 0, Skipped: 0, Time elapsed: 0.04 sec
    [junit] Running org.apache.poi.xssf.usermodel.TestXSSFRow
    [junit] Tests run: 18, Failures: 0, Errors: 0, Skipped: 0, Time elapsed: 0.268 sec
    [junit] Running org.apache.poi.xssf.usermodel.TestXSSFShape
    [junit] Tests run: 2, Failures: 0, Errors: 0, Skipped: 0, Time elapsed: 0.054 sec
    [junit] Running org.apache.poi.xssf.usermodel.TestXSSFSheet
    [junit] Tests run: 98, Failures: 0, Errors: 0, Skipped: 0, Time elapsed: 5.418 sec
    [junit] Running org.apache.poi.xssf.usermodel.TestXSSFSheetAutosizeColumn
    [junit] Tests run: 7, Failures: 0, Errors: 0, Skipped: 0, Time elapsed: 0.046 sec
    [junit] Running org.apache.poi.xssf.usermodel.TestXSSFSheetMergeRegions
    [junit] Tests run: 1, Failures: 0, Errors: 0, Skipped: 0, Time elapsed: 0.946 sec
    [junit] Running org.apache.poi.xssf.usermodel.TestXSSFSheetRowGrouping
    [junit] Tests run: 6, Failures: 0, Errors: 0, Skipped: 0, Time elapsed: 0.159 sec
    [junit] Running org.apache.poi.xssf.usermodel.TestXSSFSheetShiftColumns
    [junit] Tests run: 10, Failures: 0, Errors: 0, Skipped: 0, Time elapsed: 0.07 sec
    [junit] Running org.apache.poi.xssf.usermodel.TestXSSFSheetShiftRows
    [junit] Tests run: 34, Failures: 0, Errors: 0, Skipped: 2, Time elapsed: 30.563 sec
    [junit] Running org.apache.poi.xssf.usermodel.TestXSSFSheetShiftRowsAndColumns
    [junit] Tests run: 5, Failures: 0, Errors: 0, Skipped: 2, Time elapsed: 0.022 sec
    [junit] Running org.apache.poi.xssf.usermodel.TestXSSFSheetUpdateArrayFormulas
    [junit] Tests run: 18, Failures: 0, Errors: 0, Skipped: 1, Time elapsed: 0.049 sec
    [junit] Running org.apache.poi.xssf.usermodel.TestXSSFSimpleShape
    [junit] Tests run: 1, Failures: 0, Errors: 0, Skipped: 0, Time elapsed: 0.014 sec
    [junit] Running org.apache.poi.xssf.usermodel.TestXSSFTable
    [junit] Tests run: 30, Failures: 0, Errors: 0, Skipped: 0, Time elapsed: 0.206 sec
    [junit] Running org.apache.poi.xssf.usermodel.TestXSSFTableColumn
    [junit] Tests run: 3, Failures: 0, Errors: 0, Skipped: 0, Time elapsed: 0.03 sec
    [junit] Running org.apache.poi.xssf.usermodel.TestXSSFTextParagraph
    [junit] Tests run: 1, Failures: 0, Errors: 0, Skipped: 0, Time elapsed: 0.014 sec
    [junit] Running org.apache.poi.xssf.usermodel.TestXSSFTextRun
    [junit] Tests run: 1, Failures: 0, Errors: 0, Skipped: 0, Time elapsed: 0.005 sec
    [junit] Running org.apache.poi.xssf.usermodel.TestXSSFUnicodeSurrogates
    [junit] Tests run: 1, Failures: 0, Errors: 0, Skipped: 0, Time elapsed: 0.009 sec
    [junit] Running org.apache.poi.xssf.usermodel.TestXSSFVMLDrawing
    [junit] Tests run: 4, Failures: 0, Errors: 0, Skipped: 0, Time elapsed: 0.094 sec
    [junit] Running org.apache.poi.xssf.usermodel.TestXSSFWorkbook
    [junit] Tests run: 62, Failures: 0, Errors: 0, Skipped: 0, Time elapsed: 0.795 sec
    [junit] Running org.apache.poi.xssf.usermodel.charts.TestXDDFChartLegend
    [junit] Tests run: 3, Failures: 0, Errors: 0, Skipped: 0, Time elapsed: 0.01 sec
    [junit] Running org.apache.poi.xssf.usermodel.charts.TestXDDFManualLayout
    [junit] Tests run: 2, Failures: 0, Errors: 0, Skipped: 0, Time elapsed: 0.008 sec
    [junit] Running org.apache.poi.xssf.usermodel.charts.TestXSSFCategoryAxis
    [junit] Tests run: 1, Failures: 0, Errors: 0, Skipped: 0, Time elapsed: 0.004 sec
    [junit] Running org.apache.poi.xssf.usermodel.charts.TestXSSFChartAxis
    [junit] Tests run: 8, Failures: 0, Errors: 0, Skipped: 0, Time elapsed: 0.049 sec
    [junit] Running org.apache.poi.xssf.usermodel.charts.TestXSSFChartTitle
    [junit] Tests run: 6, Failures: 0, Errors: 0, Skipped: 0, Time elapsed: 0.051 sec
    [junit] Running org.apache.poi.xssf.usermodel.charts.TestXSSFDateAxis
    [junit] Tests run: 1, Failures: 0, Errors: 0, Skipped: 0, Time elapsed: 0.01 sec
    [junit] Running org.apache.poi.xssf.usermodel.charts.TestXSSFLineChartData
    [junit] Tests run: 1, Failures: 0, Errors: 0, Skipped: 0, Time elapsed: 0.007 sec
    [junit] Running org.apache.poi.xssf.usermodel.charts.TestXSSFScatterChartData
    [junit] Tests run: 1, Failures: 0, Errors: 0, Skipped: 0, Time elapsed: 0.006 sec
    [junit] Running org.apache.poi.xssf.usermodel.charts.TestXSSFValueAxis
    [junit] Tests run: 1, Failures: 0, Errors: 0, Skipped: 0, Time elapsed: 0.005 sec
    [junit] Running org.apache.poi.xssf.usermodel.extensions.TestXSSFBorder
    [junit] Tests run: 1, Failures: 0, Errors: 0, Skipped: 0, Time elapsed: 0.003 sec
    [junit] Running org.apache.poi.xssf.usermodel.extensions.TestXSSFCellFill
    [junit] Tests run: 6, Failures: 0, Errors: 0, Skipped: 0, Time elapsed: 0.023 sec
    [junit] Running org.apache.poi.xssf.usermodel.extensions.TestXSSFHeaderFooter
    [junit] Tests run: 10, Failures: 0, Errors: 0, Skipped: 0, Time elapsed: 0.021 sec
    [junit] Running org.apache.poi.xssf.usermodel.helpers.TestColumnHelper
    [junit] Tests run: 16, Failures: 0, Errors: 0, Skipped: 0, Time elapsed: 0.118 sec
    [junit] Running org.apache.poi.xssf.usermodel.helpers.TestHeaderFooterHelper
    [junit] Tests run: 2, Failures: 0, Errors: 0, Skipped: 0, Time elapsed: 0.002 sec
    [junit] Running org.apache.poi.xssf.usermodel.helpers.TestXSSFColumnShifting
    [junit] Tests run: 2, Failures: 0, Errors: 0, Skipped: 0, Time elapsed: 0.003 sec
    [junit] Running org.apache.poi.xssf.util.TestCTColComparator
    [junit] Tests run: 2, Failures: 0, Errors: 0, Skipped: 0, Time elapsed: 0.002 sec
    [junit] Running org.apache.poi.xssf.util.TestEvilUnclosedBRFixingInputStream
    [junit] Tests run: 3, Failures: 0, Errors: 0, Skipped: 0, Time elapsed: 0.002 sec
    [junit] Running org.apache.poi.xssf.util.TestNumericRanges
    [junit] Tests run: 2, Failures: 0, Errors: 0, Skipped: 0, Time elapsed: 0.001 sec
    [junit] Running org.apache.poi.xwpf.TestAllExtendedProperties
    [junit] Tests run: 1, Failures: 0, Errors: 0, Skipped: 0, Time elapsed: 0.067 sec
    [junit] Running org.apache.poi.xwpf.TestDocumentProtection
    [junit] Tests run: 10, Failures: 0, Errors: 0, Skipped: 0, Time elapsed: 0.549 sec
    [junit] Running org.apache.poi.xwpf.TestNecessaryOOXMLClasses
    [junit] Tests run: 1, Failures: 0, Errors: 0, Skipped: 0, Time elapsed: 0.009 sec
    [junit] Running org.apache.poi.xwpf.TestPackageCorePropertiesGetKeywords
    [junit] Tests run: 1, Failures: 0, Errors: 0, Skipped: 0, Time elapsed: 0.015 sec
    [junit] Running org.apache.poi.xwpf.TestXWPFBugs
    [junit] Tests run: 4, Failures: 0, Errors: 0, Skipped: 0, Time elapsed: 0.247 sec
    [junit] Running org.apache.poi.xwpf.extractor.TestExternalEntities
    [junit] Tests run: 1, Failures: 0, Errors: 0, Skipped: 0, Time elapsed: 0.02 sec
    [junit] Running org.apache.poi.xwpf.extractor.TestXWPFWordExtractor
    [junit] Tests run: 24, Failures: 0, Errors: 0, Skipped: 0, Time elapsed: 0.737 sec
    [junit] Running org.apache.poi.xwpf.model.TestXWPFDecorators
    [junit] Tests run: 2, Failures: 0, Errors: 0, Skipped: 0, Time elapsed: 0.058 sec
    [junit] Running org.apache.poi.xwpf.model.TestXWPFHeaderFooterPolicy
    [junit] Tests run: 3, Failures: 0, Errors: 0, Skipped: 0, Time elapsed: 0.135 sec
    [junit] Running org.apache.poi.xwpf.usermodel.TestChangeTracking
    [junit] Tests run: 3, Failures: 0, Errors: 0, Skipped: 0, Time elapsed: 0.019 sec
    [junit] Running org.apache.poi.xwpf.usermodel.TestXWPFBugs
    [junit] Tests run: 10, Failures: 0, Errors: 0, Skipped: 0, Time elapsed: 0.204 sec
    [junit] Running org.apache.poi.xwpf.usermodel.TestXWPFChart
    [junit] Tests run: 4, Failures: 0, Errors: 0, Skipped: 0, Time elapsed: 0.039 sec
    [junit] Running org.apache.poi.xwpf.usermodel.TestXWPFComment
    [junit] Tests run: 1, Failures: 0, Errors: 0, Skipped: 0, Time elapsed: 0.006 sec
    [junit] Running org.apache.poi.xwpf.usermodel.TestXWPFDocument
    [junit] Tests run: 21, Failures: 0, Errors: 0, Skipped: 1, Time elapsed: 0.363 sec
    [junit] Running org.apache.poi.xwpf.usermodel.TestXWPFEndnote
    [junit] Tests run: 4, Failures: 0, Errors: 0, Skipped: 0, Time elapsed: 0.02 sec
    [junit] Running org.apache.poi.xwpf.usermodel.TestXWPFEndnotes
    [junit] Tests run: 2, Failures: 0, Errors: 0, Skipped: 0, Time elapsed: 0.009 sec
    [junit] Running org.apache.poi.xwpf.usermodel.TestXWPFFootnote
    [junit] Tests run: 4, Failures: 0, Errors: 0, Skipped: 0, Time elapsed: 0.016 sec
    [junit] Running org.apache.poi.xwpf.usermodel.TestXWPFFootnotes
    [junit] Tests run: 3, Failures: 0, Errors: 0, Skipped: 0, Time elapsed: 0.025 sec
    [junit] Running org.apache.poi.xwpf.usermodel.TestXWPFHeader
    [junit] Tests run: 9, Failures: 0, Errors: 0, Skipped: 4, Time elapsed: 0.099 sec
    [junit] Running org.apache.poi.xwpf.usermodel.TestXWPFHeadings
    [junit] Tests run: 1, Failures: 0, Errors: 0, Skipped: 0, Time elapsed: 0.042 sec
    [junit] Running org.apache.poi.xwpf.usermodel.TestXWPFNumbering
    [junit] Tests run: 8, Failures: 0, Errors: 0, Skipped: 0, Time elapsed: 0.075 sec
    [junit] Running org.apache.poi.xwpf.usermodel.TestXWPFParagraph
    [junit] Tests run: 28, Failures: 0, Errors: 0, Skipped: 0, Time elapsed: 0.176 sec
    [junit] Running org.apache.poi.xwpf.usermodel.TestXWPFPictureData
    [junit] Tests run: 5, Failures: 0, Errors: 0, Skipped: 0, Time elapsed: 0.125 sec
    [junit] Running org.apache.poi.xwpf.usermodel.TestXWPFRun
    [junit] Tests run: 34, Failures: 0, Errors: 0, Skipped: 0, Time elapsed: 0.2 sec
    [junit] Running org.apache.poi.xwpf.usermodel.TestXWPFSDT
    [junit] Tests run: 7, Failures: 0, Errors: 0, Skipped: 0, Time elapsed: 0.099 sec
    [junit] Running org.apache.poi.xwpf.usermodel.TestXWPFSmartTag
    [junit] Tests run: 1, Failures: 0, Errors: 0, Skipped: 0, Time elapsed: 0.007 sec
    [junit] Running org.apache.poi.xwpf.usermodel.TestXWPFStyles
    [junit] Tests run: 10, Failures: 0, Errors: 0, Skipped: 0, Time elapsed: 0.102 sec
    [junit] Running org.apache.poi.xwpf.usermodel.TestXWPFTable
    [junit] Tests run: 17, Failures: 0, Errors: 0, Skipped: 0, Time elapsed: 0.075 sec
    [junit] Running org.apache.poi.xwpf.usermodel.TestXWPFTableCell
    [junit] Tests run: 10, Failures: 0, Errors: 0, Skipped: 1, Time elapsed: 0.059 sec
    [junit] Running org.apache.poi.xwpf.usermodel.TestXWPFTableRow
    [junit] Tests run: 6, Failures: 0, Errors: 0, Skipped: 0, Time elapsed: 0.048 sec

-test-ooxml-write-testfile:

compile-ooxml-lite:
     [echo] Create ooxml-lite schemas

BUILD FAILED
<https://builds.apache.org/job/POI-DSL-1.8/ws/build.xml>:1589: linecontains doesn't support the "matchany" attribute

Total time: 11 minutes 48 seconds
Build step 'Invoke Ant' marked build as failure
Skipping publisher since build result is FAILURE
Archiving artifacts
[Fast Archiver] Compressed 3.04 MB of artifacts by 98.7% relative to #1040
Skipping publisher since build result is FAILURE
Recording test results

---------------------------------------------------------------------
To unsubscribe, e-mail: [hidden email]
For additional commands, e-mail: [hidden email]

Reply | Threaded
Open this post in threaded view
|

Build failed in Jenkins: POI-DSL-1.8 #1043

Apache Jenkins Server
See <https://builds.apache.org/job/POI-DSL-1.8/1043/display/redirect?page=changes>

Changes:

[kiwiwings] use Ant 1.10 for the builds


------------------------------------------
[...truncated 707.33 KB...]
    [junit] Reading spreadsheet/ex41187-19267.xls with HPSFFileHandler
    [junit] Reading spreadsheet/ex42564-21435.xls with HSSFFileHandler
    [junit] Reading spreadsheet/ex42564-21435.xls with HPSFFileHandler
    [junit] Reading spreadsheet/ex42564-21503.xls with HSSFFileHandler
    [junit] Reading spreadsheet/ex42564-21503.xls with HPSFFileHandler
    [junit] Reading spreadsheet/ex42564-elementOrder.xls with HSSFFileHandler
    [junit] Reading spreadsheet/ex42564-elementOrder.xls with HPSFFileHandler
    [junit] Reading spreadsheet/ex42570-20305.xls with HSSFFileHandler
    [junit] Reading spreadsheet/ex42570-20305.xls with HPSFFileHandler
    [junit] Reading spreadsheet/ex44921-21902.xls with HSSFFileHandler
    [junit] Reading spreadsheet/ex44921-21902.xls with HPSFFileHandler
    [junit] Reading spreadsheet/ex45046-21984.xls with HSSFFileHandler
    [junit] Reading spreadsheet/ex45046-21984.xls with HPSFFileHandler
    [junit] Reading spreadsheet/ex45582-22397.xls with HSSFFileHandler
    [junit] Reading spreadsheet/ex45582-22397.xls with HPSFFileHandler
    [junit] Reading spreadsheet/ex45672.xls with HSSFFileHandler
    [junit] Reading spreadsheet/ex45672.xls with HPSFFileHandler
    [junit] Reading spreadsheet/ex45698-22488.xls with HSSFFileHandler
    [junit] Reading spreadsheet/ex45698-22488.xls with HPSFFileHandler
    [junit] Reading spreadsheet/ex45978-extraLinkTableSheets.xls with HSSFFileHandler
    [junit] Reading spreadsheet/ex45978-extraLinkTableSheets.xls with HPSFFileHandler
    [junit] Reading spreadsheet/ex46548-23133.xls with HSSFFileHandler
    [junit] Reading spreadsheet/ex46548-23133.xls with HPSFFileHandler
    [junit] Reading spreadsheet/ex47747-sharedFormula.xls with HSSFFileHandler
    [junit] Reading spreadsheet/ex47747-sharedFormula.xls with HPSFFileHandler
    [junit] Reading spreadsheet/excel_with_embeded.xls with HSSFFileHandler
    [junit] Reading spreadsheet/excel_with_embeded.xls with HPSFFileHandler
    [junit] Reading spreadsheet/excelant.xls with HSSFFileHandler
    [junit] Reading spreadsheet/excelant.xls with HPSFFileHandler
    [junit] Reading spreadsheet/extendedtextstrings.txt with NullFileHandler
    [junit] Reading spreadsheet/externalFunctionExample.xls with HSSFFileHandler
    [junit] Reading spreadsheet/externalFunctionExample.xls with HPSFFileHandler
    [junit] Reading spreadsheet/external_image.xls with HSSFFileHandler
    [junit] Reading spreadsheet/external_image.xls with HPSFFileHandler
    [junit] Reading spreadsheet/external_name.xls with HSSFFileHandler
    [junit] Reading spreadsheet/external_name.xls with HPSFFileHandler
    [junit] Reading spreadsheet/finance.xls with HSSFFileHandler
    [junit] Reading spreadsheet/finance.xls with HPSFFileHandler
    [junit] Reading spreadsheet/florida_data.ashx.xls with HSSFFileHandler
    [junit] Reading spreadsheet/florida_data.ashx.xls with HPSFFileHandler
    [junit] Reading spreadsheet/headerFooterTest.xlsx with XSSFFileHandler
    [junit] Reading spreadsheet/headerFooterTest.xlsx with OPCFileHandler
    [junit] Reading spreadsheet/hyperlink.xlsb with XSSFBFileHandler
    [junit] Reading spreadsheet/intercept.xls with HSSFFileHandler
    [junit] Reading spreadsheet/intercept.xls with HPSFFileHandler
    [junit] Reading spreadsheet/logoKarmokar4.png with NullFileHandler
    [junit] Reading spreadsheet/maxindextest.xls with HSSFFileHandler
    [junit] Reading spreadsheet/maxindextest.xls with HPSFFileHandler
    [junit] Reading spreadsheet/mirrTest.xls with HSSFFileHandler
    [junit] Reading spreadsheet/mirrTest.xls with HPSFFileHandler
    [junit] Reading spreadsheet/missingFuncs44675.xls with HSSFFileHandler
    [junit] Reading spreadsheet/missingFuncs44675.xls with HPSFFileHandler
    [junit] Reading spreadsheet/mortgage-calculation.xls with HSSFFileHandler
    [junit] Reading spreadsheet/mortgage-calculation.xls with HPSFFileHandler
    [junit] Reading spreadsheet/multibookFormulaA.xls with HSSFFileHandler
    [junit] Reading spreadsheet/multibookFormulaA.xls with HPSFFileHandler
    [junit] Reading spreadsheet/multibookFormulaB.xls with HSSFFileHandler
    [junit] Reading spreadsheet/multibookFormulaB.xls with HPSFFileHandler
    [junit] Reading spreadsheet/mv-calculator-final-2-20-2013.xlsm with XSSFFileHandler
    [junit] Reading spreadsheet/mv-calculator-final-2-20-2013.xlsm with OPCFileHandler
    [junit] Reading spreadsheet/named-cell-in-formula-test.xls with HSSFFileHandler
    [junit] Reading spreadsheet/named-cell-in-formula-test.xls with HPSFFileHandler
    [junit] Reading spreadsheet/named-cell-test.xls with HSSFFileHandler
    [junit] Reading spreadsheet/named-cell-test.xls with HPSFFileHandler
    [junit] Reading spreadsheet/namedinput.xls with HSSFFileHandler
    [junit] Reading spreadsheet/namedinput.xls with HPSFFileHandler
    [junit] Reading spreadsheet/noHeaderFooter47244.xls with HSSFFileHandler
    [junit] Reading spreadsheet/noHeaderFooter47244.xls with HPSFFileHandler
    [junit] Reading spreadsheet/noSharedStringTable.xlsx with XSSFFileHandler
    [junit] Reading spreadsheet/noSharedStringTable.xlsx with OPCFileHandler
    [junit] Reading spreadsheet/ole2-embedding.xls with HSSFFileHandler
    [junit] Reading spreadsheet/ole2-embedding.xls with HPSFFileHandler
    [junit] Reading spreadsheet/overlapSharedFormula.xls with HSSFFileHandler
    [junit] Reading spreadsheet/overlapSharedFormula.xls with HPSFFileHandler
    [junit] Reading spreadsheet/password.xls with HSSFFileHandler
    [junit] Reading spreadsheet/password.xls with HPSFFileHandler
    [junit] Reading spreadsheet/picture.xlsx with XSSFFileHandler
    [junit] Reading spreadsheet/picture.xlsx with OPCFileHandler
    [junit] Reading spreadsheet/poc-shared-strings.xlsx with XSSFFileHandler
    [junit] Reading spreadsheet/poc-shared-strings.xlsx with OPCFileHandler
    [junit] Reading spreadsheet/poc-xmlbomb-empty.xlsx with XSSFFileHandler
    [junit] Reading spreadsheet/poc-xmlbomb-empty.xlsx with OPCFileHandler
    [junit] Reading spreadsheet/poc-xmlbomb.xlsx with XSSFFileHandler
    [junit] Reading spreadsheet/poc-xmlbomb.xlsx with OPCFileHandler
    [junit] Reading spreadsheet/protected_passtika.xlsb with XSSFBFileHandler
    [junit] Reading spreadsheet/protected_passtika.xlsx with XSSFFileHandler
    [junit] Reading spreadsheet/protected_passtika.xlsx with OPCFileHandler
    [junit] Reading spreadsheet/rank.xls with HSSFFileHandler
    [junit] Reading spreadsheet/rank.xls with HPSFFileHandler
    [junit] Reading spreadsheet/ref-56737.xlsx with XSSFFileHandler
    [junit] Reading spreadsheet/ref-56737.xlsx with OPCFileHandler
    [junit] Reading spreadsheet/ref2-56737.xlsx with XSSFFileHandler
    [junit] Reading spreadsheet/ref2-56737.xlsx with OPCFileHandler
    [junit] Reading spreadsheet/reordered_sheets.xlsx with XSSFFileHandler
    [junit] Reading spreadsheet/reordered_sheets.xlsx with OPCFileHandler
    [junit] Reading spreadsheet/resize_compare.xls with HSSFFileHandler
    [junit] Reading spreadsheet/resize_compare.xls with HPSFFileHandler
    [junit] Reading spreadsheet/resize_compare.xlsx with XSSFFileHandler
    [junit] Reading spreadsheet/resize_compare.xlsx with OPCFileHandler
    [junit] Reading spreadsheet/richtextdata.txt with NullFileHandler
    [junit] Reading spreadsheet/rk.xls with HSSFFileHandler
    [junit] Reading spreadsheet/rk.xls with HPSFFileHandler
    [junit] Reading spreadsheet/sample-beta.xlsx with XSSFFileHandler
    [junit] Reading spreadsheet/sample-beta.xlsx with OPCFileHandler
    [junit] Reading spreadsheet/sample.strict.xlsx with XSSFFileHandler
    [junit] Reading spreadsheet/sample.strict.xlsx with OPCFileHandler
    [junit] Reading spreadsheet/sample.xlsb with XSSFBFileHandler
    [junit] Reading spreadsheet/sample.xlsx with XSSFFileHandler
    [junit] Reading spreadsheet/sample.xlsx with OPCFileHandler
    [junit] Reading spreadsheet/shared_formulas.xls with HSSFFileHandler
    [junit] Reading spreadsheet/shared_formulas.xls with HPSFFileHandler
    [junit] Reading spreadsheet/shared_formulas.xlsx with XSSFFileHandler
    [junit] Reading spreadsheet/shared_formulas.xlsx with OPCFileHandler
    [junit] Reading spreadsheet/sheetProtection_allLocked.xlsx with XSSFFileHandler
    [junit] Reading spreadsheet/sheetProtection_allLocked.xlsx with OPCFileHandler
    [junit] Reading spreadsheet/sheetProtection_not_protected.xlsx with XSSFFileHandler
    [junit] Reading spreadsheet/sheetProtection_not_protected.xlsx with OPCFileHandler
    [junit] Reading spreadsheet/simple-monthly-budget.xlsx with XSSFFileHandler
    [junit] Reading spreadsheet/simple-monthly-budget.xlsx with OPCFileHandler
    [junit] Reading spreadsheet/simple-table-named-range.xlsx with XSSFFileHandler
    [junit] Reading spreadsheet/simple-table-named-range.xlsx with OPCFileHandler
    [junit] Reading spreadsheet/stringacross2continuations.txt with NullFileHandler
    [junit] Reading spreadsheet/style-alternate-content.xlsx with XSSFFileHandler
    [junit] Reading spreadsheet/style-alternate-content.xlsx with OPCFileHandler
    [junit] Reading spreadsheet/styles.xlsx with XSSFFileHandler
    [junit] Reading spreadsheet/styles.xlsx with OPCFileHandler
    [junit] Reading spreadsheet/sumifformula.xls with HSSFFileHandler
    [junit] Reading spreadsheet/sumifformula.xls with HPSFFileHandler
    [junit] Reading spreadsheet/sumifs.xls with HSSFFileHandler
    [junit] Reading spreadsheet/sumifs.xls with HPSFFileHandler
    [junit] Reading spreadsheet/tableStyle.xlsx with XSSFFileHandler
    [junit] Reading spreadsheet/tableStyle.xlsx with OPCFileHandler
    [junit] Reading spreadsheet/template.xlsx with XSSFFileHandler
    [junit] Reading spreadsheet/template.xlsx with OPCFileHandler
    [junit] Reading spreadsheet/templateExcelWithAutofilter.xls with HSSFFileHandler
    [junit] Reading spreadsheet/templateExcelWithAutofilter.xls with HPSFFileHandler
    [junit] Reading spreadsheet/test.xltx with XSSFFileHandler
    [junit] Reading spreadsheet/test.xltx with OPCFileHandler
    [junit] Reading spreadsheet/testArraysAndTables.xls with HSSFFileHandler
    [junit] Reading spreadsheet/testArraysAndTables.xls with HPSFFileHandler
    [junit] Reading spreadsheet/testEXCEL_3.xls with HSSFFileHandler
    [junit] Reading spreadsheet/testEXCEL_3.xls with HPSFFileHandler
    [junit] Reading spreadsheet/testEXCEL_4.xls with HSSFFileHandler
    [junit] Reading spreadsheet/testEXCEL_4.xls with HPSFFileHandler
    [junit] Reading spreadsheet/testEXCEL_5.xls with HSSFFileHandler
    [junit] Reading spreadsheet/testEXCEL_5.xls with HPSFFileHandler
    [junit] Reading spreadsheet/testEXCEL_95.xls with HSSFFileHandler
    [junit] Reading spreadsheet/testEXCEL_95.xls with HPSFFileHandler
    [junit] Reading spreadsheet/testNames.xls with HSSFFileHandler
    [junit] Reading spreadsheet/testNames.xls with HPSFFileHandler
    [junit] Reading spreadsheet/testNames.xlsm with XSSFFileHandler
    [junit] Reading spreadsheet/testNames.xlsm with OPCFileHandler
    [junit] Reading spreadsheet/testRRaC.xls with HSSFFileHandler
    [junit] Reading spreadsheet/testRRaC.xls with HPSFFileHandler
    [junit] Reading spreadsheet/testRVA.xls with HSSFFileHandler
    [junit] Reading spreadsheet/testRVA.xls with HPSFFileHandler
    [junit] Reading spreadsheet/testVarious.xlsb with XSSFBFileHandler
    [junit] Reading spreadsheet/test_conditional_formatting.xlsx with XSSFFileHandler
    [junit] Reading spreadsheet/test_conditional_formatting.xlsx with OPCFileHandler
    [junit] Reading spreadsheet/test_properties1 with NullFileHandler
    [junit] Reading spreadsheet/text.xls with HSSFFileHandler
    [junit] Reading spreadsheet/text.xls with HPSFFileHandler
    [junit] Reading spreadsheet/tile-range-test.xls with HSSFFileHandler
    [junit] Reading spreadsheet/tile-range-test.xls with HPSFFileHandler
    [junit] Reading spreadsheet/tile-range-test.xlsx with XSSFFileHandler
    [junit] Reading spreadsheet/tile-range-test.xlsx with OPCFileHandler
    [junit] Reading spreadsheet/unicodeNameRecord.xls with HSSFFileHandler
    [junit] Reading spreadsheet/unicodeNameRecord.xls with HPSFFileHandler
    [junit] Reading spreadsheet/unicodeSheetName.xlsx with XSSFFileHandler
    [junit] Reading spreadsheet/unicodeSheetName.xlsx with OPCFileHandler
    [junit] Reading spreadsheet/vmlDrawing1.vml with NullFileHandler
    [junit] Reading spreadsheet/workbookProtection-sheet_password-2013.xlsx with XSSFFileHandler
    [junit] Reading spreadsheet/workbookProtection-sheet_password-2013.xlsx with OPCFileHandler
    [junit] Reading spreadsheet/workbookProtection-workbook_password-2013.xlsx with XSSFFileHandler
    [junit] Reading spreadsheet/workbookProtection-workbook_password-2013.xlsx with OPCFileHandler
    [junit] Reading spreadsheet/workbookProtection-workbook_password_user_range-2010.xlsx with XSSFFileHandler
    [junit] Reading spreadsheet/workbookProtection-workbook_password_user_range-2010.xlsx with OPCFileHandler
    [junit] Reading spreadsheet/workbookProtection_not_protected.xlsx with XSSFFileHandler
    [junit] Reading spreadsheet/workbookProtection_not_protected.xlsx with OPCFileHandler
    [junit] Reading spreadsheet/workbookProtection_workbook_revision_protected.xlsx with XSSFFileHandler
    [junit] Reading spreadsheet/workbookProtection_workbook_revision_protected.xlsx with OPCFileHandler
    [junit] Reading spreadsheet/workbookProtection_workbook_structure_protected.xlsx with XSSFFileHandler
    [junit] Reading spreadsheet/workbookProtection_workbook_structure_protected.xlsx with OPCFileHandler
    [junit] Reading spreadsheet/workbookProtection_workbook_windows_protected.xlsx with XSSFFileHandler
    [junit] Reading spreadsheet/workbookProtection_workbook_windows_protected.xlsx with OPCFileHandler
    [junit] Reading spreadsheet/workbookProtection_worksheet_protected.xlsx with XSSFFileHandler
    [junit] Reading spreadsheet/workbookProtection_worksheet_protected.xlsx with OPCFileHandler
    [junit] Reading spreadsheet/xlsx-corrupted.xlsx with XSSFFileHandler
    [junit] Reading spreadsheet/xlsx-corrupted.xlsx with OPCFileHandler
    [junit] Reading spreadsheet/xlsx-jdbc.xlsx with XSSFFileHandler
    [junit] Reading spreadsheet/xlsx-jdbc.xlsx with OPCFileHandler
    [junit] Reading spreadsheet/xor-encryption-abc.xls with HSSFFileHandler
    [junit] Reading spreadsheet/xor-encryption-abc.xls with HPSFFileHandler
    [junit] Reading spreadsheet/xxe_in_schema.xlsx with XSSFFileHandler
    [junit] Reading spreadsheet/xxe_in_schema.xlsx with OPCFileHandler
    [junit] Reading spreadsheet/yearfracExamples.xls with HSSFFileHandler
    [junit] Reading spreadsheet/yearfracExamples.xls with HPSFFileHandler
    [junit] Reading xmldsign/Office2010-SP1-XAdES-X-L.docx with XWPFFileHandler
    [junit] Reading xmldsign/Office2010-SP1-XAdES-X-L.docx with OPCFileHandler
    [junit] Reading xmldsign/PPT2016withComment.pptx with XSLFFileHandler
    [junit] Reading xmldsign/PPT2016withComment.pptx with OPCFileHandler
    [junit] Reading xmldsign/bug58630.xlsx with XSSFFileHandler
    [junit] Reading xmldsign/bug58630.xlsx with OPCFileHandler
    [junit] Reading xmldsign/bug63011_key1.pem with NullFileHandler
    [junit] Reading xmldsign/bug63011_key2.pem with NullFileHandler
    [junit] Reading xmldsign/chaintest.pfx with NullFileHandler
    [junit] Reading xmldsign/hello-world-office-2010-technical-preview-unsigned.docx with XWPFFileHandler
    [junit] Reading xmldsign/hello-world-office-2010-technical-preview-unsigned.docx with OPCFileHandler
    [junit] Reading xmldsign/hello-world-office-2010-technical-preview.docx with XWPFFileHandler
    [junit] Reading xmldsign/hello-world-office-2010-technical-preview.docx with OPCFileHandler
    [junit] Reading xmldsign/hello-world-signed-twice.docx with XWPFFileHandler
    [junit] Reading xmldsign/hello-world-signed-twice.docx with OPCFileHandler
    [junit] Reading xmldsign/hello-world-signed.docx with XWPFFileHandler
    [junit] Reading xmldsign/hello-world-signed.docx with OPCFileHandler
    [junit] Reading xmldsign/hello-world-signed.pptx with XSLFFileHandler
    [junit] Reading xmldsign/hello-world-signed.pptx with OPCFileHandler
    [junit] Reading xmldsign/hello-world-signed.xlsx with XSSFFileHandler
    [junit] Reading xmldsign/hello-world-signed.xlsx with OPCFileHandler
    [junit] Reading xmldsign/hello-world-unsigned.docx with XWPFFileHandler
    [junit] Reading xmldsign/hello-world-unsigned.docx with OPCFileHandler
    [junit] Reading xmldsign/hello-world-unsigned.pptx with XSLFFileHandler
    [junit] Reading xmldsign/hello-world-unsigned.pptx with OPCFileHandler
    [junit] Reading xmldsign/hello-world-unsigned.xlsx with XSSFFileHandler
    [junit] Reading xmldsign/hello-world-unsigned.xlsx with OPCFileHandler
    [junit] Reading xmldsign/hyperlink-example-signed.docx with XWPFFileHandler
    [junit] Reading xmldsign/hyperlink-example-signed.docx with OPCFileHandler
    [junit] Reading xmldsign/ms-office-2010-signed.docx with XWPFFileHandler
    [junit] Reading xmldsign/ms-office-2010-signed.docx with OPCFileHandler
    [junit] Reading xmldsign/ms-office-2010-signed.pptx with XSLFFileHandler
    [junit] Reading xmldsign/ms-office-2010-signed.pptx with OPCFileHandler
    [junit] Reading xmldsign/ms-office-2010-signed.xlsx with XSSFFileHandler
    [junit] Reading xmldsign/ms-office-2010-signed.xlsx with OPCFileHandler
    [junit] Reading xmldsign/office2007prettyPrintedRels.docx with XWPFFileHandler
    [junit] Reading xmldsign/office2007prettyPrintedRels.docx with OPCFileHandler
    [junit] Reading xmldsign/signed.docx with XWPFFileHandler
    [junit] Reading xmldsign/signed.docx with OPCFileHandler
    [junit] Tests run: 2563, Failures: 0, Errors: 1, Skipped: 0, Time elapsed: 740.73 sec

BUILD FAILED
<https://builds.apache.org/job/POI-DSL-1.8/ws/build.xml>:1549: The following error occurred while executing this line:
<https://builds.apache.org/job/POI-DSL-1.8/ws/build.xml>:1110: Test org.apache.poi.stress.TestAllFiles failed

Total time: 26 minutes 28 seconds
Build step 'Invoke Ant' marked build as failure
Skipping publisher since build result is FAILURE
Archiving artifacts
[Fast Archiver] Compressed 4.13 MB of artifacts by 22.7% relative to #1040
Skipping publisher since build result is FAILURE
Recording test results

---------------------------------------------------------------------
To unsubscribe, e-mail: [hidden email]
For additional commands, e-mail: [hidden email]

Reply | Threaded
Open this post in threaded view
|

Build failed in Jenkins: POI-DSL-1.8 #1044

Apache Jenkins Server
See <https://builds.apache.org/job/POI-DSL-1.8/1044/display/redirect?page=changes>

Changes:

[fanningpj] try to make examples more robust - to fix integration tests


------------------------------------------
[...truncated 976.91 KB...]
  [javadoc] <https://builds.apache.org/job/POI-DSL-1.8/ws/src/ooxml/java/org/apache/poi/xssf/usermodel/XSSFColor.java>:265: error: unknown tag: sysClr
  [javadoc]      * Index into the <clrScheme> collection, referencing a particular <sysClr> or
  [javadoc]                                                                        ^
  [javadoc] <https://builds.apache.org/job/POI-DSL-1.8/ws/src/ooxml/java/org/apache/poi/xssf/usermodel/XSSFColor.java>:266: error: unknown tag: srgbClr
  [javadoc]      *  <srgbClr> value expressed in the Theme part.
  [javadoc]         ^
  [javadoc] <https://builds.apache.org/job/POI-DSL-1.8/ws/src/ooxml/java/org/apache/poi/xssf/usermodel/XSSFColor.java>:274: error: unknown tag: clrScheme
  [javadoc]      * Index into the <clrScheme> collection, referencing a particular <sysClr> or
  [javadoc]                       ^
  [javadoc] <https://builds.apache.org/job/POI-DSL-1.8/ws/src/ooxml/java/org/apache/poi/xssf/usermodel/XSSFColor.java>:274: error: unknown tag: sysClr
  [javadoc]      * Index into the <clrScheme> collection, referencing a particular <sysClr> or
  [javadoc]                                                                        ^
  [javadoc] <https://builds.apache.org/job/POI-DSL-1.8/ws/src/ooxml/java/org/apache/poi/xssf/usermodel/XSSFColor.java>:275: error: unknown tag: srgbClr
  [javadoc]      *  <srgbClr> value expressed in the Theme part.
  [javadoc]         ^
  [javadoc] <https://builds.apache.org/job/POI-DSL-1.8/ws/src/ooxml/java/org/apache/poi/xssf/usermodel/XSSFDxfStyleProvider.java>:42: error: bad use of '>'
  [javadoc]      * @param stripeSize 0 for non-stripe styles, > 1 for stripes
  [javadoc]                                                   ^
  [javadoc] <https://builds.apache.org/job/POI-DSL-1.8/ws/src/ooxml/java/org/apache/poi/xssf/usermodel/XSSFName.java>:146: error: tag not allowed here: <blockquote>
  [javadoc]      * <pre><blockquote>
  [javadoc]             ^
  [javadoc] <https://builds.apache.org/job/POI-DSL-1.8/ws/src/ooxml/java/org/apache/poi/xssf/usermodel/XSSFName.java>:165: error: unexpected end tag: </p>
  [javadoc]     * </p>
  [javadoc]       ^
  [javadoc] <https://builds.apache.org/job/POI-DSL-1.8/ws/src/ooxml/java/org/apache/poi/xssf/usermodel/XSSFName.java>:36: error: tag not allowed here: <blockquote>
  [javadoc]  * <pre><blockquote>
  [javadoc]         ^
  [javadoc] <https://builds.apache.org/job/POI-DSL-1.8/ws/src/ooxml/java/org/apache/poi/xssf/usermodel/XSSFName.java>:86: error: tag not allowed here: <li>
  [javadoc]      * <li> this defined name refers to a range to which an advanced filter has been
  [javadoc]        ^
  [javadoc] <https://builds.apache.org/job/POI-DSL-1.8/ws/src/ooxml/java/org/apache/poi/xssf/usermodel/XSSFName.java>:88: error: tag not allowed here: <li>
  [javadoc]      * <li> This defined name refers to a range to which an AutoFilter has been
  [javadoc]        ^
  [javadoc] <https://builds.apache.org/job/POI-DSL-1.8/ws/src/ooxml/java/org/apache/poi/xssf/usermodel/XSSFRichTextString.java>:442: error: bad use of '>'
  [javadoc]      * CTRPrElt --> CTFont adapter
  [javadoc]                   ^
  [javadoc] <https://builds.apache.org/job/POI-DSL-1.8/ws/src/ooxml/java/org/apache/poi/xssf/usermodel/XSSFRow.java>:108: error: unknown tag: Cell
  [javadoc]      * for (Iterator<Cell> it = row.cellIterator(); it.hasNext(); ) {
  [javadoc]                     ^
  [javadoc] <https://builds.apache.org/job/POI-DSL-1.8/ws/src/ooxml/java/org/apache/poi/xssf/usermodel/XSSFRow.java>:195: error: malformed HTML
  [javadoc]      * @throws IllegalArgumentException if columnIndex < 0 or greater than 16384,
  [javadoc]                                                        ^
  [javadoc] <https://builds.apache.org/job/POI-DSL-1.8/ws/src/ooxml/java/org/apache/poi/xssf/usermodel/XSSFRow.java>:209: error: malformed HTML
  [javadoc]      * @throws IllegalArgumentException if the specified cell type is invalid, columnIndex < 0
  [javadoc]                                                                                            ^
  [javadoc] <https://builds.apache.org/job/POI-DSL-1.8/ws/src/ooxml/java/org/apache/poi/xssf/usermodel/XSSFRow.java>:417: error: malformed HTML
  [javadoc]      * @throws IllegalArgumentException if rowNum < 0 or greater than 1048575
  [javadoc]                                                   ^
  [javadoc] <https://builds.apache.org/job/POI-DSL-1.8/ws/src/ooxml/java/org/apache/poi/xssf/usermodel/XSSFSheetConditionalFormatting.java>:70: error: unexpected end tag: </p>
  [javadoc]      * </p>
  [javadoc]        ^
  [javadoc] <https://builds.apache.org/job/POI-DSL-1.8/ws/src/ooxml/java/org/apache/poi/xssf/usermodel/XSSFWorkbook.java>:832: error: unexpected end tag: </p>
  [javadoc]      * </p>
  [javadoc]        ^
  [javadoc] <https://builds.apache.org/job/POI-DSL-1.8/ws/src/ooxml/java/org/apache/poi/xssf/usermodel/XSSFWorkbook.java>:849: error: unexpected end tag: </p>
  [javadoc]      * </p>
  [javadoc]        ^
  [javadoc] <https://builds.apache.org/job/POI-DSL-1.8/ws/src/ooxml/java/org/apache/poi/xssf/usermodel/extensions/XSSFHeaderFooter.java>:40: error: semicolon missing
  [javadoc]  * section), and the date on the second line (center section). &CCenter
  [javadoc]                                                                ^
  [javadoc] <https://builds.apache.org/job/POI-DSL-1.8/ws/src/ooxml/java/org/apache/poi/xssf/usermodel/extensions/XSSFHeaderFooter.java>:41: error: bad HTML entity
  [javadoc]  * &"-,Bold"Bold &"-,Regular"Header_x000A_&D
  [javadoc]    ^
  [javadoc] <https://builds.apache.org/job/POI-DSL-1.8/ws/src/ooxml/java/org/apache/poi/xssf/usermodel/extensions/XSSFHeaderFooter.java>:41: error: bad HTML entity
  [javadoc]  * &"-,Bold"Bold &"-,Regular"Header_x000A_&D
  [javadoc]                  ^
  [javadoc] <https://builds.apache.org/job/POI-DSL-1.8/ws/src/ooxml/java/org/apache/poi/xssf/usermodel/extensions/XSSFHeaderFooter.java>:41: error: semicolon missing
  [javadoc]  * &"-,Bold"Bold &"-,Regular"Header_x000A_&D
  [javadoc]                                           ^
  [javadoc] <https://builds.apache.org/job/POI-DSL-1.8/ws/src/ooxml/java/org/apache/poi/xssf/usermodel/extensions/XSSFHeaderFooter.java>:48: error: semicolon missing
  [javadoc]  * <dt>&L</dt>
  [javadoc]        ^
  [javadoc] <https://builds.apache.org/job/POI-DSL-1.8/ws/src/ooxml/java/org/apache/poi/xssf/usermodel/extensions/XSSFHeaderFooter.java>:53: error: semicolon missing
  [javadoc]  * <dt>&P</dt>
  [javadoc]        ^
  [javadoc] <https://builds.apache.org/job/POI-DSL-1.8/ws/src/ooxml/java/org/apache/poi/xssf/usermodel/extensions/XSSFHeaderFooter.java>:55: error: semicolon missing
  [javadoc]  * <dt>&N</dt>
  [javadoc]        ^
  [javadoc] <https://builds.apache.org/job/POI-DSL-1.8/ws/src/ooxml/java/org/apache/poi/xssf/usermodel/extensions/XSSFHeaderFooter.java>:57: error: semicolon missing
  [javadoc]  * <dt>&font size</dt>
  [javadoc]        ^
  [javadoc] <https://builds.apache.org/job/POI-DSL-1.8/ws/src/ooxml/java/org/apache/poi/xssf/usermodel/extensions/XSSFHeaderFooter.java>:59: error: semicolon missing
  [javadoc]  * <dt>&K</dt>
  [javadoc]        ^
  [javadoc] <https://builds.apache.org/job/POI-DSL-1.8/ws/src/ooxml/java/org/apache/poi/xssf/usermodel/extensions/XSSFHeaderFooter.java>:63: error: semicolon missing
  [javadoc]  * <dt>&S</dt>
  [javadoc]        ^
  [javadoc] <https://builds.apache.org/job/POI-DSL-1.8/ws/src/ooxml/java/org/apache/poi/xssf/usermodel/extensions/XSSFHeaderFooter.java>:65: error: semicolon missing
  [javadoc]  * <dt>&X</dt>
  [javadoc]        ^
  [javadoc] <https://builds.apache.org/job/POI-DSL-1.8/ws/src/ooxml/java/org/apache/poi/xssf/usermodel/extensions/XSSFHeaderFooter.java>:67: error: semicolon missing
  [javadoc]  * <dt>&Y</dt>
  [javadoc]        ^
  [javadoc] <https://builds.apache.org/job/POI-DSL-1.8/ws/src/ooxml/java/org/apache/poi/xssf/usermodel/extensions/XSSFHeaderFooter.java>:69: error: semicolon missing
  [javadoc]  * <dt>&C</dt>
  [javadoc]        ^
  [javadoc] <https://builds.apache.org/job/POI-DSL-1.8/ws/src/ooxml/java/org/apache/poi/xssf/usermodel/extensions/XSSFHeaderFooter.java>:74: error: semicolon missing
  [javadoc]  * <dt>&D</dt>
  [javadoc]        ^
  [javadoc] <https://builds.apache.org/job/POI-DSL-1.8/ws/src/ooxml/java/org/apache/poi/xssf/usermodel/extensions/XSSFHeaderFooter.java>:76: error: semicolon missing
  [javadoc]  * <dt>&T</dt>
  [javadoc]        ^
  [javadoc] <https://builds.apache.org/job/POI-DSL-1.8/ws/src/ooxml/java/org/apache/poi/xssf/usermodel/extensions/XSSFHeaderFooter.java>:78: error: semicolon missing
  [javadoc]  * <dt>&G</dt>
  [javadoc]        ^
  [javadoc] <https://builds.apache.org/job/POI-DSL-1.8/ws/src/ooxml/java/org/apache/poi/xssf/usermodel/extensions/XSSFHeaderFooter.java>:80: error: semicolon missing
  [javadoc]  * <dt>&U</dt>
  [javadoc]        ^
  [javadoc] <https://builds.apache.org/job/POI-DSL-1.8/ws/src/ooxml/java/org/apache/poi/xssf/usermodel/extensions/XSSFHeaderFooter.java>:82: error: semicolon missing
  [javadoc]  * <dt>&E</dt>
  [javadoc]        ^
  [javadoc] <https://builds.apache.org/job/POI-DSL-1.8/ws/src/ooxml/java/org/apache/poi/xssf/usermodel/extensions/XSSFHeaderFooter.java>:84: error: semicolon missing
  [javadoc]  * <dt>&R</dt>
  [javadoc]        ^
  [javadoc] <https://builds.apache.org/job/POI-DSL-1.8/ws/src/ooxml/java/org/apache/poi/xssf/usermodel/extensions/XSSFHeaderFooter.java>:88: error: semicolon missing
  [javadoc]  * <dt>&Z</dt>
  [javadoc]        ^
  [javadoc] <https://builds.apache.org/job/POI-DSL-1.8/ws/src/ooxml/java/org/apache/poi/xssf/usermodel/extensions/XSSFHeaderFooter.java>:90: error: semicolon missing
  [javadoc]  * <dt>&F</dt>
  [javadoc]        ^
  [javadoc] 100 errors
  [javadoc] 100 warnings
      [jar] Building jar: <https://builds.apache.org/job/POI-DSL-1.8/ws/build/dist/maven/poi-ooxml/poi-ooxml-5.0.0-SNAPSHOT-javadoc.jar>

assemble:
      [zip] Building zip: <https://builds.apache.org/job/POI-DSL-1.8/ws/build/dist/poi-bin-5.0.0-SNAPSHOT-20200723.zip>
      [tar] Building tar: <https://builds.apache.org/job/POI-DSL-1.8/1044/artifact/build/dist/poi-bin-5.0.0-SNAPSHOT-20200723.tar.gz>
      [zip] Building zip: <https://builds.apache.org/job/POI-DSL-1.8/ws/build/dist/poi-src-5.0.0-SNAPSHOT-20200723.zip>
      [tar] Building tar: <https://builds.apache.org/job/POI-DSL-1.8/1044/artifact/build/dist/poi-src-5.0.0-SNAPSHOT-20200723.tar.gz>
     [echo] Creating Maven POMs

maven-poms:
     [copy] Copying 6 files to <https://builds.apache.org/job/POI-DSL-1.8/ws/build/dist/maven>
     [echo] Maven POMs are located in <https://builds.apache.org/job/POI-DSL-1.8/ws/build/dist>
     [echo] Use ant dist-nexus to deploy the artifacts in the remote repository
     [echo] Distribution located in <https://builds.apache.org/job/POI-DSL-1.8/ws/build/dist>
     [echo] Use "ant dist-checksum" to create sha256/sha512 checksums and GPG signatures

findbugs:
    [mkdir] Created dir: <https://builds.apache.org/job/POI-DSL-1.8/ws/build/findbugs/lib/config>
      [get] Getting: https://repo1.maven.org/maven2/com/github/spotbugs/spotbugs/4.0.2/spotbugs-4.0.2.jar
      [get] To: <https://builds.apache.org/job/POI-DSL-1.8/ws/build/findbugs/lib/spotbugs.jar>
      [get] Getting: https://repo1.maven.org/maven2/com/github/spotbugs/spotbugs-ant/4.0.2/spotbugs-ant-4.0.2.jar
      [get] To: <https://builds.apache.org/job/POI-DSL-1.8/ws/build/findbugs/lib/spotbugs-ant.jar>
      [get] Getting: https://repo1.maven.org/maven2/com/github/spotbugs/spotbugs-annotations/4.0.2/spotbugs-annotations-4.0.2.jar
      [get] To: <https://builds.apache.org/job/POI-DSL-1.8/ws/build/findbugs/lib/spotbugs-annotations.jar>
      [get] Getting: https://repo1.maven.org/maven2/org/dom4j/dom4j/2.1.1/dom4j-2.1.1.jar
      [get] To: <https://builds.apache.org/job/POI-DSL-1.8/ws/build/findbugs/lib/dom4j-2.1.1.jar>
      [get] Getting: https://repo1.maven.org/maven2/jaxen/jaxen/1.1.6/jaxen-1.1.6.jar
      [get] To: <https://builds.apache.org/job/POI-DSL-1.8/ws/build/findbugs/lib/jaxen-1.1.6.jar>
      [get] Getting: https://repo1.maven.org/maven2/org/apache/bcel/bcel/6.4.1/bcel-6.4.1.jar
      [get] To: <https://builds.apache.org/job/POI-DSL-1.8/ws/build/findbugs/lib/bcel-6.4.1.jar>
      [get] Getting: https://repo1.maven.org/maven2/org/slf4j/slf4j-api/1.8.0-beta4/slf4j-api-1.8.0-beta4.jar
      [get] To: <https://builds.apache.org/job/POI-DSL-1.8/ws/build/findbugs/lib/slf4j-api-1.8.0-beta4.jar>
      [get] Getting: https://repo1.maven.org/maven2/org/apache/commons/commons-lang3/3.10/commons-lang3-3.10.jar
      [get] To: <https://builds.apache.org/job/POI-DSL-1.8/ws/build/findbugs/lib/commons-lang3-3.10.jar>
      [get] Getting: https://repo1.maven.org/maven2/org/apache/commons/commons-text/1.8/commons-text-1.8.jar
      [get] To: <https://builds.apache.org/job/POI-DSL-1.8/ws/build/findbugs/lib/commons-text-1.8.jar>
      [get] Getting: https://repo1.maven.org/maven2/net/jcip/jcip-annotations/1.0/jcip-annotations-1.0.jar
      [get] To: <https://builds.apache.org/job/POI-DSL-1.8/ws/build/findbugs/lib/jcip-annotations-1.0.jar>
      [get] Getting: https://repo1.maven.org/maven2/com/google/code/findbugs/jsr305/3.0.2/jsr305-3.0.2.jar
      [get] To: <https://builds.apache.org/job/POI-DSL-1.8/ws/build/findbugs/lib/jsr305-3.0.2.jar>
      [get] Getting: https://repo1.maven.org/maven2/org/ow2/asm/asm/8.0.1/asm-8.0.1.jar
      [get] To: <https://builds.apache.org/job/POI-DSL-1.8/ws/build/findbugs/lib/asm-8.0.1.jar>
      [get] Getting: https://repo1.maven.org/maven2/org/ow2/asm/asm-analysis/8.0.1/asm-analysis-8.0.1.jar
      [get] To: <https://builds.apache.org/job/POI-DSL-1.8/ws/build/findbugs/lib/asm-analysis-8.0.1.jar>
      [get] Getting: https://repo1.maven.org/maven2/org/ow2/asm/asm-commons/8.0.1/asm-commons-8.0.1.jar
      [get] To: <https://builds.apache.org/job/POI-DSL-1.8/ws/build/findbugs/lib/asm-commons-8.0.1.jar>
      [get] Getting: https://repo1.maven.org/maven2/org/ow2/asm/asm-tree/8.0.1/asm-tree-8.0.1.jar
      [get] To: <https://builds.apache.org/job/POI-DSL-1.8/ws/build/findbugs/lib/asm-tree-8.0.1.jar>
      [get] Getting: https://repo1.maven.org/maven2/org/ow2/asm/asm-util/8.0.1/asm-util-8.0.1.jar
      [get] To: <https://builds.apache.org/job/POI-DSL-1.8/ws/build/findbugs/lib/asm-util-8.0.1.jar>
      [get] Getting: https://repo1.maven.org/maven2/org/apache/logging/log4j/log4j-api/2.13.1/log4j-api-2.13.1.jar
      [get] To: <https://builds.apache.org/job/POI-DSL-1.8/ws/build/findbugs/lib/log4j-api-2.13.1.jar>
      [get] Getting: https://repo1.maven.org/maven2/org/apache/logging/log4j/log4j-core/2.13.1/log4j-core-2.13.1.jar
      [get] To: <https://builds.apache.org/job/POI-DSL-1.8/ws/build/findbugs/lib/log4j-core-2.13.1.jar>
      [get] Getting: https://repo1.maven.org/maven2/org/apache/logging/log4j/log4j-slf4j18-impl/2.13.1/log4j-slf4j18-impl-2.13.1.jar
      [get] To: <https://builds.apache.org/job/POI-DSL-1.8/ws/build/findbugs/lib/log4j-slf4j18-impl-2.13.1.jar>
      [get] Getting: https://repo1.maven.org/maven2/net/sf/saxon/Saxon-HE/9.9.1-2/Saxon-HE-9.9.1-2.jar
      [get] To: <https://builds.apache.org/job/POI-DSL-1.8/ws/build/findbugs/lib/Saxon-HE-9.9.1-2.jar>
      [get] Getting: https://repo1.maven.org/maven2/com/ibm/icu/icu4j/63.2/icu4j-63.2.jar
      [get] To: <https://builds.apache.org/job/POI-DSL-1.8/ws/build/findbugs/lib/icu4j-63.1.jar>
 [spotbugs] Executing SpotBugs FindBugsTask from ant task
 [spotbugs] Running SpotBugs...
 [spotbugs] Java Result: 1
 [spotbugs] Output saved to build/findbugs.xml
     [xslt] Transforming into <https://builds.apache.org/job/POI-DSL-1.8/ws/build>
     [xslt] Processing <https://builds.apache.org/job/POI-DSL-1.8/ws/build/findbugs.xml> to <https://builds.apache.org/job/POI-DSL-1.8/1044/artifact/build/findbugs.html>
     [xslt] Loading stylesheet jar:<https://builds.apache.org/job/POI-DSL-1.8/ws/build/findbugs/lib/spotbugs.jar!/fancy.xsl>

release-notes:
     [copy] Copying 1 file to <https://builds.apache.org/job/POI-DSL-1.8/ws/build/dist>

rat-check:
    [mkdir] Created dir: <https://builds.apache.org/job/POI-DSL-1.8/ws/build/rat>
     [echo]
     [echo] *****************************************************
     [echo] Summary
     [echo] -------
     [echo] Generated at: 2020-07-23T08:20:50+00:00
     [echo]
     [echo] Notes: 0
     [echo] Binaries: 114
     [echo] Archives: 0
     [echo] Standards: 3763
     [echo]
     [echo] Apache Licensed: 3763
     [echo] Generated Documents: 0
     [echo]
     [echo] JavaDocs are generated, thus a license header is optional.
     [echo] Generated files do not require license headers.
     [echo]
     [echo] 0 Unknown Licenses
     [echo]
     [echo] *****************************************************
     [echo]   Files with Apache License headers will be marked AL
     [echo]   Binary files (which do not require any license headers) will be marked B
     [echo]   Compressed archives will be marked A
     [echo]   Notices, licenses etc. will be marked N
     [echo]  
     [echo] *****************************************************

forbidden-apis-check:
[forbiddenapis] Reading bundled API signatures: jdk-unsafe-1.8
[forbiddenapis] Reading bundled API signatures: jdk-deprecated-1.8
[forbiddenapis] Reading bundled API signatures: jdk-internal-1.8
[forbiddenapis] Reading bundled API signatures: jdk-non-portable
[forbiddenapis] Reading bundled API signatures: jdk-reflection
[forbiddenapis] Reading API signatures: <https://builds.apache.org/job/POI-DSL-1.8/ws/src/resources/devtools/forbidden-signatures.txt>
[forbiddenapis] Loading classes to check...
[forbiddenapis] Scanning classes for violations...
[forbiddenapis] Scanned 4432 class file(s) for forbidden API invocations (in 217.22s), 0 error(s).
[forbiddenapis] Reading API signatures: <https://builds.apache.org/job/POI-DSL-1.8/ws/src/resources/devtools/forbidden-signatures-prod.txt>
[forbiddenapis] Loading classes to check...
[forbiddenapis] Scanning classes for violations...
[forbiddenapis] Scanned 3514 class file(s) for forbidden API invocations (in 120.15s), 0 error(s).

integration-test-jar:

BUILD FAILED
<https://builds.apache.org/job/POI-DSL-1.8/ws/build.xml>:1969: required attribute module not set

Total time: 59 minutes 50 seconds
Build step 'Invoke Ant' marked build as failure
Skipping publisher since build result is FAILURE
Archiving artifacts
[Fast Archiver] Compressed 219.30 MB of artifacts by 27.2% relative to #1040
Skipping publisher since build result is FAILURE
Recording test results

---------------------------------------------------------------------
To unsubscribe, e-mail: [hidden email]
For additional commands, e-mail: [hidden email]

Reply | Threaded
Open this post in threaded view
|

Build failed in Jenkins: POI-DSL-1.8 #1045

Apache Jenkins Server
See <https://builds.apache.org/job/POI-DSL-1.8/1045/display/redirect?page=changes>

Changes:

[kiwiwings] a few jigsaw related fixes


------------------------------------------
[...truncated 146.76 KB...]
    [junit] Tests run: 1, Failures: 0, Errors: 0, Skipped: 0, Time elapsed: 0.003 sec
    [junit] Running org.apache.poi.hslf.record.TestUserEditAtom
    [junit] Tests run: 3, Failures: 0, Errors: 0, Skipped: 0, Time elapsed: 0.002 sec
    [junit] Running org.apache.poi.hslf.usermodel.TestAddingSlides
    [junit] Tests run: 5, Failures: 0, Errors: 0, Skipped: 0, Time elapsed: 0.031 sec
    [junit] Running org.apache.poi.hslf.usermodel.TestBackground
    [junit] Tests run: 3, Failures: 0, Errors: 0, Skipped: 0, Time elapsed: 0.012 sec
    [junit] Running org.apache.poi.hslf.usermodel.TestBugs
    [junit] Tests run: 41, Failures: 0, Errors: 0, Skipped: 0, Time elapsed: 0.842 sec
    [junit] Running org.apache.poi.hslf.usermodel.TestCounts
    [junit] Tests run: 2, Failures: 0, Errors: 0, Skipped: 0, Time elapsed: 0.004 sec
    [junit] Running org.apache.poi.hslf.usermodel.TestFontRendering
    [junit] Tests run: 1, Failures: 0, Errors: 0, Skipped: 1, Time elapsed: 0.005 sec
    [junit] Running org.apache.poi.hslf.usermodel.TestHSLFSlideShow
    [junit] Tests run: 8, Failures: 0, Errors: 0, Skipped: 0, Time elapsed: 0.037 sec
    [junit] Running org.apache.poi.hslf.usermodel.TestHSLFSlideShowFactory
    [junit] Tests run: 1, Failures: 0, Errors: 0, Skipped: 0, Time elapsed: 0.012 sec
    [junit] Running org.apache.poi.hslf.usermodel.TestMostRecentRecords
    [junit] Tests run: 3, Failures: 0, Errors: 0, Skipped: 0, Time elapsed: 0.007 sec
    [junit] Running org.apache.poi.hslf.usermodel.TestNotesText
    [junit] Tests run: 2, Failures: 0, Errors: 0, Skipped: 0, Time elapsed: 0.005 sec
    [junit] Running org.apache.poi.hslf.usermodel.TestNumberedList
    [junit] Tests run: 1, Failures: 0, Errors: 0, Skipped: 0, Time elapsed: 0.014 sec
    [junit] Running org.apache.poi.hslf.usermodel.TestNumberedList2
    [junit] Tests run: 1, Failures: 0, Errors: 0, Skipped: 0, Time elapsed: 0.005 sec
    [junit] Running org.apache.poi.hslf.usermodel.TestNumberedList3
    [junit] Tests run: 1, Failures: 0, Errors: 0, Skipped: 0, Time elapsed: 0.004 sec
    [junit] Running org.apache.poi.hslf.usermodel.TestPicture
    [junit] Tests run: 4, Failures: 0, Errors: 0, Skipped: 1, Time elapsed: 0.057 sec
    [junit] Running org.apache.poi.hslf.usermodel.TestPictures
    [junit] Tests run: 11, Failures: 0, Errors: 0, Skipped: 1, Time elapsed: 0.065 sec
    [junit] Running org.apache.poi.hslf.usermodel.TestReOrderingSlides
    [junit] Tests run: 5, Failures: 0, Errors: 0, Skipped: 0, Time elapsed: 0.021 sec
    [junit] Running org.apache.poi.hslf.usermodel.TestRecordSetup
    [junit] Tests run: 1, Failures: 0, Errors: 0, Skipped: 0, Time elapsed: 0.002 sec
    [junit] Running org.apache.poi.hslf.usermodel.TestRichTextRun
    [junit] Tests run: 11, Failures: 0, Errors: 0, Skipped: 0, Time elapsed: 0.187 sec
    [junit] Running org.apache.poi.hslf.usermodel.TestSheetText
    [junit] Tests run: 1, Failures: 0, Errors: 0, Skipped: 0, Time elapsed: 0.003 sec
    [junit] Running org.apache.poi.hslf.usermodel.TestSlideOrdering
    [junit] Tests run: 3, Failures: 0, Errors: 0, Skipped: 0, Time elapsed: 0.012 sec
    [junit] Running org.apache.poi.hslf.usermodel.TestSoundData
    [junit] Tests run: 1, Failures: 0, Errors: 0, Skipped: 0, Time elapsed: 0.003 sec
    [junit] Running org.apache.poi.hslf.usermodel.TestTable
    [junit] Tests run: 3, Failures: 0, Errors: 0, Skipped: 0, Time elapsed: 0.046 sec
    [junit] Running org.apache.poi.hslf.usermodel.TestTextRun
    [junit] Tests run: 14, Failures: 0, Errors: 0, Skipped: 0, Time elapsed: 0.039 sec
    [junit] Running org.apache.poi.hslf.usermodel.TestTextShape
    [junit] Tests run: 6, Failures: 0, Errors: 0, Skipped: 0, Time elapsed: 0.02 sec
    [junit] Running org.apache.poi.hslf.util.TestSystemTimeUtils
    [junit] Tests run: 4, Failures: 0, Errors: 0, Skipped: 0, Time elapsed: 0.003 sec
    [junit] Running org.apache.poi.hsmf.Test7BitCodepage
    [junit] Tests run: 1, Failures: 0, Errors: 0, Skipped: 0, Time elapsed: 0.089 sec
    [junit] Running org.apache.poi.hsmf.TestBasics
    [junit] Tests run: 9, Failures: 0, Errors: 0, Skipped: 0, Time elapsed: 0.263 sec
    [junit] Running org.apache.poi.hsmf.TestBlankFileRead
    [junit] Tests run: 7, Failures: 0, Errors: 0, Skipped: 0, Time elapsed: 0.014 sec
    [junit] Running org.apache.poi.hsmf.TestExtractEmbeddedMSG
    [junit] Tests run: 1, Failures: 0, Errors: 0, Skipped: 0, Time elapsed: 0.013 sec
    [junit] Running org.apache.poi.hsmf.TestFileWithAttachmentsRead
    [junit] Tests run: 4, Failures: 0, Errors: 0, Skipped: 0, Time elapsed: 0.018 sec
    [junit] Running org.apache.poi.hsmf.TestFixedSizedProperties
    [junit] Tests run: 8, Failures: 0, Errors: 0, Skipped: 0, Time elapsed: 0.087 sec
    [junit] Running org.apache.poi.hsmf.TestMessageSubmissionChunk
    [junit] Tests run: 2, Failures: 0, Errors: 0, Skipped: 0, Time elapsed: 0.011 sec
    [junit] Running org.apache.poi.hsmf.TestMessageSubmissionChunkY2KRead
    [junit] Tests run: 3, Failures: 0, Errors: 0, Skipped: 0, Time elapsed: 0.02 sec
    [junit] Running org.apache.poi.hsmf.TestNameIdChunks
    [junit] Tests run: 2, Failures: 0, Errors: 0, Skipped: 0, Time elapsed: 0.026 sec
    [junit] Running org.apache.poi.hsmf.TestOutlook30FileRead
    [junit] Tests run: 9, Failures: 0, Errors: 0, Skipped: 0, Time elapsed: 0.063 sec
    [junit] Running org.apache.poi.hsmf.TestSimpleFileRead
    [junit] Tests run: 9, Failures: 0, Errors: 0, Skipped: 0, Time elapsed: 0.032 sec
    [junit] Running org.apache.poi.hsmf.datatypes.TestChunkData
    [junit] Tests run: 6, Failures: 0, Errors: 0, Skipped: 0, Time elapsed: 0.002 sec
    [junit] Running org.apache.poi.hsmf.datatypes.TestMAPIProperty
    [junit] Tests run: 3, Failures: 0, Errors: 0, Skipped: 0, Time elapsed: 0.001 sec
    [junit] Running org.apache.poi.hsmf.datatypes.TestSorters
    [junit] Tests run: 2, Failures: 0, Errors: 0, Skipped: 0, Time elapsed: 0.002 sec
    [junit] Running org.apache.poi.hsmf.datatypes.TestTypes
    [junit] Tests run: 3, Failures: 0, Errors: 0, Skipped: 0, Time elapsed: 0.002 sec
    [junit] Running org.apache.poi.hsmf.extractor.TestOutlookTextExtractor
    [junit] Tests run: 9, Failures: 0, Errors: 0, Skipped: 0, Time elapsed: 0.16 sec
    [junit] Running org.apache.poi.hsmf.parsers.TestPOIFSChunkParser
    [junit] Tests run: 6, Failures: 0, Errors: 0, Skipped: 0, Time elapsed: 0.082 sec
    [junit] Running org.apache.poi.hssf.converter.TestExcelConverterSuite
    [junit] Tests run: 778, Failures: 0, Errors: 0, Skipped: 0, Time elapsed: 15.215 sec
    [junit] Running org.apache.poi.hwmf.TestHwmfParsing
    [junit] Tests run: 5, Failures: 0, Errors: 0, Skipped: 1, Time elapsed: 0.044 sec
    [junit] Running org.apache.poi.hwpf.TestFieldsTables
    [junit] Tests run: 1, Failures: 0, Errors: 0, Skipped: 0, Time elapsed: 0.018 sec
    [junit] Running org.apache.poi.hwpf.TestHWPFPictures
    [junit] Tests run: 6, Failures: 0, Errors: 0, Skipped: 0, Time elapsed: 0.137 sec
    [junit] Running org.apache.poi.hwpf.TestHWPFRangeParts
    [junit] Tests run: 2, Failures: 0, Errors: 0, Skipped: 0, Time elapsed: 0.026 sec
    [junit] Running org.apache.poi.hwpf.converter.TestNumberFormatter
    [junit] Tests run: 2, Failures: 0, Errors: 0, Skipped: 0, Time elapsed: 0.093 sec
    [junit] Running org.apache.poi.hwpf.converter.TestWordToConverterSuite
    [junit] Tests run: 411, Failures: 0, Errors: 0, Skipped: 0, Time elapsed: 5.2 sec
    [junit] Running org.apache.poi.hwpf.converter.TestWordToFoConverter
    [junit] Tests run: 8, Failures: 0, Errors: 0, Skipped: 0, Time elapsed: 0.011 sec
    [junit] Running org.apache.poi.hwpf.converter.TestWordToHtmlConverter
    [junit] Tests run: 21, Failures: 0, Errors: 0, Skipped: 0, Time elapsed: 0.108 sec
    [junit] Running org.apache.poi.hwpf.converter.TestWordToTextConverter
    [junit] Tests run: 3, Failures: 0, Errors: 0, Skipped: 0, Time elapsed: 0.048 sec
    [junit] Running org.apache.poi.hwpf.dev.TestHWPFLister
    [junit] Tests run: 2, Failures: 0, Errors: 0, Skipped: 0, Time elapsed: 0.026 sec
    [junit] Running org.apache.poi.hwpf.extractor.TestDifferentRoutes
    [junit] Tests run: 2, Failures: 0, Errors: 0, Skipped: 0, Time elapsed: 0.002 sec
    [junit] Running org.apache.poi.hwpf.extractor.TestWordExtractor
    [junit] Tests run: 18, Failures: 0, Errors: 0, Skipped: 0, Time elapsed: 0.04 sec
    [junit] Running org.apache.poi.hwpf.extractor.TestWordExtractorBugs
    [junit] Tests run: 3, Failures: 0, Errors: 0, Skipped: 0, Time elapsed: 0.136 sec
    [junit] Running org.apache.poi.hwpf.model.TestBookmarksTables
    [junit] Tests run: 5, Failures: 0, Errors: 0, Skipped: 0, Time elapsed: 0.004 sec
    [junit] Running org.apache.poi.hwpf.model.TestCHPBinTable
    [junit] Tests run: 1, Failures: 0, Errors: 0, Skipped: 0, Time elapsed: 0.001 sec
    [junit] Running org.apache.poi.hwpf.model.TestDocumentProperties
    [junit] Tests run: 1, Failures: 0, Errors: 0, Skipped: 0, Time elapsed: 0.005 sec
    [junit] Running org.apache.poi.hwpf.model.TestFileInformationBlock
    [junit] Tests run: 1, Failures: 0, Errors: 0, Skipped: 0, Time elapsed: 0.001 sec
    [junit] Running org.apache.poi.hwpf.model.TestFontTable
    [junit] Tests run: 1, Failures: 0, Errors: 0, Skipped: 0, Time elapsed: 0.001 sec
    [junit] Running org.apache.poi.hwpf.model.TestListTables
    [junit] Tests run: 1, Failures: 0, Errors: 0, Skipped: 0, Time elapsed: 0.001 sec
    [junit] Running org.apache.poi.hwpf.model.TestNotesTables
    [junit] Tests run: 1, Failures: 0, Errors: 0, Skipped: 0, Time elapsed: 0.001 sec
    [junit] Running org.apache.poi.hwpf.model.TestPAPBinTable
    [junit] Tests run: 2, Failures: 0, Errors: 0, Skipped: 0, Time elapsed: 0.006 sec
    [junit] Running org.apache.poi.hwpf.model.TestPlexOfCps
    [junit] Tests run: 1, Failures: 0, Errors: 0, Skipped: 0, Time elapsed: 0.001 sec
    [junit] Running org.apache.poi.hwpf.model.TestRevisionMarkAuthorTable
    [junit] Tests run: 3, Failures: 0, Errors: 0, Skipped: 0, Time elapsed: 0.003 sec
    [junit] Running org.apache.poi.hwpf.model.TestSavedByTable
    [junit] Tests run: 1, Failures: 0, Errors: 0, Skipped: 0, Time elapsed: 0.011 sec
    [junit] Running org.apache.poi.hwpf.model.TestSectionTable
    [junit] Tests run: 1, Failures: 0, Errors: 0, Skipped: 0, Time elapsed: 0.001 sec
    [junit] Running org.apache.poi.hwpf.model.TestStyleSheet
    [junit] Tests run: 2, Failures: 0, Errors: 0, Skipped: 0, Time elapsed: 0.001 sec
    [junit] Running org.apache.poi.hwpf.model.TestTextPieceTable
    [junit] Tests run: 4, Failures: 0, Errors: 0, Skipped: 0, Time elapsed: 0.007 sec
    [junit] Running org.apache.poi.hwpf.sprm.TestSprms
    [junit] Tests run: 2, Failures: 0, Errors: 0, Skipped: 0, Time elapsed: 0.005 sec
    [junit] Running org.apache.poi.hwpf.usermodel.TestBorderCode
    [junit] Tests run: 1, Failures: 0, Errors: 0, Skipped: 0, Time elapsed: 0.001 sec
    [junit] Running org.apache.poi.hwpf.usermodel.TestBug46610
    [junit] Tests run: 3, Failures: 0, Errors: 0, Skipped: 0, Time elapsed: 0.007 sec
    [junit] Running org.apache.poi.hwpf.usermodel.TestBug47563
    [junit] Tests run: 8, Failures: 0, Errors: 0, Skipped: 0, Time elapsed: 0.029 sec
    [junit] Running org.apache.poi.hwpf.usermodel.TestBug49820
    [junit] Tests run: 1, Failures: 0, Errors: 0, Skipped: 0, Time elapsed: 0.002 sec
    [junit] Running org.apache.poi.hwpf.usermodel.TestBug50075
    [junit] Tests run: 1, Failures: 0, Errors: 0, Skipped: 0, Time elapsed: 0.001 sec
    [junit] Running org.apache.poi.hwpf.usermodel.TestBugs
    [junit] Tests run: 41, Failures: 0, Errors: 0, Skipped: 0, Time elapsed: 0.466 sec
    [junit] Running org.apache.poi.hwpf.usermodel.TestHWPFOldDocument
    [junit] Tests run: 14, Failures: 0, Errors: 0, Skipped: 0, Time elapsed: 0.05 sec
    [junit] Running org.apache.poi.hwpf.usermodel.TestHWPFWrite
    [junit] Tests run: 5, Failures: 0, Errors: 0, Skipped: 0, Time elapsed: 0.025 sec
    [junit] Running org.apache.poi.hwpf.usermodel.TestHeaderStories
    [junit] Tests run: 8, Failures: 0, Errors: 0, Skipped: 0, Time elapsed: 0.024 sec
    [junit] Running org.apache.poi.hwpf.usermodel.TestLists
    [junit] Tests run: 7, Failures: 0, Errors: 0, Skipped: 0, Time elapsed: 0.009 sec
    [junit] Running org.apache.poi.hwpf.usermodel.TestOfficeDrawings
    [junit] Tests run: 1, Failures: 0, Errors: 0, Skipped: 0, Time elapsed: 0.002 sec
    [junit] Running org.apache.poi.hwpf.usermodel.TestPictures
    [junit] Tests run: 16, Failures: 0, Errors: 0, Skipped: 2, Time elapsed: 0.025 sec
    [junit] Running org.apache.poi.hwpf.usermodel.TestProblems
    [junit] Tests run: 10, Failures: 0, Errors: 0, Skipped: 0, Time elapsed: 0.02 sec
    [junit] Running org.apache.poi.hwpf.usermodel.TestRange
    [junit] Tests run: 2, Failures: 0, Errors: 0, Skipped: 0, Time elapsed: 0.002 sec
    [junit] Running org.apache.poi.hwpf.usermodel.TestRangeDelete
    [junit] Tests run: 4, Failures: 0, Errors: 0, Skipped: 0, Time elapsed: 0.004 sec
    [junit] Running org.apache.poi.hwpf.usermodel.TestRangeInsertion
    [junit] Tests run: 3, Failures: 0, Errors: 0, Skipped: 0, Time elapsed: 0.002 sec
    [junit] Running org.apache.poi.hwpf.usermodel.TestRangeProperties
    [junit] Tests run: 5, Failures: 0, Errors: 0, Skipped: 0, Time elapsed: 0.005 sec
    [junit] Running org.apache.poi.hwpf.usermodel.TestRangeReplacement
    [junit] Tests run: 3, Failures: 0, Errors: 0, Skipped: 0, Time elapsed: 0.002 sec
    [junit] Running org.apache.poi.hwpf.usermodel.TestRangeSymbols
    [junit] Tests run: 2, Failures: 0, Errors: 0, Skipped: 0, Time elapsed: 0.002 sec
    [junit] Running org.apache.poi.hwpf.usermodel.TestTableRow
    [junit] Tests run: 2, Failures: 0, Errors: 0, Skipped: 0, Time elapsed: 0.002 sec

-test-scratchpad-write-testfile:

-test-ooxml-check:

test-ooxml:
[jacoco:coverage] Enhancing junit with coverage
    [junit] Running org.apache.poi.extractor.ooxml.TestExtractorFactory
    [junit] Tests run: 14, Failures: 0, Errors: 0, Skipped: 0, Time elapsed: 4.904 sec
    [junit] Running org.apache.poi.ooxml.TestDetectAsOOXML
    [junit] Tests run: 3, Failures: 0, Errors: 0, Skipped: 0, Time elapsed: 0.016 sec
    [junit] Running org.apache.poi.ooxml.TestEmbedded
    [junit] Tests run: 3, Failures: 0, Errors: 0, Skipped: 0, Time elapsed: 0.654 sec
    [junit] Running org.apache.poi.ooxml.TestPOIXMLDocument
    [junit] Tests run: 11, Failures: 0, Errors: 0, Skipped: 0, Time elapsed: 1.826 sec
    [junit] Running org.apache.poi.ooxml.TestPOIXMLProperties
    [junit] Tests run: 10, Failures: 0, Errors: 0, Skipped: 1, Time elapsed: 0.291 sec
    [junit] Running org.apache.poi.ooxml.TestXMLPropertiesTextExtractor
    [junit] Tests run: 5, Failures: 0, Errors: 0, Skipped: 0, Time elapsed: 0.126 sec
    [junit] Running org.apache.poi.openxml4j.opc.TestContentType
    [junit] Tests run: 7, Failures: 0, Errors: 0, Skipped: 0, Time elapsed: 0.061 sec
    [junit] Running org.apache.poi.openxml4j.opc.TestFileHelper
    [junit] Tests run: 1, Failures: 0, Errors: 0, Skipped: 0, Time elapsed: 0.002 sec
    [junit] Running org.apache.poi.openxml4j.opc.TestListParts
    [junit] Tests run: 1, Failures: 0, Errors: 0, Skipped: 0, Time elapsed: 0.023 sec
    [junit] Running org.apache.poi.openxml4j.opc.TestPackage
    [junit] Tests run: 46, Failures: 0, Errors: 0, Skipped: 1, Time elapsed: 1.586 sec
    [junit] Running org.apache.poi.openxml4j.opc.TestPackageCoreProperties
    [junit] Tests run: 7, Failures: 0, Errors: 0, Skipped: 0, Time elapsed: 0.078 sec
    [junit] Running org.apache.poi.openxml4j.opc.TestPackagePartName
    [junit] Tests run: 1, Failures: 0, Errors: 0, Skipped: 0, Time elapsed: 0.002 sec
    [junit] Running org.apache.poi.openxml4j.opc.TestPackageThumbnail
    [junit] Tests run: 1, Failures: 0, Errors: 0, Skipped: 0, Time elapsed: 0.015 sec
    [junit] Running org.apache.poi.openxml4j.opc.TestPackagingURIHelper
    [junit] Tests run: 5, Failures: 0, Errors: 0, Skipped: 0, Time elapsed: 0.004 sec
    [junit] Running org.apache.poi.openxml4j.opc.TestRelationships
    [junit] Tests run: 9, Failures: 0, Errors: 0, Skipped: 0, Time elapsed: 0.061 sec
    [junit] Running org.apache.poi.openxml4j.opc.compliance.TestOPCComplianceCoreProperties
    [junit] Tests run: 11, Failures: 0, Errors: 0, Skipped: 0, Time elapsed: 0.076 sec
    [junit] Running org.apache.poi.openxml4j.opc.compliance.TestOPCCompliancePackageModel
    [junit] Tests run: 5, Failures: 0, Errors: 0, Skipped: 0, Time elapsed: 0.007 sec
    [junit] Running org.apache.poi.openxml4j.opc.compliance.TestOPCCompliancePartName
    [junit] Tests run: 10, Failures: 0, Errors: 0, Skipped: 0, Time elapsed: 0.006 sec
    [junit] Running org.apache.poi.openxml4j.opc.internal.TestContentTypeManager
    [junit] Tests run: 5, Failures: 0, Errors: 0, Skipped: 1, Time elapsed: 0.211 sec
    [junit] Running org.apache.poi.openxml4j.opc.internal.marshallers.TestZipPackagePropertiesMarshaller
    [junit] Tests run: 4, Failures: 0, Errors: 0, Skipped: 0, Time elapsed: 0.004 sec
    [junit] Running org.apache.poi.openxml4j.util.TestZipSecureFile
    [junit] Tests run: 1, Failures: 0, Errors: 0, Skipped: 0, Time elapsed: 0.024 sec
    [junit] Running org.apache.poi.poifs.crypt.dsig.TestSignatureConfig
    [junit] Tests run: 2, Failures: 0, Errors: 0, Skipped: 1, Time elapsed: 0.007 sec
    [junit] Running org.apache.poi.poifs.crypt.dsig.TestSignatureInfo
    [junit] Tests run: 14, Failures: 0, Errors: 1, Skipped: 1, Time elapsed: 4.078 sec

BUILD FAILED
<https://builds.apache.org/job/POI-DSL-1.8/ws/build.xml>:1514: The following error occurred while executing this line:
<https://builds.apache.org/job/POI-DSL-1.8/ws/build.xml>:1482: The following error occurred while executing this line:
<https://builds.apache.org/job/POI-DSL-1.8/ws/build.xml>:1110: Tests failed

Total time: 8 minutes 6 seconds
Build step 'Invoke Ant' marked build as failure
Skipping publisher since build result is FAILURE
Archiving artifacts
[Fast Archiver] Compressed 3.04 MB of artifacts by 22.6% relative to #1040
Skipping publisher since build result is FAILURE
Recording test results

---------------------------------------------------------------------
To unsubscribe, e-mail: [hidden email]
For additional commands, e-mail: [hidden email]

Reply | Threaded
Open this post in threaded view
|

Build failed in Jenkins: POI-DSL-1.8 #1046

Apache Jenkins Server
See <https://builds.apache.org/job/POI-DSL-1.8/1046/display/redirect?page=changes>

Changes:

[kiwiwings] remove obsolete bouncycastle jars


------------------------------------------
[...truncated 951.95 KB...]
    [javac]   location: class TableDemo
    [javac] <https://builds.apache.org/job/POI-DSL-1.8/ws/src/examples/src/org/apache/poi/examples/hslf/TableDemo.java>:98: error: cannot find symbol
    [javac]     static void create2ndTable(HSLFSlide slide) {
    [javac]                                ^
    [javac]   symbol:   class HSLFSlide
    [javac]   location: class TableDemo
    [javac] <https://builds.apache.org/job/POI-DSL-1.8/ws/src/examples/src/org/apache/poi/examples/hsmf/Msg2txt.java>:26: error: package org.apache.poi.hsmf does not exist
    [javac] import org.apache.poi.hsmf.MAPIMessage;
    [javac]                           ^
    [javac] <https://builds.apache.org/job/POI-DSL-1.8/ws/src/examples/src/org/apache/poi/examples/hsmf/Msg2txt.java>:27: error: package org.apache.poi.hsmf.datatypes does not exist
    [javac] import org.apache.poi.hsmf.datatypes.AttachmentChunks;
    [javac]                                     ^
    [javac] <https://builds.apache.org/job/POI-DSL-1.8/ws/src/examples/src/org/apache/poi/examples/hsmf/Msg2txt.java>:28: error: package org.apache.poi.hsmf.exceptions does not exist
    [javac] import org.apache.poi.hsmf.exceptions.ChunkNotFoundException;
    [javac]                                      ^
    [javac] <https://builds.apache.org/job/POI-DSL-1.8/ws/src/examples/src/org/apache/poi/examples/hsmf/Msg2txt.java>:47: error: cannot find symbol
    [javac] private MAPIMessage msg;
    [javac]        ^
    [javac]   symbol:   class MAPIMessage
    [javac]   location: class Msg2txt
    [javac] <https://builds.apache.org/job/POI-DSL-1.8/ws/src/examples/src/org/apache/poi/examples/hsmf/Msg2txt.java>:125: error: cannot find symbol
    [javac] public void processAttachment(AttachmentChunks attachment,
    [javac]                              ^
    [javac]   symbol:   class AttachmentChunks
    [javac]   location: class Msg2txt
    [javac] <https://builds.apache.org/job/POI-DSL-1.8/ws/src/examples/src/org/apache/poi/examples/hslf/ApacheconEU08.java>:58: error: cannot find symbol
    [javac]         try (SlideShow<?,?> ppt = new HSLFSlideShow()) {
    [javac]                                       ^
    [javac]   symbol:   class HSLFSlideShow
    [javac]   location: class ApacheconEU08
    [javac] <https://builds.apache.org/job/POI-DSL-1.8/ws/src/examples/src/org/apache/poi/examples/hslf/BulletsDemo.java>:35: error: cannot find symbol
    [javac]         try (HSLFSlideShow ppt = new HSLFSlideShow()) {
    [javac]              ^
    [javac]   symbol:   class HSLFSlideShow
    [javac]   location: class BulletsDemo
    [javac] <https://builds.apache.org/job/POI-DSL-1.8/ws/src/examples/src/org/apache/poi/examples/hslf/BulletsDemo.java>:35: error: cannot find symbol
    [javac]         try (HSLFSlideShow ppt = new HSLFSlideShow()) {
    [javac]                                      ^
    [javac]   symbol:   class HSLFSlideShow
    [javac]   location: class BulletsDemo
    [javac] <https://builds.apache.org/job/POI-DSL-1.8/ws/src/examples/src/org/apache/poi/examples/hslf/BulletsDemo.java>:36: error: cannot find symbol
    [javac]             HSLFSlide slide = ppt.createSlide();
    [javac]             ^
    [javac]   symbol:   class HSLFSlide
    [javac]   location: class BulletsDemo
    [javac] <https://builds.apache.org/job/POI-DSL-1.8/ws/src/examples/src/org/apache/poi/examples/hslf/BulletsDemo.java>:38: error: cannot find symbol
    [javac]             HSLFTextBox shape = new HSLFTextBox();
    [javac]             ^
    [javac]   symbol:   class HSLFTextBox
    [javac]   location: class BulletsDemo
    [javac] <https://builds.apache.org/job/POI-DSL-1.8/ws/src/examples/src/org/apache/poi/examples/hslf/BulletsDemo.java>:38: error: cannot find symbol
    [javac]             HSLFTextBox shape = new HSLFTextBox();
    [javac]                                     ^
    [javac]   symbol:   class HSLFTextBox
    [javac]   location: class BulletsDemo
    [javac] <https://builds.apache.org/job/POI-DSL-1.8/ws/src/examples/src/org/apache/poi/examples/hslf/BulletsDemo.java>:39: error: cannot find symbol
    [javac]             HSLFTextParagraph rt = shape.getTextParagraphs().get(0);
    [javac]             ^
    [javac]   symbol:   class HSLFTextParagraph
    [javac]   location: class BulletsDemo
    [javac] <https://builds.apache.org/job/POI-DSL-1.8/ws/src/examples/src/org/apache/poi/examples/hslf/CreateHyperlink.java>:37: error: cannot find symbol
    [javac]         try (HSLFSlideShow ppt = new HSLFSlideShow()) {
    [javac]              ^
    [javac]   symbol:   class HSLFSlideShow
    [javac]   location: class CreateHyperlink
    [javac] <https://builds.apache.org/job/POI-DSL-1.8/ws/src/examples/src/org/apache/poi/examples/hslf/CreateHyperlink.java>:37: error: cannot find symbol
    [javac]         try (HSLFSlideShow ppt = new HSLFSlideShow()) {
    [javac]                                      ^
    [javac]   symbol:   class HSLFSlideShow
    [javac]   location: class CreateHyperlink
    [javac] <https://builds.apache.org/job/POI-DSL-1.8/ws/src/examples/src/org/apache/poi/examples/hslf/CreateHyperlink.java>:38: error: cannot find symbol
    [javac]             HSLFSlide slideA = ppt.createSlide();
    [javac]             ^
    [javac]   symbol:   class HSLFSlide
    [javac]   location: class CreateHyperlink
    [javac] <https://builds.apache.org/job/POI-DSL-1.8/ws/src/examples/src/org/apache/poi/examples/hslf/CreateHyperlink.java>:40: error: cannot find symbol
    [javac]             HSLFSlide slideC = ppt.createSlide();
    [javac]             ^
    [javac]   symbol:   class HSLFSlide
    [javac]   location: class CreateHyperlink
    [javac] <https://builds.apache.org/job/POI-DSL-1.8/ws/src/examples/src/org/apache/poi/examples/hslf/CreateHyperlink.java>:43: error: cannot find symbol
    [javac]             HSLFTextBox textBox1 = slideA.createTextBox();
    [javac]             ^
    [javac]   symbol:   class HSLFTextBox
    [javac]   location: class CreateHyperlink
    [javac] <https://builds.apache.org/job/POI-DSL-1.8/ws/src/examples/src/org/apache/poi/examples/hslf/CreateHyperlink.java>:47: error: cannot find symbol
    [javac]             HSLFHyperlink link1 = textBox1.getTextParagraphs().get(0).getTextRuns().get(0).createHyperlink();
    [javac]             ^
    [javac]   symbol:   class HSLFHyperlink
    [javac]   location: class CreateHyperlink
    [javac] <https://builds.apache.org/job/POI-DSL-1.8/ws/src/examples/src/org/apache/poi/examples/hslf/CreateHyperlink.java>:52: error: cannot find symbol
    [javac]             HSLFTextBox textBox2 = slideA.createTextBox();
    [javac]             ^
    [javac]   symbol:   class HSLFTextBox
    [javac]   location: class CreateHyperlink
    [javac] <https://builds.apache.org/job/POI-DSL-1.8/ws/src/examples/src/org/apache/poi/examples/hslf/CreateHyperlink.java>:56: error: cannot find symbol
    [javac]             HSLFHyperlink link2 = textBox2.getTextParagraphs().get(0).getTextRuns().get(0).createHyperlink();
    [javac]             ^
    [javac]   symbol:   class HSLFHyperlink
    [javac]   location: class CreateHyperlink
    [javac] <https://builds.apache.org/job/POI-DSL-1.8/ws/src/examples/src/org/apache/poi/examples/hslf/DataExtraction.java>:55: error: cannot find symbol
    [javac]             HSLFSlideShow ppt = new HSLFSlideShow(fis)) {
    [javac]             ^
    [javac]   symbol:   class HSLFSlideShow
    [javac]   location: class DataExtraction
    [javac] <https://builds.apache.org/job/POI-DSL-1.8/ws/src/examples/src/org/apache/poi/examples/hslf/DataExtraction.java>:55: error: cannot find symbol
    [javac]             HSLFSlideShow ppt = new HSLFSlideShow(fis)) {
    [javac]                                     ^
    [javac]   symbol:   class HSLFSlideShow
    [javac]   location: class DataExtraction
    [javac] <https://builds.apache.org/job/POI-DSL-1.8/ws/src/examples/src/org/apache/poi/examples/hslf/DataExtraction.java>:58: error: cannot find symbol
    [javac]             HSLFSoundData[] sound = ppt.getSoundData();
    [javac]             ^
    [javac]   symbol:   class HSLFSoundData
    [javac]   location: class DataExtraction
    [javac] <https://builds.apache.org/job/POI-DSL-1.8/ws/src/examples/src/org/apache/poi/examples/hslf/DataExtraction.java>:59: error: cannot find symbol
    [javac]             for (HSLFSoundData aSound : sound) {
    [javac]                  ^
    [javac]   symbol:   class HSLFSoundData
    [javac]   location: class DataExtraction
    [javac] <https://builds.apache.org/job/POI-DSL-1.8/ws/src/examples/src/org/apache/poi/examples/hslf/DataExtraction.java>:65: error: cannot find symbol
    [javac]             for (HSLFSlide slide : ppt.getSlides()) {
    [javac]                  ^
    [javac]   symbol:   class HSLFSlide
    [javac]   location: class DataExtraction
    [javac] <https://builds.apache.org/job/POI-DSL-1.8/ws/src/examples/src/org/apache/poi/examples/hslf/DataExtraction.java>:67: error: cannot find symbol
    [javac]                 for (HSLFShape shape : slide.getShapes()) {
    [javac]                      ^
    [javac]   symbol:   class HSLFShape
    [javac]   location: class DataExtraction
    [javac] <https://builds.apache.org/job/POI-DSL-1.8/ws/src/examples/src/org/apache/poi/examples/hslf/DataExtraction.java>:68: error: cannot find symbol
    [javac]                     if (shape instanceof HSLFObjectShape) {
    [javac]                                          ^
    [javac]   symbol:   class HSLFObjectShape
    [javac]   location: class DataExtraction
    [javac] <https://builds.apache.org/job/POI-DSL-1.8/ws/src/examples/src/org/apache/poi/examples/hslf/DataExtraction.java>:69: error: cannot find symbol
    [javac]                         handleShape((HSLFObjectShape) shape, ++oleIdx);
    [javac]                                      ^
    [javac]   symbol:   class HSLFObjectShape
    [javac]   location: class DataExtraction
    [javac] <https://builds.apache.org/job/POI-DSL-1.8/ws/src/examples/src/org/apache/poi/examples/hslf/DataExtraction.java>:70: error: cannot find symbol
    [javac]                     } else if (shape instanceof HSLFPictureShape) {
    [javac]                                                 ^
    [javac]   symbol:   class HSLFPictureShape
    [javac]   location: class DataExtraction
    [javac] <https://builds.apache.org/job/POI-DSL-1.8/ws/src/examples/src/org/apache/poi/examples/hslf/DataExtraction.java>:71: error: cannot find symbol
    [javac]                         handlePicture((HSLFPictureShape) shape, ++picIdx);
    [javac]                                        ^
    [javac]   symbol:   class HSLFPictureShape
    [javac]   location: class DataExtraction
    [javac] <https://builds.apache.org/job/POI-DSL-1.8/ws/src/examples/src/org/apache/poi/examples/hslf/DataExtraction.java>:79: error: cannot find symbol
    [javac]         HSLFObjectData data = ole.getObjectData();
    [javac]         ^
    [javac]   symbol:   class HSLFObjectData
    [javac]   location: class DataExtraction
    [javac] <https://builds.apache.org/job/POI-DSL-1.8/ws/src/examples/src/org/apache/poi/examples/hslf/DataExtraction.java>:107: error: cannot find symbol
    [javac]              HWPFDocument doc = new HWPFDocument(is);
    [javac]              ^
    [javac]   symbol:   class HWPFDocument
    [javac]   location: class DataExtraction
    [javac] <https://builds.apache.org/job/POI-DSL-1.8/ws/src/examples/src/org/apache/poi/examples/hslf/DataExtraction.java>:107: error: cannot find symbol
    [javac]              HWPFDocument doc = new HWPFDocument(is);
    [javac]                                     ^
    [javac]   symbol:   class HWPFDocument
    [javac]   location: class DataExtraction
    [javac] <https://builds.apache.org/job/POI-DSL-1.8/ws/src/examples/src/org/apache/poi/examples/hslf/DataExtraction.java>:109: error: cannot find symbol
    [javac]             Range r = doc.getRange();
    [javac]             ^
    [javac]   symbol:   class Range
    [javac]   location: class DataExtraction
    [javac] <https://builds.apache.org/job/POI-DSL-1.8/ws/src/examples/src/org/apache/poi/examples/hslf/DataExtraction.java>:111: error: cannot find symbol
    [javac]                 Paragraph p = r.getParagraph(k);
    [javac]                 ^
    [javac]   symbol:   class Paragraph
    [javac]   location: class DataExtraction
    [javac] <https://builds.apache.org/job/POI-DSL-1.8/ws/src/examples/src/org/apache/poi/examples/hslf/DataExtraction.java>:128: error: cannot find symbol
    [javac]         HSLFPictureData data = p.getPictureData();
    [javac]         ^
    [javac]   symbol:   class HSLFPictureData
    [javac]   location: class DataExtraction
    [javac] <https://builds.apache.org/job/POI-DSL-1.8/ws/src/examples/src/org/apache/poi/examples/hslf/Graphics2DDemo.java>:42: error: cannot find symbol
    [javac]         try (HSLFSlideShow ppt = new HSLFSlideShow();
    [javac]              ^
    [javac]   symbol:   class HSLFSlideShow
    [javac]   location: class Graphics2DDemo
    [javac] <https://builds.apache.org/job/POI-DSL-1.8/ws/src/examples/src/org/apache/poi/examples/hslf/Graphics2DDemo.java>:42: error: cannot find symbol
    [javac]         try (HSLFSlideShow ppt = new HSLFSlideShow();
    [javac]                                      ^
    [javac]   symbol:   class HSLFSlideShow
    [javac]   location: class Graphics2DDemo
    [javac] <https://builds.apache.org/job/POI-DSL-1.8/ws/src/examples/src/org/apache/poi/examples/hslf/Graphics2DDemo.java>:52: error: cannot find symbol
    [javac]             HSLFSlide slide = ppt.createSlide();
    [javac]             ^
    [javac]   symbol:   class HSLFSlide
    [javac]   location: class Graphics2DDemo
    [javac] <https://builds.apache.org/job/POI-DSL-1.8/ws/src/examples/src/org/apache/poi/examples/hslf/Graphics2DDemo.java>:54: error: cannot find symbol
    [javac]             HSLFGroupShape group = new HSLFGroupShape();
    [javac]             ^
    [javac]   symbol:   class HSLFGroupShape
    [javac]   location: class Graphics2DDemo
    [javac] <https://builds.apache.org/job/POI-DSL-1.8/ws/src/examples/src/org/apache/poi/examples/hslf/Graphics2DDemo.java>:54: error: cannot find symbol
    [javac]             HSLFGroupShape group = new HSLFGroupShape();
    [javac]                                        ^
    [javac]   symbol:   class HSLFGroupShape
    [javac]   location: class Graphics2DDemo
    [javac] <https://builds.apache.org/job/POI-DSL-1.8/ws/src/examples/src/org/apache/poi/examples/hslf/HeadersFootersDemo.java>:32: error: cannot find symbol
    [javac]         try (HSLFSlideShow ppt = new HSLFSlideShow()) {
    [javac]              ^
    [javac]   symbol:   class HSLFSlideShow
    [javac]   location: class HeadersFootersDemo
    [javac] <https://builds.apache.org/job/POI-DSL-1.8/ws/src/examples/src/org/apache/poi/examples/hslf/HeadersFootersDemo.java>:32: error: cannot find symbol
    [javac]         try (HSLFSlideShow ppt = new HSLFSlideShow()) {
    [javac]                                      ^
    [javac]   symbol:   class HSLFSlideShow
    [javac]   location: class HeadersFootersDemo
    [javac] <https://builds.apache.org/job/POI-DSL-1.8/ws/src/examples/src/org/apache/poi/examples/hslf/HeadersFootersDemo.java>:33: error: cannot find symbol
    [javac]             HeadersFooters slideHeaders = ppt.getSlideHeadersFooters();
    [javac]             ^
    [javac]   symbol:   class HeadersFooters
    [javac]   location: class HeadersFootersDemo
    [javac] <https://builds.apache.org/job/POI-DSL-1.8/ws/src/examples/src/org/apache/poi/examples/hslf/HeadersFootersDemo.java>:38: error: cannot find symbol
    [javac]             HeadersFooters notesHeaders = ppt.getNotesHeadersFooters();
    [javac]             ^
    [javac]   symbol:   class HeadersFooters
    [javac]   location: class HeadersFootersDemo
    [javac] <https://builds.apache.org/job/POI-DSL-1.8/ws/src/examples/src/org/apache/poi/examples/hslf/Hyperlinks.java>:42: error: cannot find symbol
    [javac]                  HSLFSlideShow ppt = new HSLFSlideShow(is)) {
    [javac]                  ^
    [javac]   symbol:   class HSLFSlideShow
    [javac]   location: class Hyperlinks
    [javac] <https://builds.apache.org/job/POI-DSL-1.8/ws/src/examples/src/org/apache/poi/examples/hslf/Hyperlinks.java>:42: error: cannot find symbol
    [javac]                  HSLFSlideShow ppt = new HSLFSlideShow(is)) {
    [javac]                                          ^
    [javac]   symbol:   class HSLFSlideShow
    [javac]   location: class Hyperlinks
    [javac] Note: Some input files use or override a deprecated API.
    [javac] Note: Recompile with -Xlint:deprecation for details.
    [javac] 100 errors

BUILD FAILED
<https://builds.apache.org/job/POI-DSL-1.8/ws/src/integrationtest/build.xml>:122: Compile failed; see the compiler error output for details.

Total time: 7 minutes 49 seconds
Build step 'Invoke Ant' marked build as failure
Skipping publisher since build result is FAILURE
Archiving artifacts
[Fast Archiver] Compressed 219.64 MB of artifacts by 27.1% relative to #1040
Skipping publisher since build result is FAILURE
Recording test results

---------------------------------------------------------------------
To unsubscribe, e-mail: [hidden email]
For additional commands, e-mail: [hidden email]

Reply | Threaded
Open this post in threaded view
|

Build failed in Jenkins: POI-DSL-1.8 #1047

Apache Jenkins Server
See <https://builds.apache.org/job/POI-DSL-1.8/1047/display/redirect?page=changes>

Changes:

[kiwiwings] examples had been moved due to jigsaw modules migration


------------------------------------------
[...truncated 615.28 KB...]
      [get] Destination already exists (skipping): <https://builds.apache.org/job/POI-DSL-1.8/ws/lib/util/maven-ant-tasks-2.1.3.jar>

mvn-install:
[mvn:install] [INFO] Installing <https://builds.apache.org/job/POI-DSL-1.8/ws/build/dist/maven/poi/poi-5.0.0-SNAPSHOT.jar> to /home/jenkins/.m2/repository/org/apache/poi/poi/5.0.0-SNAPSHOT/poi-5.0.0-SNAPSHOT.jar
[mvn:install] [INFO] Installing <https://builds.apache.org/job/POI-DSL-1.8/ws/build/dist/maven/poi-scratchpad/poi-scratchpad-5.0.0-SNAPSHOT.jar> to /home/jenkins/.m2/repository/org/apache/poi/poi-scratchpad/5.0.0-SNAPSHOT/poi-scratchpad-5.0.0-SNAPSHOT.jar
[mvn:install] [INFO] Installing <https://builds.apache.org/job/POI-DSL-1.8/ws/build/dist/maven/poi-ooxml/poi-ooxml-5.0.0-SNAPSHOT.jar> to /home/jenkins/.m2/repository/org/apache/poi/poi-ooxml/5.0.0-SNAPSHOT/poi-ooxml-5.0.0-SNAPSHOT.jar
[mvn:install] [INFO] Installing <https://builds.apache.org/job/POI-DSL-1.8/ws/build/dist/maven/poi-examples/poi-examples-5.0.0-SNAPSHOT.jar> to /home/jenkins/.m2/repository/org/apache/poi/poi-examples/5.0.0-SNAPSHOT/poi-examples-5.0.0-SNAPSHOT.jar
[mvn:install] [INFO] Installing <https://builds.apache.org/job/POI-DSL-1.8/ws/build/dist/maven/poi-ooxml-schemas/poi-ooxml-schemas-5.0.0-SNAPSHOT.jar> to /home/jenkins/.m2/repository/org/apache/poi/poi-ooxml-schemas/5.0.0-SNAPSHOT/poi-ooxml-schemas-5.0.0-SNAPSHOT.jar
[mvn:install] [INFO] Installing <https://builds.apache.org/job/POI-DSL-1.8/ws/build/dist/maven/poi-excelant/poi-excelant-5.0.0-SNAPSHOT.jar> to /home/jenkins/.m2/repository/org/apache/poi/poi-excelant/5.0.0-SNAPSHOT/poi-excelant-5.0.0-SNAPSHOT.jar

jenkins:

BUILD SUCCESSFUL
Total time: 34 minutes 28 seconds
[integrationtest] $ /home/jenkins/tools/ant/latest1.10/bin/ant -file build.xml run
Buildfile: <https://builds.apache.org/job/POI-DSL-1.8/ws/src/integrationtest/build.xml>

init:

runSourceBuild:
    [mkdir] Created dir: <https://builds.apache.org/job/POI-DSL-1.8/ws/build/distsourcebuild>
     [echo] Found source package at <https://builds.apache.org/job/POI-DSL-1.8/ws/build/dist/poi-src-5.0.0-SNAPSHOT-20200724.zip>
    [unzip] Expanding: <https://builds.apache.org/job/POI-DSL-1.8/ws/build/dist/poi-src-5.0.0-SNAPSHOT-20200724.zip> into <https://builds.apache.org/job/POI-DSL-1.8/ws/build/distsourcebuild>
    [mkdir] Created dir: <https://builds.apache.org/job/POI-DSL-1.8/ws/build/distsourcebuild/poi-5.0.0-SNAPSHOT/lib>
     [copy] Copying 56 files to <https://builds.apache.org/job/POI-DSL-1.8/ws/build/distsourcebuild/poi-5.0.0-SNAPSHOT/lib>
     [echo] Building in temporary dir <https://builds.apache.org/job/POI-DSL-1.8/ws/build/distsourcebuild/poi-5.0.0-SNAPSHOT/>

check-jars:

fetch-jars:

check-ooxml-jars:

fetch-ooxml-jars:

init:
    [mkdir] Created dir: <https://builds.apache.org/job/POI-DSL-1.8/ws/build/distsourcebuild/poi-5.0.0-SNAPSHOT/build>
    [mkdir] Created dir: <https://builds.apache.org/job/POI-DSL-1.8/ws/build/distsourcebuild/poi-5.0.0-SNAPSHOT/build/classes>
    [mkdir] Created dir: <https://builds.apache.org/job/POI-DSL-1.8/ws/build/distsourcebuild/poi-5.0.0-SNAPSHOT/build/test-classes>
    [mkdir] Created dir: <https://builds.apache.org/job/POI-DSL-1.8/ws/build/distsourcebuild/poi-5.0.0-SNAPSHOT/build/test-results>
    [mkdir] Created dir: <https://builds.apache.org/job/POI-DSL-1.8/ws/build/distsourcebuild/poi-5.0.0-SNAPSHOT/build/scratchpad-classes>
    [mkdir] Created dir: <https://builds.apache.org/job/POI-DSL-1.8/ws/build/distsourcebuild/poi-5.0.0-SNAPSHOT/build/scratchpad-test-classes>
    [mkdir] Created dir: <https://builds.apache.org/job/POI-DSL-1.8/ws/build/distsourcebuild/poi-5.0.0-SNAPSHOT/build/scratchpad-test-results>
    [mkdir] Created dir: <https://builds.apache.org/job/POI-DSL-1.8/ws/build/distsourcebuild/poi-5.0.0-SNAPSHOT/build/geometry-java>
    [mkdir] Created dir: <https://builds.apache.org/job/POI-DSL-1.8/ws/build/distsourcebuild/poi-5.0.0-SNAPSHOT/build/ooxml-classes>
    [mkdir] Created dir: <https://builds.apache.org/job/POI-DSL-1.8/ws/build/distsourcebuild/poi-5.0.0-SNAPSHOT/build/ooxml-test-classes>
    [mkdir] Created dir: <https://builds.apache.org/job/POI-DSL-1.8/ws/build/distsourcebuild/poi-5.0.0-SNAPSHOT/build/ooxml-test-results>
    [mkdir] Created dir: <https://builds.apache.org/job/POI-DSL-1.8/ws/build/distsourcebuild/poi-5.0.0-SNAPSHOT/build/excelant-classes>
    [mkdir] Created dir: <https://builds.apache.org/job/POI-DSL-1.8/ws/build/distsourcebuild/poi-5.0.0-SNAPSHOT/build/excelant-test-classes>
    [mkdir] Created dir: <https://builds.apache.org/job/POI-DSL-1.8/ws/build/distsourcebuild/poi-5.0.0-SNAPSHOT/build/excelant-test-results>
    [mkdir] Created dir: <https://builds.apache.org/job/POI-DSL-1.8/ws/build/distsourcebuild/poi-5.0.0-SNAPSHOT/build/examples-classes>
    [mkdir] Created dir: <https://builds.apache.org/job/POI-DSL-1.8/ws/build/distsourcebuild/poi-5.0.0-SNAPSHOT/build/integration-test-classes>
    [mkdir] Created dir: <https://builds.apache.org/job/POI-DSL-1.8/ws/build/distsourcebuild/poi-5.0.0-SNAPSHOT/build/integration-test-results>
    [mkdir] Created dir: <https://builds.apache.org/job/POI-DSL-1.8/ws/build/distsourcebuild/poi-5.0.0-SNAPSHOT/build/dist>
    [mkdir] Created dir: <https://builds.apache.org/job/POI-DSL-1.8/ws/build/distsourcebuild/poi-5.0.0-SNAPSHOT/build/site>
     [echo] Using Ant: Apache Ant(TM) version 1.10.7 compiled on September 1 2019 from /home/jenkins/tools/ant/latest1.10, Ant detected Java 1.8 (may be different than actual Java sometimes...)
     [echo] Using Java: 1.8.0_252/1.8.0_252-b09/25.252-b09/OpenJDK 64-Bit Server VM from Oracle Corporation on Linux: 4.15.0-58-generic
     [echo] Building Apache POI version 5.0.0-SNAPSHOT and RC: RC1

-version-java-check:

compile-version:
     [copy] Copying 1 file to <https://builds.apache.org/job/POI-DSL-1.8/ws/build/distsourcebuild/poi-5.0.0-SNAPSHOT/build/classes/org/apache/poi>
    [javac] Compiling 1 source file to <https://builds.apache.org/job/POI-DSL-1.8/ws/build/distsourcebuild/poi-5.0.0-SNAPSHOT/build/classes>
   [delete] Deleting: <https://builds.apache.org/job/POI-DSL-1.8/ws/build/distsourcebuild/poi-5.0.0-SNAPSHOT/build/classes/org/apache/poi/Version.java>

compile-main:
    [javac] Compiling 1174 source files to <https://builds.apache.org/job/POI-DSL-1.8/ws/build/distsourcebuild/poi-5.0.0-SNAPSHOT/build/classes>
    [javac] Support for javac --release has been added in Java9 ignoring it
    [javac] Note: Some input files use or override a deprecated API.
    [javac] Note: Recompile with -Xlint:deprecation for details.
    [javac] Note: Some input files use unchecked or unsafe operations.
    [javac] Note: Recompile with -Xlint:unchecked for details.
    [javac] Creating empty <https://builds.apache.org/job/POI-DSL-1.8/ws/build/distsourcebuild/poi-5.0.0-SNAPSHOT/build/classes/org/apache/poi/ddf/package-info.class>
    [javac] Creating empty <https://builds.apache.org/job/POI-DSL-1.8/ws/build/distsourcebuild/poi-5.0.0-SNAPSHOT/build/classes/org/apache/poi/hssf/package-info.class>
    [javac] Creating empty <https://builds.apache.org/job/POI-DSL-1.8/ws/build/distsourcebuild/poi-5.0.0-SNAPSHOT/build/classes/org/apache/poi/poifs/dev/package-info.class>
    [javac] Creating empty <https://builds.apache.org/job/POI-DSL-1.8/ws/build/distsourcebuild/poi-5.0.0-SNAPSHOT/build/classes/org/apache/poi/util/package-info.class>
    [javac] Creating empty <https://builds.apache.org/job/POI-DSL-1.8/ws/build/distsourcebuild/poi-5.0.0-SNAPSHOT/build/classes/org/apache/poi/poifs/common/package-info.class>
    [javac] Creating empty <https://builds.apache.org/job/POI-DSL-1.8/ws/build/distsourcebuild/poi-5.0.0-SNAPSHOT/build/classes/org/apache/poi/hssf/record/package-info.class>
    [javac] Creating empty <https://builds.apache.org/job/POI-DSL-1.8/ws/build/distsourcebuild/poi-5.0.0-SNAPSHOT/build/classes/org/apache/poi/poifs/package-info.class>
    [javac] Creating empty <https://builds.apache.org/job/POI-DSL-1.8/ws/build/distsourcebuild/poi-5.0.0-SNAPSHOT/build/classes/org/apache/poi/poifs/crypt/package-info.class>
    [javac] Creating empty <https://builds.apache.org/job/POI-DSL-1.8/ws/build/distsourcebuild/poi-5.0.0-SNAPSHOT/build/classes/org/apache/poi/hpsf/wellknown/package-info.class>
    [javac] Creating empty <https://builds.apache.org/job/POI-DSL-1.8/ws/build/distsourcebuild/poi-5.0.0-SNAPSHOT/build/classes/org/apache/poi/hssf/dev/package-info.class>
    [javac] Creating empty <https://builds.apache.org/job/POI-DSL-1.8/ws/build/distsourcebuild/poi-5.0.0-SNAPSHOT/build/classes/org/apache/poi/ss/formula/package-info.class>
    [javac] Creating empty <https://builds.apache.org/job/POI-DSL-1.8/ws/build/distsourcebuild/poi-5.0.0-SNAPSHOT/build/classes/org/apache/poi/hpsf/package-info.class>
    [javac] Creating empty <https://builds.apache.org/job/POI-DSL-1.8/ws/build/distsourcebuild/poi-5.0.0-SNAPSHOT/build/classes/org/apache/poi/poifs/property/package-info.class>
    [javac] Creating empty <https://builds.apache.org/job/POI-DSL-1.8/ws/build/distsourcebuild/poi-5.0.0-SNAPSHOT/build/classes/org/apache/poi/poifs/filesystem/package-info.class>
    [javac] Creating empty <https://builds.apache.org/job/POI-DSL-1.8/ws/build/distsourcebuild/poi-5.0.0-SNAPSHOT/build/classes/org/apache/poi/ss/formula/ptg/package-info.class>
    [javac] Creating empty <https://builds.apache.org/job/POI-DSL-1.8/ws/build/distsourcebuild/poi-5.0.0-SNAPSHOT/build/classes/org/apache/poi/poifs/storage/package-info.class>
    [javac] Creating empty <https://builds.apache.org/job/POI-DSL-1.8/ws/build/distsourcebuild/poi-5.0.0-SNAPSHOT/build/classes/org/apache/poi/hssf/eventusermodel/package-info.class>
    [javac] Creating empty <https://builds.apache.org/job/POI-DSL-1.8/ws/build/distsourcebuild/poi-5.0.0-SNAPSHOT/build/classes/org/apache/poi/hssf/record/aggregates/package-info.class>
    [javac] Creating empty <https://builds.apache.org/job/POI-DSL-1.8/ws/build/distsourcebuild/poi-5.0.0-SNAPSHOT/build/classes/org/apache/poi/ss/format/package-info.class>
    [javac] Creating empty <https://builds.apache.org/job/POI-DSL-1.8/ws/build/distsourcebuild/poi-5.0.0-SNAPSHOT/build/classes/org/apache/poi/hssf/model/package-info.class>
    [javac] Creating empty <https://builds.apache.org/job/POI-DSL-1.8/ws/build/distsourcebuild/poi-5.0.0-SNAPSHOT/build/classes/org/apache/poi/hssf/usermodel/package-info.class>
    [javac] Creating empty <https://builds.apache.org/job/POI-DSL-1.8/ws/build/distsourcebuild/poi-5.0.0-SNAPSHOT/build/classes/org/apache/poi/hssf/util/package-info.class>
    [javac] Creating empty <https://builds.apache.org/job/POI-DSL-1.8/ws/build/distsourcebuild/poi-5.0.0-SNAPSHOT/build/classes/org/apache/poi/poifs/eventfilesystem/package-info.class>
    [mkdir] Created dir: <https://builds.apache.org/job/POI-DSL-1.8/ws/build/distsourcebuild/poi-5.0.0-SNAPSHOT/build/dist/maven/poi>
      [jar] Building jar: <https://builds.apache.org/job/POI-DSL-1.8/ws/build/distsourcebuild/poi-5.0.0-SNAPSHOT/build/dist/maven/poi/poi-5.0.0-SNAPSHOT.jar>
    [javac] Compiling 549 source files to <https://builds.apache.org/job/POI-DSL-1.8/ws/build/distsourcebuild/poi-5.0.0-SNAPSHOT/build/test-classes>
    [javac] Support for javac --release has been added in Java9 ignoring it
    [javac] Note: Some input files use or override a deprecated API.
    [javac] Note: Recompile with -Xlint:deprecation for details.
      [jar] Building jar: <https://builds.apache.org/job/POI-DSL-1.8/ws/build/distsourcebuild/poi-5.0.0-SNAPSHOT/build/dist/maven/poi-tests/poi-5.0.0-SNAPSHOT-tests.jar>
      [jar] Building jar: <https://builds.apache.org/job/POI-DSL-1.8/ws/build/distsourcebuild/poi-5.0.0-SNAPSHOT/build/dist/maven/poi/poi-5.0.0-SNAPSHOT-sources.jar>

compile-scratchpad:
    [javac] Compiling 513 source files to <https://builds.apache.org/job/POI-DSL-1.8/ws/build/distsourcebuild/poi-5.0.0-SNAPSHOT/build/scratchpad-classes>
    [javac] Support for javac --release has been added in Java9 ignoring it
    [javac] Note: Some input files use or override a deprecated API.
    [javac] Note: Recompile with -Xlint:deprecation for details.
    [javac] Note: Some input files use unchecked or unsafe operations.
    [javac] Note: Recompile with -Xlint:unchecked for details.
    [mkdir] Created dir: <https://builds.apache.org/job/POI-DSL-1.8/ws/build/distsourcebuild/poi-5.0.0-SNAPSHOT/build/dist/maven/poi-scratchpad>
      [jar] Building jar: <https://builds.apache.org/job/POI-DSL-1.8/ws/build/distsourcebuild/poi-5.0.0-SNAPSHOT/build/dist/maven/poi-scratchpad/poi-scratchpad-5.0.0-SNAPSHOT.jar>
    [javac] Compiling 202 source files to <https://builds.apache.org/job/POI-DSL-1.8/ws/build/distsourcebuild/poi-5.0.0-SNAPSHOT/build/scratchpad-test-classes>
    [javac] Support for javac --release has been added in Java9 ignoring it
    [javac] Note: Some input files use or override a deprecated API.
    [javac] Note: Recompile with -Xlint:deprecation for details.
    [javac] Note: <https://builds.apache.org/job/POI-DSL-1.8/ws/build/distsourcebuild/poi-5.0.0-SNAPSHOT/src/scratchpad/testcases/org/apache/poi/hslf/usermodel/TestBugs.java> uses unchecked or unsafe operations.
    [javac] Note: Recompile with -Xlint:unchecked for details.
      [jar] Building jar: <https://builds.apache.org/job/POI-DSL-1.8/ws/build/distsourcebuild/poi-5.0.0-SNAPSHOT/build/dist/maven/poi-scratchpad-tests/poi-scratchpad-5.0.0-SNAPSHOT-tests.jar>
      [jar] Building jar: <https://builds.apache.org/job/POI-DSL-1.8/ws/build/distsourcebuild/poi-5.0.0-SNAPSHOT/build/dist/maven/poi-scratchpad/poi-scratchpad-5.0.0-SNAPSHOT-sources.jar>

check-compiled-ooxml-xsds:

compile-ooxml-xsds:
    [mkdir] Created dir: <https://builds.apache.org/job/POI-DSL-1.8/ws/build/distsourcebuild/poi-5.0.0-SNAPSHOT/build/xmlbean-xsds>
     [copy] Copying 7 files to <https://builds.apache.org/job/POI-DSL-1.8/ws/build/distsourcebuild/poi-5.0.0-SNAPSHOT/build/xmlbean-xsds>
     [copy] Copying 89 resources to <https://builds.apache.org/job/POI-DSL-1.8/ws/build/distsourcebuild/poi-5.0.0-SNAPSHOT/build/xmlbean-xsds>
    [mkdir] Created dir: <https://builds.apache.org/job/POI-DSL-1.8/ws/build/distsourcebuild/poi-5.0.0-SNAPSHOT/build/xmlbean-sources>
    [mkdir] Created dir: <https://builds.apache.org/job/POI-DSL-1.8/ws/build/distsourcebuild/poi-5.0.0-SNAPSHOT/build/xmlbean-classes>
  [xmlbean] SchemaCompiler  Metadata LOAD:org/apache/xmlbeans/metadata GEN:org/apache/poi/schemas/ooxml
  [xmlbean] Time to build schema type system: 2.329 seconds
  [xmlbean] Time to generate code: 5.892 seconds
    [javac] Compiling 4908 source files to <https://builds.apache.org/job/POI-DSL-1.8/ws/build/distsourcebuild/poi-5.0.0-SNAPSHOT/build/xmlbean-classes>
    [javac] Support for javac --release has been added in Java9 ignoring it
    [mkdir] Created dir: <https://builds.apache.org/job/POI-DSL-1.8/ws/build/distsourcebuild/poi-5.0.0-SNAPSHOT/build/dist/maven/ooxml-schemas>
      [jar] Building jar: <https://builds.apache.org/job/POI-DSL-1.8/ws/build/distsourcebuild/poi-5.0.0-SNAPSHOT/build/dist/maven/ooxml-schemas/ooxml-schemas-1.5.jar>
      [jar] Building jar: <https://builds.apache.org/job/POI-DSL-1.8/ws/build/distsourcebuild/poi-5.0.0-SNAPSHOT/build/dist/maven/ooxml-schemas/ooxml-schemas-1.5-sources.jar>

compile-ooxml:
    [javac] Compiling 612 source files to <https://builds.apache.org/job/POI-DSL-1.8/ws/build/distsourcebuild/poi-5.0.0-SNAPSHOT/build/ooxml-classes>
    [javac] Support for javac --release has been added in Java9 ignoring it
    [javac] Note: Some input files use or override a deprecated API.
    [javac] Note: Recompile with -Xlint:deprecation for details.
    [javac] Note: <https://builds.apache.org/job/POI-DSL-1.8/ws/build/distsourcebuild/poi-5.0.0-SNAPSHOT/src/ooxml/java/org/apache/poi/xslf/draw/SVGImageRenderer.java> uses unchecked or unsafe operations.
    [javac] Note: Recompile with -Xlint:unchecked for details.
    [javac] Creating empty <https://builds.apache.org/job/POI-DSL-1.8/ws/build/distsourcebuild/poi-5.0.0-SNAPSHOT/build/ooxml-classes/org/apache/poi/xwpf/package-info.class>
    [javac] Creating empty <https://builds.apache.org/job/POI-DSL-1.8/ws/build/distsourcebuild/poi-5.0.0-SNAPSHOT/build/ooxml-classes/org/apache/poi/xssf/binary/package-info.class>
    [mkdir] Created dir: <https://builds.apache.org/job/POI-DSL-1.8/ws/build/distsourcebuild/poi-5.0.0-SNAPSHOT/build/dist/maven/poi-ooxml>
      [jar] Building jar: <https://builds.apache.org/job/POI-DSL-1.8/ws/build/distsourcebuild/poi-5.0.0-SNAPSHOT/build/dist/maven/poi-ooxml/poi-ooxml-5.0.0-SNAPSHOT.jar>
    [javac] Compiling 270 source files to <https://builds.apache.org/job/POI-DSL-1.8/ws/build/distsourcebuild/poi-5.0.0-SNAPSHOT/build/ooxml-test-classes>
    [javac] Support for javac --release has been added in Java9 ignoring it
    [javac] Note: Some input files use or override a deprecated API.
    [javac] Note: Recompile with -Xlint:deprecation for details.
    [javac] Note: Some input files use unchecked or unsafe operations.
    [javac] Note: Recompile with -Xlint:unchecked for details.
      [jar] Building jar: <https://builds.apache.org/job/POI-DSL-1.8/ws/build/distsourcebuild/poi-5.0.0-SNAPSHOT/build/dist/maven/poi-ooxml-tests/poi-ooxml-5.0.0-SNAPSHOT-tests.jar>
      [jar] Building jar: <https://builds.apache.org/job/POI-DSL-1.8/ws/build/distsourcebuild/poi-5.0.0-SNAPSHOT/build/dist/maven/poi-ooxml/poi-ooxml-5.0.0-SNAPSHOT-sources.jar>
      [jar] Building jar: <https://builds.apache.org/job/POI-DSL-1.8/ws/build/distsourcebuild/poi-5.0.0-SNAPSHOT/lib/ooxml-tests/ooxml-lite-agent.jar>

compile-examples:
    [javac] Compiling 133 source files to <https://builds.apache.org/job/POI-DSL-1.8/ws/build/distsourcebuild/poi-5.0.0-SNAPSHOT/build/examples-classes>
    [javac] Support for javac --release has been added in Java9 ignoring it
    [javac] Note: Some input files use or override a deprecated API.
    [javac] Note: Recompile with -Xlint:deprecation for details.
    [javac] Creating empty <https://builds.apache.org/job/POI-DSL-1.8/ws/build/distsourcebuild/poi-5.0.0-SNAPSHOT/build/examples-classes/org/apache/poi/examples/ss/html/package-info.class>
    [mkdir] Created dir: <https://builds.apache.org/job/POI-DSL-1.8/ws/build/distsourcebuild/poi-5.0.0-SNAPSHOT/build/dist/maven/poi-examples>
      [jar] Building jar: <https://builds.apache.org/job/POI-DSL-1.8/ws/build/distsourcebuild/poi-5.0.0-SNAPSHOT/build/dist/maven/poi-examples/poi-examples-5.0.0-SNAPSHOT.jar>
      [jar] Building jar: <https://builds.apache.org/job/POI-DSL-1.8/ws/build/distsourcebuild/poi-5.0.0-SNAPSHOT/build/dist/maven/poi-examples/poi-examples-5.0.0-SNAPSHOT-sources.jar>

compile-excelant:
    [javac] Compiling 14 source files to <https://builds.apache.org/job/POI-DSL-1.8/ws/build/distsourcebuild/poi-5.0.0-SNAPSHOT/build/excelant-classes>
    [javac] Support for javac --release has been added in Java9 ignoring it
    [mkdir] Created dir: <https://builds.apache.org/job/POI-DSL-1.8/ws/build/distsourcebuild/poi-5.0.0-SNAPSHOT/build/dist/maven/poi-excelant>
      [jar] Building jar: <https://builds.apache.org/job/POI-DSL-1.8/ws/build/distsourcebuild/poi-5.0.0-SNAPSHOT/build/dist/maven/poi-excelant/poi-excelant-5.0.0-SNAPSHOT.jar>
    [javac] Compiling 12 source files to <https://builds.apache.org/job/POI-DSL-1.8/ws/build/distsourcebuild/poi-5.0.0-SNAPSHOT/build/excelant-test-classes>
    [javac] Support for javac --release has been added in Java9 ignoring it
      [jar] Building jar: <https://builds.apache.org/job/POI-DSL-1.8/ws/build/distsourcebuild/poi-5.0.0-SNAPSHOT/build/dist/maven/poi-excelant-tests/poi-excelant-5.0.0-SNAPSHOT-tests.jar>
      [jar] Building jar: <https://builds.apache.org/job/POI-DSL-1.8/ws/build/distsourcebuild/poi-5.0.0-SNAPSHOT/build/dist/maven/poi-excelant/poi-excelant-5.0.0-SNAPSHOT-sources.jar>

compile:

-test-ooxml-check:

jacocotask:
     [echo] Coverage reporting: ${coverage.enabled}

test-ooxml:
    [junit] Running org.apache.poi.extractor.ooxml.TestExtractorFactory
    [junit] Tests run: 14, Failures: 0, Errors: 0, Skipped: 0, Time elapsed: 3.548 sec
    [junit] Running org.apache.poi.ooxml.TestDetectAsOOXML
    [junit] Tests run: 3, Failures: 0, Errors: 0, Skipped: 0, Time elapsed: 0.018 sec
    [junit] Running org.apache.poi.ooxml.TestEmbedded
    [junit] Tests run: 3, Failures: 0, Errors: 0, Skipped: 0, Time elapsed: 0.379 sec
    [junit] Running org.apache.poi.ooxml.TestPOIXMLDocument
    [junit] Tests run: 11, Failures: 0, Errors: 0, Skipped: 0, Time elapsed: 1.687 sec
    [junit] Running org.apache.poi.ooxml.TestPOIXMLProperties
    [junit] Tests run: 10, Failures: 0, Errors: 0, Skipped: 1, Time elapsed: 0.315 sec
    [junit] Running org.apache.poi.ooxml.TestXMLPropertiesTextExtractor
    [junit] Tests run: 5, Failures: 0, Errors: 0, Skipped: 0, Time elapsed: 0.123 sec
    [junit] Running org.apache.poi.openxml4j.opc.TestContentType
    [junit] Tests run: 7, Failures: 0, Errors: 0, Skipped: 0, Time elapsed: 0.022 sec
    [junit] Running org.apache.poi.openxml4j.opc.TestFileHelper
    [junit] Tests run: 1, Failures: 0, Errors: 0, Skipped: 0, Time elapsed: 0.003 sec
    [junit] Running org.apache.poi.openxml4j.opc.TestListParts
    [junit] Tests run: 1, Failures: 0, Errors: 0, Skipped: 0, Time elapsed: 0.007 sec
    [junit] Running org.apache.poi.openxml4j.opc.TestPackage
    [junit] Tests run: 46, Failures: 0, Errors: 0, Skipped: 1, Time elapsed: 1.434 sec
    [junit] Running org.apache.poi.openxml4j.opc.TestPackageCoreProperties
    [junit] Tests run: 7, Failures: 0, Errors: 0, Skipped: 0, Time elapsed: 0.075 sec
    [junit] Running org.apache.poi.openxml4j.opc.TestPackagePartName
    [junit] Tests run: 1, Failures: 0, Errors: 0, Skipped: 0, Time elapsed: 0.001 sec
    [junit] Running org.apache.poi.openxml4j.opc.TestPackageThumbnail
    [junit] Tests run: 1, Failures: 0, Errors: 0, Skipped: 0, Time elapsed: 0.013 sec
    [junit] Running org.apache.poi.openxml4j.opc.TestPackagingURIHelper
    [junit] Tests run: 5, Failures: 0, Errors: 0, Skipped: 0, Time elapsed: 0.004 sec
    [junit] Running org.apache.poi.openxml4j.opc.TestRelationships
    [junit] Tests run: 9, Failures: 0, Errors: 0, Skipped: 0, Time elapsed: 0.055 sec
    [junit] Running org.apache.poi.openxml4j.opc.compliance.TestOPCComplianceCoreProperties
    [junit] Tests run: 11, Failures: 0, Errors: 0, Skipped: 0, Time elapsed: 0.075 sec
    [junit] Running org.apache.poi.openxml4j.opc.compliance.TestOPCCompliancePackageModel
    [junit] Tests run: 5, Failures: 0, Errors: 0, Skipped: 0, Time elapsed: 0.006 sec
    [junit] Running org.apache.poi.openxml4j.opc.compliance.TestOPCCompliancePartName
    [junit] Tests run: 10, Failures: 0, Errors: 0, Skipped: 0, Time elapsed: 0.006 sec
    [junit] Running org.apache.poi.openxml4j.opc.internal.TestContentTypeManager
    [junit] Tests run: 5, Failures: 0, Errors: 0, Skipped: 1, Time elapsed: 0.177 sec
    [junit] Running org.apache.poi.openxml4j.opc.internal.marshallers.TestZipPackagePropertiesMarshaller
    [junit] Tests run: 4, Failures: 0, Errors: 0, Skipped: 0, Time elapsed: 0.004 sec
    [junit] Running org.apache.poi.openxml4j.util.TestZipSecureFile
    [junit] Tests run: 1, Failures: 0, Errors: 0, Skipped: 0, Time elapsed: 0.003 sec
    [junit] Running org.apache.poi.poifs.crypt.dsig.TestSignatureConfig
    [junit] Tests run: 2, Failures: 0, Errors: 0, Skipped: 1, Time elapsed: 0.005 sec
    [junit] Running org.apache.poi.poifs.crypt.dsig.TestSignatureInfo
    [junit] Tests run: 14, Failures: 0, Errors: 1, Skipped: 1, Time elapsed: 3.833 sec

BUILD FAILED
<https://builds.apache.org/job/POI-DSL-1.8/ws/src/integrationtest/build.xml>:72: The following error occurred while executing this line:
<https://builds.apache.org/job/POI-DSL-1.8/ws/build/distsourcebuild/poi-5.0.0-SNAPSHOT/build.xml>:1518: The following error occurred while executing this line:
<https://builds.apache.org/job/POI-DSL-1.8/ws/build/distsourcebuild/poi-5.0.0-SNAPSHOT/build.xml>:1486: The following error occurred while executing this line:
<https://builds.apache.org/job/POI-DSL-1.8/ws/build/distsourcebuild/poi-5.0.0-SNAPSHOT/build.xml>:1114: Tests failed

Total time: 2 minutes 36 seconds
Build step 'Invoke Ant' marked build as failure
Skipping publisher since build result is FAILURE
Archiving artifacts
[Fast Archiver] Compressed 219.50 MB of artifacts by 29.0% relative to #1040
Skipping publisher since build result is FAILURE
Recording test results

---------------------------------------------------------------------
To unsubscribe, e-mail: [hidden email]
For additional commands, e-mail: [hidden email]

Reply | Threaded
Open this post in threaded view
|

Jenkins build is back to normal : POI-DSL-1.8 #1048

Apache Jenkins Server
See <https://builds.apache.org/job/POI-DSL-1.8/1048/display/redirect>


---------------------------------------------------------------------
To unsubscribe, e-mail: [hidden email]
For additional commands, e-mail: [hidden email]