Build failed in Jenkins: POI-DSL-1.6 #397

classic Classic list List threaded Threaded
2 messages Options
Reply | Threaded
Open this post in threaded view
|  
Report Content as Inappropriate

Build failed in Jenkins: POI-DSL-1.6 #397

Apache Jenkins Server
See <https://builds.apache.org/job/POI-DSL-1.6/397/display/redirect?page=changes>

Changes:

[kiwiwings] SL Common: narrow generics definition because of tighter java9 checks

------------------------------------------
[...truncated 8.39 KB...]
  1800K .......... .......... .......... .......... .......... 23%  549K 16s
  1850K .......... .......... .......... .......... .......... 24% 39.2M 15s
  1900K .......... .......... .......... .......... .......... 25%  524K 15s
  1950K .......... .......... .......... .......... .......... 25% 40.6M 15s
  2000K .......... .......... .......... .......... .......... 26% 64.9M 14s
  2050K .......... .......... .......... .......... .......... 27%  495K 14s
  2100K .......... .......... .......... .......... .......... 27% 42.0M 14s
  2150K .......... .......... .......... .......... .......... 28%  458K 13s
  2200K .......... .......... .......... .......... .......... 29% 68.0M 13s
  2250K .......... .......... .......... .......... .......... 29% 49.6M 13s
  2300K .......... .......... .......... .......... .......... 30% 1.59M 12s
  2350K .......... .......... .......... .......... .......... 31%  589K 12s
  2400K .......... .......... .......... .......... .......... 31% 61.1M 12s
  2450K .......... .......... .......... .......... .......... 32% 72.2M 11s
  2500K .......... .......... .......... .......... .......... 32% 1.51M 11s
  2550K .......... .......... .......... .......... .......... 33%  562K 11s
  2600K .......... .......... .......... .......... .......... 34% 65.4M 11s
  2650K .......... .......... .......... .......... .......... 34% 76.9M 10s
  2700K .......... .......... .......... .......... .......... 35% 1.48M 10s
  2750K .......... .......... .......... .......... .......... 36%  527K 10s
  2800K .......... .......... .......... .......... .......... 36% 50.8M 10s
  2850K .......... .......... .......... .......... .......... 37% 56.0M 10s
  2900K .......... .......... .......... .......... .......... 38% 59.0M 9s
  2950K .......... .......... .......... .......... .......... 38% 1.50M 9s
  3000K .......... .......... .......... .......... .......... 39%  502K 9s
  3050K .......... .......... .......... .......... .......... 40% 51.2M 9s
  3100K .......... .......... .......... .......... .......... 40% 79.1M 9s
  3150K .......... .......... .......... .......... .......... 41% 56.2M 8s
  3200K .......... .......... .......... .......... .......... 42% 1.43M 8s
  3250K .......... .......... .......... .......... .......... 42% 68.1M 8s
  3300K .......... .......... .......... .......... .......... 43%  482K 8s
  3350K .......... .......... .......... .......... .......... 43% 59.6M 8s
  3400K .......... .......... .......... .......... .......... 44% 41.8M 7s
  3450K .......... .......... .......... .......... .......... 45% 56.3M 7s
  3500K .......... .......... .......... .......... .......... 45% 2.20M 7s
  3550K .......... .......... .......... .......... .......... 46% 3.17M 7s
  3600K .......... .......... .......... .......... .......... 47% 2.05M 7s
  3650K .......... .......... .......... .......... .......... 47% 1.91M 7s
  3700K .......... .......... .......... .......... .......... 48%  846K 7s
  3750K .......... .......... .......... .......... .......... 49% 47.0M 6s
  3800K .......... .......... .......... .......... .......... 49% 12.2M 6s
  3850K .......... .......... .......... .......... .......... 50% 1.55M 6s
  3900K .......... .......... .......... .......... .......... 51% 12.4M 6s
  3950K .......... .......... .......... .......... .......... 51% 1.60M 6s
  4000K .......... .......... .......... .......... .......... 52% 1.50M 6s
  4050K .......... .......... .......... .......... .......... 53% 1.50M 6s
  4100K .......... .......... .......... .......... .......... 53% 1.60M 5s
  4150K .......... .......... .......... .......... .......... 54% 32.4M 5s
  4200K .......... .......... .......... .......... .......... 54% 1.50M 5s
  4250K .......... .......... .......... .......... .......... 55% 1.50M 5s
  4300K .......... .......... .......... .......... .......... 56% 1.50M 5s
  4350K .......... .......... .......... .......... .......... 56% 1.48M 5s
  4400K .......... .......... .......... .......... .......... 57% 33.5M 5s
  4450K .......... .......... .......... .......... .......... 58% 1.55M 5s
  4500K .......... .......... .......... .......... .......... 58% 1.50M 5s
  4550K .......... .......... .......... .......... .......... 59% 1.54M 4s
  4600K .......... .......... .......... .......... .......... 60% 33.5M 4s
  4650K .......... .......... .......... .......... .......... 60% 1.37M 4s
  4700K .......... .......... .......... .......... .......... 61%  631K 4s
  4750K .......... .......... .......... .......... .......... 62% 1.40M 4s
  4800K .......... .......... .......... .......... .......... 62% 1.41M 4s
  4850K .......... .......... .......... .......... .......... 63% 35.1M 4s
  4900K .......... .......... .......... .......... .......... 64% 1.45M 4s
  4950K .......... .......... .......... .......... .......... 64% 1.50M 4s
  5000K .......... .......... .......... .......... .......... 65% 1.54M 4s
  5050K .......... .......... .......... .......... .......... 65% 32.5M 4s
  5100K .......... .......... .......... .......... .......... 66% 1.56M 3s
  5150K .......... .......... .......... .......... .......... 67% 1.48M 3s
  5200K .......... .......... .......... .......... .......... 67% 1.50M 3s
  5250K .......... .......... .......... .......... .......... 68% 1.60M 3s
  5300K .......... .......... .......... .......... .......... 69% 35.1M 3s
  5350K .......... .......... .......... .......... .......... 69% 1.59M 3s
  5400K .......... .......... .......... .......... .......... 70% 1.50M 3s
  5450K .......... .......... .......... .......... .......... 71% 1.50M 3s
  5500K .......... .......... .......... .......... .......... 71% 31.7M 3s
  5550K .......... .......... .......... .......... .......... 72% 1.49M 3s
  5600K .......... .......... .......... .......... .......... 73% 1.50M 3s
  5650K .......... .......... .......... .......... .......... 73% 1.51M 3s
  5700K .......... .......... .......... .......... .......... 74% 1.50M 2s
  5750K .......... .......... .......... .......... .......... 75% 34.0M 2s
  5800K .......... .......... .......... .......... .......... 75% 1.49M 2s
  5850K .......... .......... .......... .......... .......... 76% 1.42M 2s
  5900K .......... .......... .......... .......... .......... 76% 25.8M 2s
  5950K .......... .......... .......... .......... .......... 77%  812K 2s
  6000K .......... .......... .......... .......... .......... 78% 30.8M 2s
  6050K .......... .......... .......... .......... .......... 78% 1.51M 2s
  6100K .......... .......... .......... .......... .......... 79% 1.50M 2s
  6150K .......... .......... .......... .......... .......... 80% 1.41M 2s
  6200K .......... .......... .......... .......... .......... 80% 32.2M 2s
  6250K .......... .......... .......... .......... .......... 81% 1.42M 2s
  6300K .......... .......... .......... .......... .......... 82% 1.55M 2s
  6350K .......... .......... .......... .......... .......... 82% 1.44M 2s
  6400K .......... .......... .......... .......... .......... 83% 1.53M 1s
  6450K .......... .......... .......... .......... .......... 84% 32.8M 1s
  6500K .......... .......... .......... .......... .......... 84% 1.62M 1s
  6550K .......... .......... .......... .......... .......... 85% 1.45M 1s
  6600K .......... .......... .......... .......... .......... 86% 1.46M 1s
  6650K .......... .......... .......... .......... .......... 86% 33.4M 1s
  6700K .......... .......... .......... .......... .......... 87% 1.46M 1s
  6750K .......... .......... .......... .......... .......... 87% 1.48M 1s
  6800K .......... .......... .......... .......... .......... 88% 1.50M 1s
  6850K .......... .......... .......... .......... .......... 89% 1.46M 1s
  6900K .......... .......... .......... .......... .......... 89% 34.2M 1s
  6950K .......... .......... .......... .......... .......... 90% 1.40M 1s
  7000K .......... .......... .......... .......... .......... 91% 1.56M 1s
  7050K .......... .......... .......... .......... .......... 91% 1.55M 1s
  7100K .......... .......... .......... .......... .......... 92% 34.8M 1s
  7150K .......... .......... .......... .......... .......... 93% 1.51M 1s
  7200K .......... .......... .......... .......... .......... 93% 1.57M 1s
  7250K .......... .......... .......... .......... .......... 94% 1.50M 0s
  7300K .......... .......... .......... .......... .......... 95% 1.60M 0s
  7350K .......... .......... .......... .......... .......... 95% 32.1M 0s
  7400K .......... .......... .......... .......... .......... 96% 1.55M 0s
  7450K .......... .......... .......... .......... .......... 97% 1.59M 0s
  7500K .......... .......... .......... .......... .......... 97% 1.51M 0s
  7550K .......... .......... .......... .......... .......... 98% 1.53M 0s
  7600K .......... .......... .......... .......... .......... 98% 43.0M 0s
  7650K .......... .......... .......... .......... .......... 99% 1.53M 0s
  7700K .......... .......... .......                         100% 89.0M=8.2s

2017-07-09 11:23:32 (946 KB/s) - ‘lib/findbugs-noUpdateChecks-2.0.3.zip’ saved [7913272/7913272]

[POI-DSL-1.6] $ /home/jenkins/tools/ant/apache-ant-1.9.9/bin/ant -Dcoverage.enabled=true clean jenkins
Buildfile: <https://builds.apache.org/job/POI-DSL-1.6/ws/build.xml>

clean:
   [delete] Deleting directory <https://builds.apache.org/job/POI-DSL-1.6/ws/build>

check-jars:

fetch-jars:

check-ooxml-jars:

fetch-ooxml-jars:

init:
    [mkdir] Created dir: <https://builds.apache.org/job/POI-DSL-1.6/ws/build>
    [mkdir] Created dir: <https://builds.apache.org/job/POI-DSL-1.6/ws/build/classes>
    [mkdir] Created dir: <https://builds.apache.org/job/POI-DSL-1.6/ws/build/test-classes>
    [mkdir] Created dir: <https://builds.apache.org/job/POI-DSL-1.6/ws/build/test-results>
    [mkdir] Created dir: <https://builds.apache.org/job/POI-DSL-1.6/ws/build/scratchpad-classes>
    [mkdir] Created dir: <https://builds.apache.org/job/POI-DSL-1.6/ws/build/scratchpad-test-classes>
    [mkdir] Created dir: <https://builds.apache.org/job/POI-DSL-1.6/ws/build/scratchpad-test-results>
    [mkdir] Created dir: <https://builds.apache.org/job/POI-DSL-1.6/ws/build/geometry-java>
    [mkdir] Created dir: <https://builds.apache.org/job/POI-DSL-1.6/ws/build/ooxml-classes>
    [mkdir] Created dir: <https://builds.apache.org/job/POI-DSL-1.6/ws/build/ooxml-test-classes>
    [mkdir] Created dir: <https://builds.apache.org/job/POI-DSL-1.6/ws/build/ooxml-test-results>
    [mkdir] Created dir: <https://builds.apache.org/job/POI-DSL-1.6/ws/build/excelant-classes>
    [mkdir] Created dir: <https://builds.apache.org/job/POI-DSL-1.6/ws/build/excelant-test-classes>
    [mkdir] Created dir: <https://builds.apache.org/job/POI-DSL-1.6/ws/build/excelant-test-results>
    [mkdir] Created dir: <https://builds.apache.org/job/POI-DSL-1.6/ws/build/examples-classes>
    [mkdir] Created dir: <https://builds.apache.org/job/POI-DSL-1.6/ws/build/integration-test-classes>
    [mkdir] Created dir: <https://builds.apache.org/job/POI-DSL-1.6/397/artifact/build/integration-test-results>
    [mkdir] Created dir: <https://builds.apache.org/job/POI-DSL-1.6/ws/build/dist>
    [mkdir] Created dir: <https://builds.apache.org/job/POI-DSL-1.6/ws/build/tmp/site/build/site>
     [echo] Using Ant: Apache Ant(TM) version 1.9.9 compiled on February 2 2017 from /home/jenkins/tools/ant/apache-ant-1.9.9, Ant detected Java 1.6 (may be different than actual Java sometimes...)
     [echo] Using Java: 1.6.0_45/1.6.0_45-b06/20.45-b01/Java HotSpot(TM) 64-Bit Server VM from Sun Microsystems Inc. on Linux: 4.4.0-43-generic
     [echo] Using Findbugs: 2.0.3 for Java 1.6.0_45

compile-main:
    [javac] Compiling 1196 source files to <https://builds.apache.org/job/POI-DSL-1.6/ws/build/classes>
    [javac] <https://builds.apache.org/job/POI-DSL-1.6/ws/src/java/org/apache/poi/sl/usermodel/Shape.java>:25: type parameter P is not within its bound
    [javac]     P extends TextParagraph<S,P,? extends TextRun>
    [javac]                               ^
    [javac] <https://builds.apache.org/job/POI-DSL-1.6/ws/src/java/org/apache/poi/sl/usermodel/TextShape.java>:26: type parameter P is not within its bound
    [javac]     P extends TextParagraph<S,P,? extends TextRun>
    [javac]                               ^
    [javac] <https://builds.apache.org/job/POI-DSL-1.6/ws/src/java/org/apache/poi/sl/usermodel/SimpleShape.java>:28: type parameter P is not within its bound
    [javac]     P extends TextParagraph<S,P,? extends TextRun>
    [javac]                               ^
    [javac] <https://builds.apache.org/job/POI-DSL-1.6/ws/src/java/org/apache/poi/sl/usermodel/PlaceableShape.java>:24: type parameter P is not within its bound
    [javac]     P extends TextParagraph<S,P,? extends TextRun>
    [javac]                               ^
    [javac] <https://builds.apache.org/job/POI-DSL-1.6/ws/src/java/org/apache/poi/sl/usermodel/AutoShape.java>:22: type parameter P is not within its bound
    [javac]     P extends TextParagraph<S,P,? extends TextRun>
    [javac]                               ^
    [javac] <https://builds.apache.org/job/POI-DSL-1.6/ws/src/java/org/apache/poi/sl/usermodel/ShapeContainer.java>:25: type parameter P is not within its bound
    [javac]     P extends TextParagraph<S,P,? extends TextRun>
    [javac]                               ^
    [javac] <https://builds.apache.org/job/POI-DSL-1.6/ws/src/java/org/apache/poi/sl/usermodel/Sheet.java>:28: type parameter P is not within its bound
    [javac]     P extends TextParagraph<S,P,? extends TextRun>
    [javac]                               ^
    [javac] <https://builds.apache.org/job/POI-DSL-1.6/ws/src/java/org/apache/poi/sl/usermodel/Hyperlink.java>:26: type parameter P is not within its bound
    [javac]     P extends TextParagraph<S,P,? extends TextRun>
    [javac]                               ^
    [javac] <https://builds.apache.org/job/POI-DSL-1.6/ws/src/java/org/apache/poi/sl/usermodel/Shadow.java>:26: type parameter P is not within its bound
    [javac] P extends TextParagraph<S,P,? extends TextRun>
    [javac]                           ^
    [javac] <https://builds.apache.org/job/POI-DSL-1.6/ws/src/java/org/apache/poi/sl/usermodel/FreeformShape.java>:24: type parameter P is not within its bound
    [javac]     P extends TextParagraph<S,P,? extends TextRun>
    [javac]                               ^
    [javac] <https://builds.apache.org/job/POI-DSL-1.6/ws/src/java/org/apache/poi/sl/usermodel/TextBox.java>:29: type parameter P is not within its bound
    [javac]     P extends TextParagraph<S,P,? extends TextRun>
    [javac]                               ^
    [javac] <https://builds.apache.org/job/POI-DSL-1.6/ws/src/java/org/apache/poi/sl/usermodel/ConnectorShape.java>:22: type parameter P is not within its bound
    [javac]     P extends TextParagraph<S,P,? extends TextRun>
    [javac]                               ^
    [javac] <https://builds.apache.org/job/POI-DSL-1.6/ws/src/java/org/apache/poi/sl/usermodel/GroupShape.java>:24: type parameter P is not within its bound
    [javac]     P extends TextParagraph<S,P,? extends TextRun>
    [javac]                               ^
    [javac] <https://builds.apache.org/job/POI-DSL-1.6/ws/src/java/org/apache/poi/sl/usermodel/PictureShape.java>:24: type parameter P is not within its bound
    [javac]     P extends TextParagraph<S,P,? extends TextRun>
    [javac]                               ^
    [javac] <https://builds.apache.org/job/POI-DSL-1.6/ws/src/java/org/apache/poi/sl/usermodel/TableShape.java>:22: type parameter P is not within its bound
    [javac]     P extends TextParagraph<S,P,? extends TextRun>
    [javac]                               ^
    [javac] <https://builds.apache.org/job/POI-DSL-1.6/ws/src/java/org/apache/poi/sl/usermodel/SlideShow.java>:32: type parameter P is not within its bound
    [javac]     P extends TextParagraph<S,P,? extends TextRun>
    [javac]                               ^
    [javac] <https://builds.apache.org/job/POI-DSL-1.6/ws/src/java/org/apache/poi/sl/usermodel/MasterSheet.java>:22: type parameter P is not within its bound
    [javac]     P extends TextParagraph<S,P,? extends TextRun>
    [javac]                               ^
    [javac] <https://builds.apache.org/job/POI-DSL-1.6/ws/src/java/org/apache/poi/sl/usermodel/Background.java>:22: type parameter P is not within its bound
    [javac]     P extends TextParagraph<S,P,? extends TextRun>
    [javac]                               ^
    [javac] <https://builds.apache.org/job/POI-DSL-1.6/ws/src/java/org/apache/poi/sl/usermodel/Slide.java>:22: type parameter P is not within its bound
    [javac]     P extends TextParagraph<S,P,? extends TextRun>
    [javac]                               ^
    [javac] <https://builds.apache.org/job/POI-DSL-1.6/ws/src/java/org/apache/poi/sl/usermodel/TableCell.java>:27: type parameter P is not within its bound
    [javac]     P extends TextParagraph<S,P,? extends TextRun>
    [javac]                               ^
    [javac] <https://builds.apache.org/job/POI-DSL-1.6/ws/src/java/org/apache/poi/sl/usermodel/Notes.java>:24: type parameter P is not within its bound
    [javac]     P extends TextParagraph<S,P,? extends TextRun>
    [javac]                               ^
    [javac] <https://builds.apache.org/job/POI-DSL-1.6/ws/src/java/org/apache/poi/sl/usermodel/GraphicalFrame.java>:22: type parameter P is not within its bound
    [javac]     P extends TextParagraph<S,P,? extends TextRun>
    [javac]                               ^
    [javac] <https://builds.apache.org/job/POI-DSL-1.6/ws/src/java/org/apache/poi/sl/usermodel/Line.java>:30: type parameter P is not within its bound
    [javac]     P extends TextParagraph<S,P,? extends TextRun>
    [javac]                               ^
    [javac] Note: Some input files use or override a deprecated API.
    [javac] Note: Recompile with -Xlint:deprecation for details.
    [javac] Note: <https://builds.apache.org/job/POI-DSL-1.6/ws/src/java/org/apache/poi/hpsf/CustomProperties.java> uses unchecked or unsafe operations.
    [javac] Note: Recompile with -Xlint:unchecked for details.
    [javac] 23 errors

BUILD FAILED
<https://builds.apache.org/job/POI-DSL-1.6/ws/build.xml>:921: Compile failed; see the compiler error output for details.

Total time: 8 seconds
Build step 'Invoke Ant' marked build as failure
Skipping publisher since build result is FAILURE
Archiving artifacts
Compressed 66.31 MB of artifacts by 65.3% relative to #396
Skipping publisher since build result is FAILURE
Recording test results
ERROR: Step ?Publish JUnit test result report? failed: No test report files were found. Configuration error?


---------------------------------------------------------------------
To unsubscribe, e-mail: [hidden email]
For additional commands, e-mail: [hidden email]

Reply | Threaded
Open this post in threaded view
|  
Report Content as Inappropriate

Jenkins build is back to normal : POI-DSL-1.6 #398

Apache Jenkins Server
See <https://builds.apache.org/job/POI-DSL-1.6/398/display/redirect?page=changes>


---------------------------------------------------------------------
To unsubscribe, e-mail: [hidden email]
For additional commands, e-mail: [hidden email]

Loading...