Build failed in Jenkins: POI-DSL-1.14 #1

classic Classic list List threaded Threaded
3 messages Options
Reply | Threaded
Open this post in threaded view
|

Build failed in Jenkins: POI-DSL-1.14 #1

Apache Jenkins Server
See <https://builds.apache.org/job/POI-DSL-1.14/1/display/redirect>

Changes:


------------------------------------------
[...truncated 1.18 MB...]
  [javadoc]             ^
  [javadoc] /home/jenkins/jenkins-slave/workspace/POI-DSL-1.14/build/distsourcebuild/poi-4.1.2-SNAPSHOT/src/java/org/apache/poi/ss/formula/functions/Subtotal.java:49: error: attribute not supported in HTML5: align
  [javadoc]  *      <tr align='center'><td>2</td><td>COUNT</td></tr>
  [javadoc]             ^
  [javadoc] /home/jenkins/jenkins-slave/workspace/POI-DSL-1.14/build/distsourcebuild/poi-4.1.2-SNAPSHOT/src/java/org/apache/poi/ss/formula/functions/Subtotal.java:50: error: attribute not supported in HTML5: align
  [javadoc]  *      <tr align='center'><td>3</td><td>COUNTA</td></tr>
  [javadoc]             ^
  [javadoc] /home/jenkins/jenkins-slave/workspace/POI-DSL-1.14/build/distsourcebuild/poi-4.1.2-SNAPSHOT/src/java/org/apache/poi/ss/formula/functions/Subtotal.java:51: error: attribute not supported in HTML5: align
  [javadoc]  *      <tr align='center'><td>4</td><td>MAX</td></tr>
  [javadoc]             ^
  [javadoc] /home/jenkins/jenkins-slave/workspace/POI-DSL-1.14/build/distsourcebuild/poi-4.1.2-SNAPSHOT/src/java/org/apache/poi/ss/formula/functions/Subtotal.java:52: error: attribute not supported in HTML5: align
  [javadoc]  *      <tr align='center'><td>5</td><td>MIN</td></tr>
  [javadoc]             ^
  [javadoc] /home/jenkins/jenkins-slave/workspace/POI-DSL-1.14/build/distsourcebuild/poi-4.1.2-SNAPSHOT/src/java/org/apache/poi/ss/formula/functions/Subtotal.java:53: error: attribute not supported in HTML5: align
  [javadoc]  *      <tr align='center'><td>6</td><td>PRODUCT</td></tr>
  [javadoc]             ^
  [javadoc] /home/jenkins/jenkins-slave/workspace/POI-DSL-1.14/build/distsourcebuild/poi-4.1.2-SNAPSHOT/src/java/org/apache/poi/ss/formula/functions/Subtotal.java:54: error: attribute not supported in HTML5: align
  [javadoc]  *      <tr align='center'><td>7</td><td>STDEV</td></tr>
  [javadoc]             ^
  [javadoc] /home/jenkins/jenkins-slave/workspace/POI-DSL-1.14/build/distsourcebuild/poi-4.1.2-SNAPSHOT/src/java/org/apache/poi/ss/formula/functions/Subtotal.java:55: error: attribute not supported in HTML5: align
  [javadoc]  *      <tr align='center'><td>8</td><td>STDEVP *</td></tr>
  [javadoc]             ^
  [javadoc] /home/jenkins/jenkins-slave/workspace/POI-DSL-1.14/build/distsourcebuild/poi-4.1.2-SNAPSHOT/src/java/org/apache/poi/ss/formula/functions/Subtotal.java:56: error: attribute not supported in HTML5: align
  [javadoc]  *      <tr align='center'><td>9</td><td>SUM</td></tr>
  [javadoc]             ^
  [javadoc] /home/jenkins/jenkins-slave/workspace/POI-DSL-1.14/build/distsourcebuild/poi-4.1.2-SNAPSHOT/src/java/org/apache/poi/ss/formula/functions/Subtotal.java:57: error: attribute not supported in HTML5: align
  [javadoc]  *      <tr align='center'><td>10</td><td>VAR *</td></tr>
  [javadoc]             ^
  [javadoc] /home/jenkins/jenkins-slave/workspace/POI-DSL-1.14/build/distsourcebuild/poi-4.1.2-SNAPSHOT/src/java/org/apache/poi/ss/formula/functions/Subtotal.java:58: error: attribute not supported in HTML5: align
  [javadoc]  *      <tr align='center'><td>11</td><td>VARP *</td></tr>
  [javadoc]             ^
  [javadoc] /home/jenkins/jenkins-slave/workspace/POI-DSL-1.14/build/distsourcebuild/poi-4.1.2-SNAPSHOT/src/java/org/apache/poi/ss/formula/functions/Subtotal.java:59: error: attribute not supported in HTML5: align
  [javadoc]  *      <tr align='center'><td>101</td><td>AVERAGE</td></tr>
  [javadoc]             ^
  [javadoc] /home/jenkins/jenkins-slave/workspace/POI-DSL-1.14/build/distsourcebuild/poi-4.1.2-SNAPSHOT/src/java/org/apache/poi/ss/formula/functions/Subtotal.java:60: error: attribute not supported in HTML5: align
  [javadoc]  *      <tr align='center'><td>102</td><td>COUNT</td></tr>
  [javadoc]             ^
  [javadoc] /home/jenkins/jenkins-slave/workspace/POI-DSL-1.14/build/distsourcebuild/poi-4.1.2-SNAPSHOT/src/java/org/apache/poi/ss/formula/functions/Subtotal.java:61: error: attribute not supported in HTML5: align
  [javadoc]  *      <tr align='center'><td>103</td><td>COUNTA</td></tr>
  [javadoc]             ^
  [javadoc] /home/jenkins/jenkins-slave/workspace/POI-DSL-1.14/build/distsourcebuild/poi-4.1.2-SNAPSHOT/src/java/org/apache/poi/ss/formula/functions/Subtotal.java:62: error: attribute not supported in HTML5: align
  [javadoc]  *      <tr align='center'><td>104</td><td>MAX</td></tr>
  [javadoc]             ^
  [javadoc] /home/jenkins/jenkins-slave/workspace/POI-DSL-1.14/build/distsourcebuild/poi-4.1.2-SNAPSHOT/src/java/org/apache/poi/ss/formula/functions/Subtotal.java:63: error: attribute not supported in HTML5: align
  [javadoc]  *      <tr align='center'><td>105</td><td>MIN</td></tr>
  [javadoc]             ^
  [javadoc] /home/jenkins/jenkins-slave/workspace/POI-DSL-1.14/build/distsourcebuild/poi-4.1.2-SNAPSHOT/src/java/org/apache/poi/ss/formula/functions/Subtotal.java:64: error: attribute not supported in HTML5: align
  [javadoc]  *      <tr align='center'><td>106</td><td>PRODUCT</td></tr>
  [javadoc]             ^
  [javadoc] /home/jenkins/jenkins-slave/workspace/POI-DSL-1.14/build/distsourcebuild/poi-4.1.2-SNAPSHOT/src/java/org/apache/poi/ss/formula/functions/Subtotal.java:65: error: attribute not supported in HTML5: align
  [javadoc]  *      <tr align='center'><td>107</td><td>STDEV</td></tr>
  [javadoc]             ^
  [javadoc] /home/jenkins/jenkins-slave/workspace/POI-DSL-1.14/build/distsourcebuild/poi-4.1.2-SNAPSHOT/src/java/org/apache/poi/ss/formula/functions/Subtotal.java:66: error: attribute not supported in HTML5: align
  [javadoc]  *      <tr align='center'><td>108</td><td>STDEVP *</td></tr>
  [javadoc]             ^
  [javadoc] /home/jenkins/jenkins-slave/workspace/POI-DSL-1.14/build/distsourcebuild/poi-4.1.2-SNAPSHOT/src/java/org/apache/poi/ss/formula/functions/Subtotal.java:67: error: attribute not supported in HTML5: align
  [javadoc]  *      <tr align='center'><td>109</td><td>SUM</td></tr>
  [javadoc]             ^
  [javadoc] /home/jenkins/jenkins-slave/workspace/POI-DSL-1.14/build/distsourcebuild/poi-4.1.2-SNAPSHOT/src/java/org/apache/poi/ss/formula/functions/Subtotal.java:68: error: attribute not supported in HTML5: align
  [javadoc]  *      <tr align='center'><td>110</td><td>VAR *</td></tr>
  [javadoc]             ^
  [javadoc] /home/jenkins/jenkins-slave/workspace/POI-DSL-1.14/build/distsourcebuild/poi-4.1.2-SNAPSHOT/src/java/org/apache/poi/ss/formula/functions/Rept.java:27: warning: empty <p> tag
  [javadoc]  * Implementation for Excel REPT () function.<p>
  [javadoc]                                              ^
  [javadoc] /home/jenkins/jenkins-slave/workspace/POI-DSL-1.14/build/distsourcebuild/poi-4.1.2-SNAPSHOT/src/java/org/apache/poi/ss/formula/functions/Hex2Dec.java:24: warning: empty <p> tag
  [javadoc]  * Implementation for Excel HEX2DEC() function.<p>
  [javadoc]                                                ^
  [javadoc] /home/jenkins/jenkins-slave/workspace/POI-DSL-1.14/build/distsourcebuild/poi-4.1.2-SNAPSHOT/src/java/org/apache/poi/ss/formula/functions/Quotient.java:26: warning: empty <p> tag
  [javadoc]  * <p>Implementation for Excel QUOTIENT () function.<p>
  [javadoc]                                                     ^
  [javadoc] /home/jenkins/jenkins-slave/workspace/POI-DSL-1.14/build/distsourcebuild/poi-4.1.2-SNAPSHOT/src/java/org/apache/poi/ss/formula/functions/Quotient.java:29: warning: empty <p> tag
  [javadoc]  * <p>
  [javadoc]    ^
  [javadoc] /home/jenkins/jenkins-slave/workspace/POI-DSL-1.14/build/distsourcebuild/poi-4.1.2-SNAPSHOT/src/java/org/apache/poi/ss/formula/functions/Lookup.java:36: warning: nested tag not allowed: <b>
  [javadoc]  * <b>result_vector</b> Single row or single column area reference from which the result value is chosen.<br>
  [javadoc]    ^
  [javadoc] /home/jenkins/jenkins-slave/workspace/POI-DSL-1.14/build/distsourcebuild/poi-4.1.2-SNAPSHOT/src/java/org/apache/poi/ss/formula/functions/Roman.java:27: warning: empty <p> tag
  [javadoc]  * Implementation for Excel WeekNum() function.<p>
  [javadoc]                                                ^
  [javadoc] /home/jenkins/jenkins-slave/workspace/POI-DSL-1.14/build/distsourcebuild/poi-4.1.2-SNAPSHOT/src/java/org/apache/poi/ss/formula/functions/Roman.java:32: warning: empty <p> tag
  [javadoc]  * <p>
  [javadoc]    ^
  [javadoc] /home/jenkins/jenkins-slave/workspace/POI-DSL-1.14/build/distsourcebuild/poi-4.1.2-SNAPSHOT/src/java/org/apache/poi/ss/formula/functions/Delta.java:28: warning: empty <p> tag
  [javadoc]  * Implementation for Excel DELTA() function.<p>
  [javadoc]                                              ^
  [javadoc] /home/jenkins/jenkins-slave/workspace/POI-DSL-1.14/build/distsourcebuild/poi-4.1.2-SNAPSHOT/src/java/org/apache/poi/ss/formula/functions/Dec2Bin.java:27: warning: empty <p> tag
  [javadoc]  * Implementation for Excel Bin2Dec() function.<p>
  [javadoc]                                                ^
  [javadoc] /home/jenkins/jenkins-slave/workspace/POI-DSL-1.14/build/distsourcebuild/poi-4.1.2-SNAPSHOT/src/java/org/apache/poi/ss/formula/functions/Errortype.java:33: warning: empty <p> tag
  [javadoc]  * Returns a number corresponding to the error type of the supplied argument.<p>
  [javadoc]                                                                              ^
  [javadoc] /home/jenkins/jenkins-slave/workspace/POI-DSL-1.14/build/distsourcebuild/poi-4.1.2-SNAPSHOT/src/java/org/apache/poi/ss/formula/functions/Errortype.java:34: warning: empty <p> tag
  [javadoc]  * <p>
  [javadoc]    ^
  [javadoc] /home/jenkins/jenkins-slave/workspace/POI-DSL-1.14/build/distsourcebuild/poi-4.1.2-SNAPSHOT/src/java/org/apache/poi/ss/formula/functions/Dec2Hex.java:26: warning: empty <p> tag
  [javadoc]  * Implementation for Excel DELTA() function.<p>
  [javadoc]                                              ^
  [javadoc] /home/jenkins/jenkins-slave/workspace/POI-DSL-1.14/build/distsourcebuild/poi-4.1.2-SNAPSHOT/src/java/org/apache/poi/ss/formula/functions/Complex.java:30: warning: empty <p> tag
  [javadoc]  * Implementation for Excel COMPLEX () function.<p>
  [javadoc]                                                 ^
  [javadoc] /home/jenkins/jenkins-slave/workspace/POI-DSL-1.14/build/distsourcebuild/poi-4.1.2-SNAPSHOT/src/java/org/apache/poi/ss/formula/functions/Complex.java:35: warning: empty <p> tag
  [javadoc]  * <p>
  [javadoc]    ^
  [javadoc] /home/jenkins/jenkins-slave/workspace/POI-DSL-1.14/build/distsourcebuild/poi-4.1.2-SNAPSHOT/src/java/org/apache/poi/ss/formula/functions/Complex.java:43: warning: empty <p> tag
  [javadoc]  * <p>
  [javadoc]    ^
  [javadoc] /home/jenkins/jenkins-slave/workspace/POI-DSL-1.14/build/distsourcebuild/poi-4.1.2-SNAPSHOT/src/java/org/apache/poi/ss/formula/functions/Complex.java:47: warning: empty <p> tag
  [javadoc]  * <p>
  [javadoc]    ^
  [javadoc] /home/jenkins/jenkins-slave/workspace/POI-DSL-1.14/build/distsourcebuild/poi-4.1.2-SNAPSHOT/src/java/org/apache/poi/ss/usermodel/BuiltinFormats.java:21: warning: empty <p> tag
  [javadoc]  * returned by this class.<p>
  [javadoc]                           ^
  [javadoc] /home/jenkins/jenkins-slave/workspace/POI-DSL-1.14/build/distsourcebuild/poi-4.1.2-SNAPSHOT/src/java/org/apache/poi/ss/usermodel/BuiltinFormats.java:62: warning: empty <p> tag
  [javadoc]  * <p>
  [javadoc]    ^
  [javadoc] /home/jenkins/jenkins-slave/workspace/POI-DSL-1.14/build/distsourcebuild/poi-4.1.2-SNAPSHOT/src/java/org/apache/poi/ss/util/CellRangeAddress.java:26: warning: empty <p> tag
  [javadoc]  * See OOO documentation: excelfileformat.pdf sec 2.5.14 - 'Cell Range Address'<p>
  [javadoc]                                                                                ^
  [javadoc] /home/jenkins/jenkins-slave/workspace/POI-DSL-1.14/build/distsourcebuild/poi-4.1.2-SNAPSHOT/src/java/org/apache/poi/util/LocaleID.java:30: warning: empty <p> tag
  [javadoc]  * Locale Collection<p>
  [javadoc]                     ^
  [javadoc] /home/jenkins/jenkins-slave/workspace/POI-DSL-1.14/build/distsourcebuild/poi-4.1.2-SNAPSHOT/src/java/org/apache/poi/util/NullLogger.java:24: warning: empty <p> tag
  [javadoc]  * message.<p>
  [javadoc]            ^
  [javadoc] /home/jenkins/jenkins-slave/workspace/POI-DSL-1.14/build/distsourcebuild/poi-4.1.2-SNAPSHOT/src/java/org/apache/poi/util/CommonsLogger.java:29: warning: empty <p> tag
  [javadoc]  * message.<p>
  [javadoc]            ^
  [javadoc] /home/jenkins/jenkins-slave/workspace/POI-DSL-1.14/build/distsourcebuild/poi-4.1.2-SNAPSHOT/src/scratchpad/src/org/apache/poi/hslf/usermodel/HSLFShape.java:69: warning: empty <p> tag
  [javadoc]  * <p>
  [javadoc]    ^
  [javadoc] /home/jenkins/jenkins-slave/workspace/POI-DSL-1.14/build/distsourcebuild/poi-4.1.2-SNAPSHOT/src/scratchpad/src/org/apache/poi/hslf/record/Sound.java:27: warning: empty <p> tag
  [javadoc]  * <p>
  [javadoc]    ^
  [javadoc] /home/jenkins/jenkins-slave/workspace/POI-DSL-1.14/build/distsourcebuild/poi-4.1.2-SNAPSHOT/src/scratchpad/src/org/apache/poi/hwpf/model/FileInformationBlock.java:36: warning: empty <p> tag
  [javadoc]  *  specify properties of the document.<p>
  [javadoc]                                        ^
  [javadoc] /home/jenkins/jenkins-slave/workspace/POI-DSL-1.14/build/distsourcebuild/poi-4.1.2-SNAPSHOT/src/ooxml/java/org/apache/poi/xdgf/usermodel/section/CombinedIterable.java:30: warning: no description for @param
  [javadoc]  * @param <T>
  [javadoc]    ^
  [javadoc] /home/jenkins/jenkins-slave/workspace/POI-DSL-1.14/build/distsourcebuild/poi-4.1.2-SNAPSHOT/src/ooxml/java/org/apache/poi/xssf/usermodel/extensions/XSSFHeaderFooter.java:48: warning: empty <dt> tag
  [javadoc]  * <dt>&L</dt>
  [javadoc]          ^
  [javadoc] /home/jenkins/jenkins-slave/workspace/POI-DSL-1.14/build/distsourcebuild/poi-4.1.2-SNAPSHOT/src/ooxml/java/org/apache/poi/xssf/usermodel/extensions/XSSFHeaderFooter.java:53: warning: empty <dt> tag
  [javadoc]  * <dt>&P</dt>
  [javadoc]          ^
  [javadoc] /home/jenkins/jenkins-slave/workspace/POI-DSL-1.14/build/distsourcebuild/poi-4.1.2-SNAPSHOT/src/ooxml/java/org/apache/poi/xssf/usermodel/extensions/XSSFHeaderFooter.java:55: warning: empty <dt> tag
  [javadoc]  * <dt>&N</dt>
  [javadoc]          ^
  [javadoc] /home/jenkins/jenkins-slave/workspace/POI-DSL-1.14/build/distsourcebuild/poi-4.1.2-SNAPSHOT/src/ooxml/java/org/apache/poi/xssf/usermodel/extensions/XSSFHeaderFooter.java:59: warning: empty <dt> tag
  [javadoc]  * <dt>&K</dt>
  [javadoc]          ^
  [javadoc] /home/jenkins/jenkins-slave/workspace/POI-DSL-1.14/build/distsourcebuild/poi-4.1.2-SNAPSHOT/src/ooxml/java/org/apache/poi/xssf/usermodel/extensions/XSSFHeaderFooter.java:63: warning: empty <dt> tag
  [javadoc]  * <dt>&S</dt>
  [javadoc]          ^
  [javadoc] /home/jenkins/jenkins-slave/workspace/POI-DSL-1.14/build/distsourcebuild/poi-4.1.2-SNAPSHOT/src/ooxml/java/org/apache/poi/xssf/usermodel/extensions/XSSFHeaderFooter.java:65: warning: empty <dt> tag
  [javadoc]  * <dt>&X</dt>
  [javadoc]          ^
  [javadoc] /home/jenkins/jenkins-slave/workspace/POI-DSL-1.14/build/distsourcebuild/poi-4.1.2-SNAPSHOT/src/ooxml/java/org/apache/poi/xssf/usermodel/extensions/XSSFHeaderFooter.java:67: warning: empty <dt> tag
  [javadoc]  * <dt>&Y</dt>
  [javadoc]          ^
  [javadoc] /home/jenkins/jenkins-slave/workspace/POI-DSL-1.14/build/distsourcebuild/poi-4.1.2-SNAPSHOT/src/ooxml/java/org/apache/poi/xssf/usermodel/extensions/XSSFHeaderFooter.java:69: warning: empty <dt> tag
  [javadoc]  * <dt>&C</dt>
  [javadoc]          ^
  [javadoc] /home/jenkins/jenkins-slave/workspace/POI-DSL-1.14/build/distsourcebuild/poi-4.1.2-SNAPSHOT/src/ooxml/java/org/apache/poi/xssf/usermodel/extensions/XSSFHeaderFooter.java:74: warning: empty <dt> tag
  [javadoc]  * <dt>&D</dt>
  [javadoc]          ^
  [javadoc] /home/jenkins/jenkins-slave/workspace/POI-DSL-1.14/build/distsourcebuild/poi-4.1.2-SNAPSHOT/src/ooxml/java/org/apache/poi/xssf/usermodel/extensions/XSSFHeaderFooter.java:76: warning: empty <dt> tag
  [javadoc]  * <dt>&T</dt>
  [javadoc]          ^
  [javadoc] /home/jenkins/jenkins-slave/workspace/POI-DSL-1.14/build/distsourcebuild/poi-4.1.2-SNAPSHOT/src/ooxml/java/org/apache/poi/xssf/usermodel/extensions/XSSFHeaderFooter.java:78: warning: empty <dt> tag
  [javadoc]  * <dt>&G</dt>
  [javadoc]          ^
  [javadoc] /home/jenkins/jenkins-slave/workspace/POI-DSL-1.14/build/distsourcebuild/poi-4.1.2-SNAPSHOT/src/ooxml/java/org/apache/poi/xssf/usermodel/extensions/XSSFHeaderFooter.java:80: warning: empty <dt> tag
  [javadoc]  * <dt>&U</dt>
  [javadoc]          ^
  [javadoc] /home/jenkins/jenkins-slave/workspace/POI-DSL-1.14/build/distsourcebuild/poi-4.1.2-SNAPSHOT/src/ooxml/java/org/apache/poi/xssf/usermodel/extensions/XSSFHeaderFooter.java:82: warning: empty <dt> tag
  [javadoc]  * <dt>&E</dt>
  [javadoc]          ^
  [javadoc] /home/jenkins/jenkins-slave/workspace/POI-DSL-1.14/build/distsourcebuild/poi-4.1.2-SNAPSHOT/src/ooxml/java/org/apache/poi/xssf/usermodel/extensions/XSSFHeaderFooter.java:84: warning: empty <dt> tag
  [javadoc]  * <dt>&R</dt>
  [javadoc]          ^
  [javadoc] /home/jenkins/jenkins-slave/workspace/POI-DSL-1.14/build/distsourcebuild/poi-4.1.2-SNAPSHOT/src/ooxml/java/org/apache/poi/xssf/usermodel/extensions/XSSFHeaderFooter.java:88: warning: empty <dt> tag
  [javadoc]  * <dt>&Z</dt>
  [javadoc]          ^
  [javadoc] /home/jenkins/jenkins-slave/workspace/POI-DSL-1.14/build/distsourcebuild/poi-4.1.2-SNAPSHOT/src/ooxml/java/org/apache/poi/xssf/usermodel/extensions/XSSFHeaderFooter.java:90: warning: empty <dt> tag
  [javadoc]  * <dt>&F</dt>
  [javadoc]          ^
  [javadoc] /home/jenkins/jenkins-slave/workspace/POI-DSL-1.14/build/distsourcebuild/poi-4.1.2-SNAPSHOT/src/ooxml/java/org/apache/poi/xssf/usermodel/extensions/XSSFHeaderFooter.java:92: warning: empty <dt> tag
  [javadoc]  * <dt>&A</dt>
  [javadoc]          ^
  [javadoc] /home/jenkins/jenkins-slave/workspace/POI-DSL-1.14/build/distsourcebuild/poi-4.1.2-SNAPSHOT/src/ooxml/java/org/apache/poi/xssf/usermodel/extensions/XSSFHeaderFooter.java:105: warning: empty <dt> tag
  [javadoc]  * <dt>&B</dt>
  [javadoc]          ^
  [javadoc] /home/jenkins/jenkins-slave/workspace/POI-DSL-1.14/build/distsourcebuild/poi-4.1.2-SNAPSHOT/src/ooxml/java/org/apache/poi/xssf/usermodel/extensions/XSSFHeaderFooter.java:111: warning: empty <dt> tag
  [javadoc]  * <dt>&I</dt>
  [javadoc]          ^
  [javadoc] /home/jenkins/jenkins-slave/workspace/POI-DSL-1.14/build/distsourcebuild/poi-4.1.2-SNAPSHOT/src/ooxml/java/org/apache/poi/xssf/usermodel/extensions/XSSFHeaderFooter.java:115: warning: empty <dt> tag
  [javadoc]  * <dt>&O</dt>
  [javadoc]          ^
  [javadoc] /home/jenkins/jenkins-slave/workspace/POI-DSL-1.14/build/distsourcebuild/poi-4.1.2-SNAPSHOT/src/ooxml/java/org/apache/poi/xssf/usermodel/extensions/XSSFHeaderFooter.java:117: warning: empty <dt> tag
  [javadoc]  * <dt>&H</dt>
  [javadoc]          ^
  [javadoc] /home/jenkins/jenkins-slave/workspace/POI-DSL-1.14/build/distsourcebuild/poi-4.1.2-SNAPSHOT/src/ooxml/java/org/apache/poi/xwpf/usermodel/XWPFParagraph.java:33: warning: empty <p> tag
  [javadoc]  * <p>
  [javadoc]    ^
  [javadoc] /home/jenkins/jenkins-slave/workspace/POI-DSL-1.14/build/distsourcebuild/poi-4.1.2-SNAPSHOT/src/ooxml/java/org/apache/poi/xwpf/usermodel/XWPFDocument.java:91: warning: empty <p> tag
  [javadoc]  * <p>
  [javadoc]    ^
  [javadoc] /home/jenkins/jenkins-slave/workspace/POI-DSL-1.14/build/distsourcebuild/poi-4.1.2-SNAPSHOT/src/ooxml/java/org/apache/poi/xwpf/usermodel/ISDTContent.java:23: warning: empty <p> tag
  [javadoc]  * <p>
  [javadoc]    ^
  [javadoc] /home/jenkins/jenkins-slave/workspace/POI-DSL-1.14/build/distsourcebuild/poi-4.1.2-SNAPSHOT/src/ooxml/java/org/apache/poi/xwpf/usermodel/ISDTContent.java:24: warning: empty <p> tag
  [javadoc]  * <p>
  [javadoc]    ^
  [javadoc] /home/jenkins/jenkins-slave/workspace/POI-DSL-1.14/build/distsourcebuild/poi-4.1.2-SNAPSHOT/src/ooxml/java/org/apache/poi/xwpf/usermodel/XWPFSDTContent.java:34: warning: empty <p> tag
  [javadoc]  * <p>
  [javadoc]    ^
  [javadoc] /home/jenkins/jenkins-slave/workspace/POI-DSL-1.14/build/distsourcebuild/poi-4.1.2-SNAPSHOT/src/ooxml/java/org/apache/poi/xwpf/usermodel/XWPFSDTContent.java:35: warning: empty <p> tag
  [javadoc]  * <p>
  [javadoc]    ^
  [javadoc] /home/jenkins/jenkins-slave/workspace/POI-DSL-1.14/build/distsourcebuild/poi-4.1.2-SNAPSHOT/src/java/org/apache/poi/ddf/EscherProperty.java:75: warning: no @param for type
  [javadoc]     protected EscherProperty(EscherPropertyTypes type, boolean isComplex, boolean isBlipId) {
  [javadoc]               ^
  [javadoc] /home/jenkins/jenkins-slave/workspace/POI-DSL-1.14/build/distsourcebuild/poi-4.1.2-SNAPSHOT/src/java/org/apache/poi/ddf/EscherSimpleProperty.java:80: warning: no @param for type
  [javadoc]     public EscherSimpleProperty( EscherPropertyTypes type, boolean isComplex, boolean isBlipId, int propertyValue ) {
  [javadoc]            ^
  [javadoc] /home/jenkins/jenkins-slave/workspace/POI-DSL-1.14/build/distsourcebuild/poi-4.1.2-SNAPSHOT/src/scratchpad/src/org/apache/poi/hslf/record/Record.java:51: warning: no @return
  [javadoc] public abstract boolean isAnAtom();
  [javadoc]                        ^
  [javadoc] /home/jenkins/jenkins-slave/workspace/POI-DSL-1.14/build/distsourcebuild/poi-4.1.2-SNAPSHOT/src/scratchpad/src/org/apache/poi/hslf/record/Record.java:57: warning: no @return
  [javadoc] public abstract long getRecordType();
  [javadoc]                     ^
  [javadoc] /home/jenkins/jenkins-slave/workspace/POI-DSL-1.14/build/distsourcebuild/poi-4.1.2-SNAPSHOT/src/scratchpad/src/org/apache/poi/hslf/record/Record.java:65: warning: no @return
  [javadoc] public abstract Record[] getChildRecords();
  [javadoc]                         ^
  [javadoc] /home/jenkins/jenkins-slave/workspace/POI-DSL-1.14/build/distsourcebuild/poi-4.1.2-SNAPSHOT/src/scratchpad/src/org/apache/poi/hslf/record/Record.java:74: warning: no @param for o
  [javadoc] public abstract void writeOut(OutputStream o) throws IOException;
  [javadoc]                     ^
  [javadoc] /home/jenkins/jenkins-slave/workspace/POI-DSL-1.14/build/distsourcebuild/poi-4.1.2-SNAPSHOT/src/scratchpad/src/org/apache/poi/hslf/record/Record.java:74: warning: no @throws for java.io.IOException
  [javadoc] public abstract void writeOut(OutputStream o) throws IOException;
  [javadoc]                     ^
  [javadoc] Building index for all the packages and classes...
ERROR: command execution failed.
ERROR: Step ?[Deprecated] Publish FindBugs analysis results? failed: no workspace for POI-DSL-1.14 #1
ERROR: Step ?Archive the artifacts? failed: no workspace for POI-DSL-1.14 #1
ERROR: Step ?[Deprecated] Scan for compiler warnings? failed: no workspace for POI-DSL-1.14 #1
ERROR: Step ?Publish JUnit test result report? failed: no workspace for POI-DSL-1.14 #1
ERROR: Step ?Record JaCoCo coverage report? failed: no workspace for POI-DSL-1.14 #1
ERROR: H22 is offline; cannot locate JDK 14 (latest)

---------------------------------------------------------------------
To unsubscribe, e-mail: [hidden email]
For additional commands, e-mail: [hidden email]

Reply | Threaded
Open this post in threaded view
|

Build failed in Jenkins: POI-DSL-1.14 #2

Apache Jenkins Server
See <https://builds.apache.org/job/POI-DSL-1.14/2/display/redirect?page=changes>

Changes:

[fanningpj] try to fix some jdk 14 build issues due to java.lang.Record causing existing POI Record classes to be ambiguous


------------------------------------------
[...truncated 155.53 KB...]
    [junit] Running org.apache.poi.xssf.usermodel.TestXSSFComment
    [junit] Tests run: 19, Failures: 0, Errors: 0, Skipped: 1, Time elapsed: 0.137 sec
    [junit] Running org.apache.poi.xssf.usermodel.TestXSSFConditionalFormatting
    [junit] Tests run: 23, Failures: 0, Errors: 0, Skipped: 0, Time elapsed: 0.094 sec
    [junit] Running org.apache.poi.xssf.usermodel.TestXSSFDataFormat
    [junit] Tests run: 8, Failures: 0, Errors: 0, Skipped: 0, Time elapsed: 0.038 sec
    [junit] Running org.apache.poi.xssf.usermodel.TestXSSFDataValidation
    [junit] Tests run: 9, Failures: 0, Errors: 0, Skipped: 0, Time elapsed: 0.26 sec
    [junit] Running org.apache.poi.xssf.usermodel.TestXSSFDataValidationConstraint
    [junit] Tests run: 4, Failures: 0, Errors: 0, Skipped: 0, Time elapsed: 0.001 sec
    [junit] Running org.apache.poi.xssf.usermodel.TestXSSFDialogSheet
    [junit] Tests run: 14, Failures: 0, Errors: 0, Skipped: 0, Time elapsed: 0.039 sec
    [junit] Running org.apache.poi.xssf.usermodel.TestXSSFDrawing
    [junit] Tests run: 21, Failures: 0, Errors: 0, Skipped: 0, Time elapsed: 0.299 sec
    [junit] Running org.apache.poi.xssf.usermodel.TestXSSFEvaluationSheet
    [junit] Tests run: 2, Failures: 0, Errors: 0, Skipped: 0, Time elapsed: 0.003 sec
    [junit] Running org.apache.poi.xssf.usermodel.TestXSSFEvenFooter
    [junit] Tests run: 1, Failures: 0, Errors: 0, Skipped: 0, Time elapsed: 0.002 sec
    [junit] Running org.apache.poi.xssf.usermodel.TestXSSFEvenHeader
    [junit] Tests run: 1, Failures: 0, Errors: 0, Skipped: 0, Time elapsed: 0.002 sec
    [junit] Running org.apache.poi.xssf.usermodel.TestXSSFExternalFunctions
    [junit] Tests run: 2, Failures: 0, Errors: 0, Skipped: 0, Time elapsed: 0.01 sec
    [junit] Running org.apache.poi.xssf.usermodel.TestXSSFFirstFooter
    [junit] Tests run: 1, Failures: 0, Errors: 0, Skipped: 0, Time elapsed: 0.002 sec
    [junit] Running org.apache.poi.xssf.usermodel.TestXSSFFirstHeader
    [junit] Tests run: 1, Failures: 0, Errors: 0, Skipped: 0, Time elapsed: 0.002 sec
    [junit] Running org.apache.poi.xssf.usermodel.TestXSSFFont
    [junit] Tests run: 22, Failures: 0, Errors: 0, Skipped: 0, Time elapsed: 0.041 sec
    [junit] Running org.apache.poi.xssf.usermodel.TestXSSFForkedEvaluator
    [junit] Tests run: 2, Failures: 0, Errors: 0, Skipped: 0, Time elapsed: 0.011 sec
    [junit] Running org.apache.poi.xssf.usermodel.TestXSSFFormulaEvaluation
    [junit] Tests run: 38, Failures: 0, Errors: 0, Skipped: 3, Time elapsed: 0.977 sec
    [junit] Running org.apache.poi.xssf.usermodel.TestXSSFFormulaParser
    [junit] Tests run: 12, Failures: 0, Errors: 0, Skipped: 0, Time elapsed: 0.052 sec
    [junit] Running org.apache.poi.xssf.usermodel.TestXSSFHeaderFooterProperties
    [junit] Tests run: 8, Failures: 0, Errors: 0, Skipped: 0, Time elapsed: 0.012 sec
    [junit] Running org.apache.poi.xssf.usermodel.TestXSSFHyperlink
    [junit] Tests run: 12, Failures: 0, Errors: 0, Skipped: 0, Time elapsed: 0.143 sec
    [junit] Running org.apache.poi.xssf.usermodel.TestXSSFName
    [junit] Tests run: 26, Failures: 0, Errors: 0, Skipped: 0, Time elapsed: 0.207 sec
    [junit] Running org.apache.poi.xssf.usermodel.TestXSSFOddFooter
    [junit] Tests run: 1, Failures: 0, Errors: 0, Skipped: 0, Time elapsed: 0.002 sec
    [junit] Running org.apache.poi.xssf.usermodel.TestXSSFOddHeader
    [junit] Tests run: 1, Failures: 0, Errors: 0, Skipped: 0, Time elapsed: 0.002 sec
    [junit] Running org.apache.poi.xssf.usermodel.TestXSSFPicture
    [junit] Tests run: 6, Failures: 0, Errors: 0, Skipped: 0, Time elapsed: 0.036 sec
    [junit] Running org.apache.poi.xssf.usermodel.TestXSSFPictureData
    [junit] Tests run: 3, Failures: 0, Errors: 0, Skipped: 0, Time elapsed: 0.045 sec
    [junit] Running org.apache.poi.xssf.usermodel.TestXSSFPivotTableName
    [junit] Tests run: 18, Failures: 0, Errors: 0, Skipped: 0, Time elapsed: 0.354 sec
    [junit] Running org.apache.poi.xssf.usermodel.TestXSSFPivotTableRef
    [junit] Tests run: 18, Failures: 0, Errors: 0, Skipped: 0, Time elapsed: 0.29 sec
    [junit] Running org.apache.poi.xssf.usermodel.TestXSSFPrintSetup
    [junit] Tests run: 19, Failures: 0, Errors: 0, Skipped: 0, Time elapsed: 0.016 sec
    [junit] Running org.apache.poi.xssf.usermodel.TestXSSFRichTextString
    [junit] Tests run: 18, Failures: 0, Errors: 0, Skipped: 0, Time elapsed: 0.023 sec
    [junit] Running org.apache.poi.xssf.usermodel.TestXSSFRow
    [junit] Tests run: 18, Failures: 0, Errors: 0, Skipped: 0, Time elapsed: 0.245 sec
    [junit] Running org.apache.poi.xssf.usermodel.TestXSSFShape
    [junit] Tests run: 2, Failures: 0, Errors: 0, Skipped: 0, Time elapsed: 0.037 sec
    [junit] Running org.apache.poi.xssf.usermodel.TestXSSFSheet
    [junit] Tests run: 95, Failures: 0, Errors: 0, Skipped: 0, Time elapsed: 6.873 sec
    [junit] Running org.apache.poi.xssf.usermodel.TestXSSFSheetAutosizeColumn
    [junit] Tests run: 7, Failures: 0, Errors: 0, Skipped: 0, Time elapsed: 0.051 sec
    [junit] Running org.apache.poi.xssf.usermodel.TestXSSFSheetMergeRegions
    [junit] Tests run: 1, Failures: 0, Errors: 0, Skipped: 0, Time elapsed: 0.905 sec
    [junit] Running org.apache.poi.xssf.usermodel.TestXSSFSheetRowGrouping
    [junit] Tests run: 6, Failures: 0, Errors: 0, Skipped: 0, Time elapsed: 0.131 sec
    [junit] Running org.apache.poi.xssf.usermodel.TestXSSFSheetShiftColumns
    [junit] Tests run: 10, Failures: 0, Errors: 0, Skipped: 0, Time elapsed: 0.064 sec
    [junit] Running org.apache.poi.xssf.usermodel.TestXSSFSheetShiftRows
    [junit] Tests run: 34, Failures: 0, Errors: 0, Skipped: 3, Time elapsed: 28.007 sec
    [junit] Running org.apache.poi.xssf.usermodel.TestXSSFSheetShiftRowsAndColumns
    [junit] Tests run: 5, Failures: 0, Errors: 0, Skipped: 2, Time elapsed: 0.017 sec
    [junit] Running org.apache.poi.xssf.usermodel.TestXSSFSheetUpdateArrayFormulas
    [junit] Tests run: 18, Failures: 0, Errors: 0, Skipped: 1, Time elapsed: 0.038 sec
    [junit] Running org.apache.poi.xssf.usermodel.TestXSSFSimpleShape
    [junit] Tests run: 1, Failures: 0, Errors: 0, Skipped: 0, Time elapsed: 0.011 sec
    [junit] Running org.apache.poi.xssf.usermodel.TestXSSFTable
    [junit] Tests run: 30, Failures: 0, Errors: 0, Skipped: 0, Time elapsed: 0.173 sec
    [junit] Running org.apache.poi.xssf.usermodel.TestXSSFTableColumn
    [junit] Tests run: 3, Failures: 0, Errors: 0, Skipped: 0, Time elapsed: 0.026 sec
    [junit] Running org.apache.poi.xssf.usermodel.TestXSSFTextParagraph
    [junit] Tests run: 1, Failures: 0, Errors: 0, Skipped: 0, Time elapsed: 0.011 sec
    [junit] Running org.apache.poi.xssf.usermodel.TestXSSFTextRun
    [junit] Tests run: 1, Failures: 0, Errors: 0, Skipped: 0, Time elapsed: 0.005 sec
    [junit] Running org.apache.poi.xssf.usermodel.TestXSSFUnicodeSurrogates
    [junit] Tests run: 1, Failures: 0, Errors: 0, Skipped: 0, Time elapsed: 0.008 sec
    [junit] Running org.apache.poi.xssf.usermodel.TestXSSFVMLDrawing
    [junit] Tests run: 4, Failures: 0, Errors: 0, Skipped: 0, Time elapsed: 0.062 sec
    [junit] Running org.apache.poi.xssf.usermodel.TestXSSFWorkbook
    [junit] Tests run: 62, Failures: 0, Errors: 0, Skipped: 0, Time elapsed: 0.578 sec
    [junit] Running org.apache.poi.xssf.usermodel.charts.TestXSSFCategoryAxis
    [junit] Tests run: 1, Failures: 0, Errors: 0, Skipped: 0, Time elapsed: 0.005 sec
    [junit] Running org.apache.poi.xssf.usermodel.charts.TestXSSFChartAxis
    [junit] Tests run: 8, Failures: 0, Errors: 0, Skipped: 0, Time elapsed: 0.031 sec
    [junit] Running org.apache.poi.xssf.usermodel.charts.TestXSSFChartLegend
    [junit] Tests run: 3, Failures: 0, Errors: 0, Skipped: 0, Time elapsed: 0.008 sec
    [junit] Running org.apache.poi.xssf.usermodel.charts.TestXSSFChartTitle
    [junit] Tests run: 4, Failures: 0, Errors: 0, Skipped: 0, Time elapsed: 0.026 sec
    [junit] Running org.apache.poi.xssf.usermodel.charts.TestXSSFDateAxis
    [junit] Tests run: 1, Failures: 0, Errors: 0, Skipped: 0, Time elapsed: 0.007 sec
    [junit] Running org.apache.poi.xssf.usermodel.charts.TestXSSFLineChartData
    [junit] Tests run: 1, Failures: 0, Errors: 0, Skipped: 0, Time elapsed: 0.005 sec
    [junit] Running org.apache.poi.xssf.usermodel.charts.TestXSSFManualLayout
    [junit] Tests run: 2, Failures: 0, Errors: 0, Skipped: 0, Time elapsed: 0.006 sec
    [junit] Running org.apache.poi.xssf.usermodel.charts.TestXSSFScatterChartData
    [junit] Tests run: 1, Failures: 0, Errors: 0, Skipped: 0, Time elapsed: 0.005 sec
    [junit] Running org.apache.poi.xssf.usermodel.charts.TestXSSFValueAxis
    [junit] Tests run: 1, Failures: 0, Errors: 0, Skipped: 0, Time elapsed: 0.003 sec
    [junit] Running org.apache.poi.xssf.usermodel.extensions.TestXSSFBorder
    [junit] Tests run: 1, Failures: 0, Errors: 0, Skipped: 0, Time elapsed: 0.002 sec
    [junit] Running org.apache.poi.xssf.usermodel.extensions.TestXSSFCellFill
    [junit] Tests run: 6, Failures: 0, Errors: 0, Skipped: 0, Time elapsed: 0.018 sec
    [junit] Running org.apache.poi.xssf.usermodel.extensions.TestXSSFHeaderFooter
    [junit] Tests run: 10, Failures: 0, Errors: 0, Skipped: 0, Time elapsed: 0.018 sec
    [junit] Running org.apache.poi.xssf.usermodel.helpers.TestColumnHelper
    [junit] Tests run: 16, Failures: 0, Errors: 0, Skipped: 0, Time elapsed: 0.02 sec
    [junit] Running org.apache.poi.xssf.usermodel.helpers.TestHeaderFooterHelper
    [junit] Tests run: 2, Failures: 0, Errors: 0, Skipped: 0, Time elapsed: 0.001 sec
    [junit] Running org.apache.poi.xssf.usermodel.helpers.TestXSSFColumnShifting
    [junit] Tests run: 2, Failures: 0, Errors: 0, Skipped: 0, Time elapsed: 0.003 sec
    [junit] Running org.apache.poi.xssf.util.TestCTColComparator
    [junit] Tests run: 2, Failures: 0, Errors: 0, Skipped: 0, Time elapsed: 0.001 sec
    [junit] Running org.apache.poi.xssf.util.TestEvilUnclosedBRFixingInputStream
    [junit] Tests run: 3, Failures: 0, Errors: 0, Skipped: 0, Time elapsed: 0.002 sec
    [junit] Running org.apache.poi.xssf.util.TestNumericRanges
    [junit] Tests run: 2, Failures: 0, Errors: 0, Skipped: 0, Time elapsed: 0.001 sec
    [junit] Running org.apache.poi.xwpf.TestAllExtendedProperties
    [junit] Tests run: 1, Failures: 0, Errors: 0, Skipped: 0, Time elapsed: 0.021 sec
    [junit] Running org.apache.poi.xwpf.TestDocumentProtection
    [junit] Tests run: 10, Failures: 0, Errors: 0, Skipped: 0, Time elapsed: 0.316 sec
    [junit] Running org.apache.poi.xwpf.TestNecessaryOOXMLClasses
    [junit] Tests run: 1, Failures: 0, Errors: 0, Skipped: 0, Time elapsed: 0.007 sec
    [junit] Running org.apache.poi.xwpf.TestPackageCorePropertiesGetKeywords
    [junit] Tests run: 1, Failures: 0, Errors: 0, Skipped: 0, Time elapsed: 0.014 sec
    [junit] Running org.apache.poi.xwpf.TestXWPFBugs
    [junit] Tests run: 4, Failures: 0, Errors: 0, Skipped: 0, Time elapsed: 0.215 sec
    [junit] Running org.apache.poi.xwpf.extractor.TestExternalEntities
    [junit] Tests run: 1, Failures: 0, Errors: 0, Skipped: 0, Time elapsed: 0.007 sec
    [junit] Running org.apache.poi.xwpf.extractor.TestXWPFWordExtractor
    [junit] Tests run: 23, Failures: 0, Errors: 0, Skipped: 0, Time elapsed: 0.46 sec
    [junit] Running org.apache.poi.xwpf.model.TestXWPFDecorators
    [junit] Tests run: 2, Failures: 0, Errors: 0, Skipped: 0, Time elapsed: 0.054 sec
    [junit] Running org.apache.poi.xwpf.model.TestXWPFHeaderFooterPolicy
    [junit] Tests run: 3, Failures: 0, Errors: 0, Skipped: 0, Time elapsed: 0.154 sec
    [junit] Running org.apache.poi.xwpf.usermodel.TestChangeTracking
    [junit] Tests run: 3, Failures: 0, Errors: 0, Skipped: 0, Time elapsed: 0.023 sec
    [junit] Running org.apache.poi.xwpf.usermodel.TestXWPFBugs
    [junit] Tests run: 10, Failures: 0, Errors: 0, Skipped: 0, Time elapsed: 0.248 sec
    [junit] Running org.apache.poi.xwpf.usermodel.TestXWPFChart
    [junit] Tests run: 4, Failures: 0, Errors: 0, Skipped: 0, Time elapsed: 0.05 sec
    [junit] Running org.apache.poi.xwpf.usermodel.TestXWPFComment
    [junit] Tests run: 1, Failures: 0, Errors: 0, Skipped: 0, Time elapsed: 0.006 sec
    [junit] Running org.apache.poi.xwpf.usermodel.TestXWPFDocument
    [junit] Tests run: 21, Failures: 0, Errors: 0, Skipped: 1, Time elapsed: 0.289 sec
    [junit] Running org.apache.poi.xwpf.usermodel.TestXWPFEndnote
    [junit] Tests run: 4, Failures: 0, Errors: 0, Skipped: 0, Time elapsed: 0.024 sec
    [junit] Running org.apache.poi.xwpf.usermodel.TestXWPFEndnotes
    [junit] Tests run: 2, Failures: 0, Errors: 0, Skipped: 0, Time elapsed: 0.013 sec
    [junit] Running org.apache.poi.xwpf.usermodel.TestXWPFFootnote
    [junit] Tests run: 4, Failures: 0, Errors: 0, Skipped: 0, Time elapsed: 0.019 sec
    [junit] Running org.apache.poi.xwpf.usermodel.TestXWPFFootnotes
    [junit] Tests run: 3, Failures: 0, Errors: 0, Skipped: 0, Time elapsed: 0.02 sec
    [junit] Running org.apache.poi.xwpf.usermodel.TestXWPFHeader
    [junit] Tests run: 9, Failures: 0, Errors: 0, Skipped: 0, Time elapsed: 0.088 sec
    [junit] Running org.apache.poi.xwpf.usermodel.TestXWPFHeadings
    [junit] Tests run: 1, Failures: 0, Errors: 0, Skipped: 0, Time elapsed: 0.033 sec
    [junit] Running org.apache.poi.xwpf.usermodel.TestXWPFNumbering
    [junit] Tests run: 6, Failures: 0, Errors: 0, Skipped: 0, Time elapsed: 0.061 sec
    [junit] Running org.apache.poi.xwpf.usermodel.TestXWPFParagraph
    [junit] Tests run: 24, Failures: 0, Errors: 0, Skipped: 0, Time elapsed: 0.131 sec
    [junit] Running org.apache.poi.xwpf.usermodel.TestXWPFPictureData
    [junit] Tests run: 5, Failures: 0, Errors: 0, Skipped: 0, Time elapsed: 0.099 sec
    [junit] Running org.apache.poi.xwpf.usermodel.TestXWPFRun
    [junit] Tests run: 33, Failures: 0, Errors: 0, Skipped: 0, Time elapsed: 0.169 sec
    [junit] Running org.apache.poi.xwpf.usermodel.TestXWPFSDT
    [junit] Tests run: 6, Failures: 0, Errors: 0, Skipped: 0, Time elapsed: 0.061 sec
    [junit] Running org.apache.poi.xwpf.usermodel.TestXWPFSmartTag
    [junit] Tests run: 1, Failures: 0, Errors: 0, Skipped: 0, Time elapsed: 0.007 sec
    [junit] Running org.apache.poi.xwpf.usermodel.TestXWPFStyles
    [junit] Tests run: 10, Failures: 0, Errors: 0, Skipped: 0, Time elapsed: 0.066 sec
    [junit] Running org.apache.poi.xwpf.usermodel.TestXWPFTable
    [junit] Tests run: 17, Failures: 0, Errors: 0, Skipped: 0, Time elapsed: 0.055 sec
    [junit] Running org.apache.poi.xwpf.usermodel.TestXWPFTableCell
    [junit] Tests run: 6, Failures: 0, Errors: 0, Skipped: 1, Time elapsed: 0.022 sec
    [junit] Running org.apache.poi.xwpf.usermodel.TestXWPFTableRow
    [junit] Tests run: 6, Failures: 0, Errors: 0, Skipped: 0, Time elapsed: 0.021 sec
   [script] Warning: Nashorn engine is planned to be removed from a future JDK release
[jacoco:coverage] Enhancing junit with coverage
    [junit] Running org.apache.poi.poifs.crypt.TestSignatureInfo
    [junit] Tests run: 14, Failures: 0, Errors: 0, Skipped: 1, Time elapsed: 9.116 sec
[propertyreset] Warning: Nashorn engine is planned to be removed from a future JDK release
[propertyreset] Warning: Nashorn engine is planned to be removed from a future JDK release

-test-ooxml-write-testfile:

-test-excelant-check:

test-excelant:
   [script] Warning: Nashorn engine is planned to be removed from a future JDK release
[jacoco:coverage] Enhancing junit with coverage
    [junit] Running org.apache.poi.ss.examples.formula.TestExcelAntUserDefinedFunction
    [junit] Tests run: 2, Failures: 0, Errors: 0, Skipped: 0, Time elapsed: 0.141 sec
    [junit] Running org.apache.poi.ss.excelant.TestBuildFile
    [junit] Tests run: 14, Failures: 0, Errors: 0, Skipped: 0, Time elapsed: 2.033 sec
    [junit] Running org.apache.poi.ss.excelant.TestExcelAntPrecision
    [junit] Tests run: 1, Failures: 0, Errors: 0, Skipped: 0, Time elapsed: 0.004 sec
    [junit] Running org.apache.poi.ss.excelant.TestExcelAntSet
    [junit] Tests run: 2, Failures: 0, Errors: 0, Skipped: 0, Time elapsed: 0.018 sec
    [junit] Running org.apache.poi.ss.excelant.TestExcelAntSetDoubleCell
    [junit] Tests run: 1, Failures: 0, Errors: 0, Skipped: 0, Time elapsed: 0.003 sec
    [junit] Running org.apache.poi.ss.excelant.util.TestExcelAntEvaluationResult
    [junit] Tests run: 4, Failures: 0, Errors: 0, Skipped: 0, Time elapsed: 0.004 sec
    [junit] Running org.apache.poi.ss.excelant.util.TestExcelAntWorkbookUtil
    [junit] Tests run: 23, Failures: 0, Errors: 0, Skipped: 0, Time elapsed: 0.936 sec
    [junit] Running org.apache.poi.ss.excelant.util.TestExcelAntWorkbookUtilFactory
    [junit] Tests run: 2, Failures: 0, Errors: 0, Skipped: 0, Time elapsed: 0.005 sec
[propertyreset] Warning: Nashorn engine is planned to be removed from a future JDK release
[propertyreset] Warning: Nashorn engine is planned to be removed from a future JDK release

-test-excelant-write-testfile:

test:

compile-integration:
    [javac] Compiling 26 source files to <https://builds.apache.org/job/POI-DSL-1.14/ws/build/integration-test-classes>
    [javac] warning: [options] bootstrap class path not set in conjunction with -source 8
    [javac] <https://builds.apache.org/job/POI-DSL-1.14/ws/src/integrationtest/org/apache/poi/stress/HSLFFileHandler.java>:39: error: incompatible types: org.apache.poi.hslf.record.Record[] cannot be converted to org.apache.poi.hssf.record.Record[]
    [javac]         org.apache.poi.hssf.record.Record[] records = slide.getRecords();
    [javac]                                                                       ^
    [javac] <https://builds.apache.org/job/POI-DSL-1.14/ws/src/integrationtest/org/apache/poi/stress/HSLFFileHandler.java>:43: error: cannot find symbol
    [javac]             assertTrue(record.getRecordType() >= 0);
    [javac]                              ^
    [javac]   symbol:   method getRecordType()
    [javac]   location: variable record of type Record
    [javac] 2 errors
    [javac] 1 warning

BUILD FAILED
<https://builds.apache.org/job/POI-DSL-1.14/ws/build.xml>:1369: Compile failed; see the compiler error output for details.

Total time: 9 minutes 18 seconds
Build step 'Invoke Ant' marked build as failure
Skipping publisher since build result is FAILURE
Archiving artifacts
[Fast Archiver] No prior successful build to compare, so performing full copy of artifacts
Skipping publisher since build result is FAILURE
Recording test results

---------------------------------------------------------------------
To unsubscribe, e-mail: [hidden email]
For additional commands, e-mail: [hidden email]

Reply | Threaded
Open this post in threaded view
|

Jenkins build is back to normal : POI-DSL-1.14 #3

Apache Jenkins Server
See <https://builds.apache.org/job/POI-DSL-1.14/3/display/redirect?page=changes>


---------------------------------------------------------------------
To unsubscribe, e-mail: [hidden email]
For additional commands, e-mail: [hidden email]