Build failed in Jenkins: POI-DSL-1.12 #1

classic Classic list List threaded Threaded
7 messages Options
Reply | Threaded
Open this post in threaded view
|

Build failed in Jenkins: POI-DSL-1.12 #1

Apache Jenkins Server
See <https://builds.apache.org/job/POI-DSL-1.12/1/display/redirect>

------------------------------------------
[...truncated 368.38 KB...]
AU        src/documentation/resources/images/logoLoicLefevre2.png
A         src/documentation/resources/images/project-header.svg
AU        src/documentation/resources/images/POIFSAddDocument.gif
AU        src/documentation/resources/images/logoKarmokar1.png
AU        src/documentation/resources/images/logoKarmokar2.png
AU        src/documentation/resources/images/logoKarmokar3.png
AU        src/documentation/resources/images/logoKarmokar4.png
AU        src/documentation/resources/images/logoKarmokar5.png
AU        src/documentation/resources/images/logoKarmokar6.png
AU        src/documentation/resources/images/ApacheConEu08.jpg
AU        src/documentation/resources/images/logoLoicLefevre.png
AU        src/documentation/resources/images/POIFSWriteFilesystem.gif
AU        src/documentation/resources/images/logoWendyWise2.png
AU        src/documentation/resources/images/POIFSLifeCycle.gif
AU        src/documentation/resources/images/logoAdria1.png
AU        src/documentation/resources/images/logoAdria2.png
AU        src/documentation/resources/images/logoAdria3.png
AU        src/documentation/resources/images/poi-logo.png
AU        src/documentation/resources/images/BlockClassDiagram.gif
AU        src/documentation/resources/images/PropertyTableClassDiagram.gif
AU        src/documentation/resources/images/remove.jpg
AU        src/documentation/resources/images/PropertySet.jpg
AU        src/documentation/resources/images/vba-example.jpg
AU        src/documentation/resources/images/logoKarmokar3s.png
AU        src/documentation/resources/images/businessplan.jpg
AU        src/documentation/resources/images/logoJanssen1.png
AU        src/documentation/resources/images/logoJanssen2.png
AU        src/documentation/resources/images/calendar.jpg
AU        src/documentation/resources/images/loancalc.jpg
AU        src/documentation/resources/images/pb-poi.cdr
AU        src/documentation/resources/images/logoDanielFernandez.png
AU        src/documentation/resources/images/logoRaPiGmbH10.png
AU        src/documentation/resources/images/POIFSClassDiagram.gif
AU        src/documentation/resources/images/logoRaPiGmbH11.png
AU        src/documentation/resources/images/logoMichaelMosmann.png
AU        src/documentation/resources/images/logoRaPiGmbH12.png
AU        src/documentation/resources/images/POIFSWriteArchive.gif
AU        src/documentation/resources/images/logoAndrewClements2.png
AU        src/documentation/resources/images/hslf_shapes.gif
AU        src/documentation/resources/images/timesheet.jpg
AU        src/documentation/resources/images/built-with-forrest-button.png
AU        src/documentation/resources/images/support-asf.png
AU        src/documentation/resources/images/simple-xls-with-function.jpg
AU        src/documentation/resources/images/POIFSRootPropertyPreWrite.gif
AU        src/documentation/resources/images/logoAndrewClements.png
AU        src/documentation/resources/images/logoWendyWise.png
AU        src/documentation/resources/images/logoKarmokar4s.png
AU        src/documentation/README.txt
A         src/documentation/classes
A         src/documentation/classes/CatalogManager.properties
At revision 1842599

At revision 1842599

No JDK named ?JDK 12 (latest)? found
[POI-DSL-1.12] $ /bin/bash -xe /tmp/jenkins7326213354600752790.sh
+ svn status
    X   forrest.properties
X       src/documentation

Performing status on external item at 'src/documentation':
+ echo Java-Home:
Java-Home:
+ ls -al /
total 38920
drwxr-xr-x  25 root root     4096 Oct  2 06:44 .
drwxr-xr-x  25 root root     4096 Oct  2 06:44 ..
drwxr-xr-x   2 root root     4096 Sep 12 06:39 bin
drwxr-xr-x   3 root root     4096 Oct  2 06:45 boot
-rw-r--r--   1 root root      141 Nov 11  2017 chboot
drwxr-xr-x  19 root root     4100 Oct  1 21:06 dev
drwxr-xr-x 125 root root    12288 Oct  2 08:12 etc
drwxr-xr-x  17 root root     4096 Jan 22  2018 home
lrwxrwxrwx   1 root root       33 Oct  2 06:44 initrd.img -> boot/initrd.img-4.4.0-137-generic
lrwxrwxrwx   1 root root       33 Sep 11 06:31 initrd.img.old -> boot/initrd.img-4.4.0-135-generic
drwxr-xr-x  17 root root     4096 Jan 18  2018 lib
drwxr-xr-x   2 root root    12288 Jan 18  2018 lib32
drwxr-xr-x   2 root root     4096 Jan 18  2018 lib64
drwxr-xr-x   2 root root    12288 Jan 18  2018 libx32
drwx------   2 root root    16384 Nov 11  2017 lost+found
drwxr-xr-x   2 root root     4096 Sep 11 08:36 media
drwxr-xr-x   2 root root     4096 Nov 11  2017 mnt
drwxr-xr-x   3 root root     4096 Nov 12  2017 opt
dr-xr-xr-x 353 root root        0 Aug 22 21:39 proc
drwxr-xr-x   6 root root     4096 Aug 10 10:49 root
drwxr-xr-x  26 root root     1040 Oct  2 06:11 run
drwxr-xr-x   2 root root     4096 Jul 31 06:28 sbin
drwxr-xr-x   6 root root     4096 Aug 10 10:49 snap
drwxr-xr-x   2 root root     4096 Nov 11  2017 srv
dr-xr-xr-x  13 root root        0 Aug 22 21:40 sys
drwxrwxrwt   1 root root 39718912 Oct  2 08:22 tmp
drwxr-xr-x  14 root root     4096 Nov 12  2017 usr
drwxr-xr-x  13 root root     4096 Jul 15 01:18 var
lrwxrwxrwx   1 root root       30 Oct  2 06:44 vmlinuz -> boot/vmlinuz-4.4.0-137-generic
lrwxrwxrwx   1 root root       30 Sep 11 06:31 vmlinuz.old -> boot/vmlinuz-4.4.0-135-generic
+ ls -al /bin
total 10520
drwxr-xr-x  2 root root    4096 Sep 12 06:39 .
drwxr-xr-x 25 root root    4096 Oct  2 06:44 ..
-rwxr-xr-x  1 root root 1037528 May 16  2017 bash
-rwxr-xr-x  3 root root   31288 May 20  2015 bunzip2
-rwxr-xr-x  3 root root   31288 May 20  2015 bzcat
lrwxrwxrwx  1 root root       6 May 20  2015 bzcmp -> bzdiff
-rwxr-xr-x  1 root root    2140 May 20  2015 bzdiff
lrwxrwxrwx  1 root root       6 May 20  2015 bzegrep -> bzgrep
-rwxr-xr-x  1 root root    4877 May 20  2015 bzexe
lrwxrwxrwx  1 root root       6 May 20  2015 bzfgrep -> bzgrep
-rwxr-xr-x  1 root root    3642 May 20  2015 bzgrep
-rwxr-xr-x  3 root root   31288 May 20  2015 bzip2
-rwxr-xr-x  1 root root   14616 May 20  2015 bzip2recover
lrwxrwxrwx  1 root root       6 May 20  2015 bzless -> bzmore
-rwxr-xr-x  1 root root    1297 May 20  2015 bzmore
-rwxr-xr-x  1 root root   52080 Mar  2  2017 cat
-rwxr-xr-x  1 root root   14752 Feb  7  2016 chacl
-rwxr-xr-x  1 root root   60272 Mar  2  2017 chgrp
-rwxr-xr-x  1 root root   56112 Mar  2  2017 chmod
-rwxr-xr-x  1 root root   64368 Mar  2  2017 chown
-rwxr-xr-x  1 root root   10536 Sep 22  2016 chvt
-rwxr-xr-x  1 root root  151024 Mar  2  2017 cp
-rwxr-xr-x  1 root root  141472 Feb 18  2016 cpio
lrwxrwxrwx  1 root root      21 Nov 12  2017 csh -> /etc/alternatives/csh
-rwxr-xr-x  1 root root  154072 Feb 17  2016 dash
-rwxr-xr-x  1 root root   68464 Mar  2  2017 date
-rwxr-xr-x  1 root root   72632 Mar  2  2017 dd
-rwxr-xr-x  1 root root   97912 Mar  2  2017 df
-rwxr-xr-x  1 root root  126584 Mar  2  2017 dir
-rwxr-xr-x  1 root root   60680 May 16 15:00 dmesg
lrwxrwxrwx  1 root root       8 Nov 24  2015 dnsdomainname -> hostname
lrwxrwxrwx  1 root root       8 Nov 24  2015 domainname -> hostname
-rwxr-xr-x  1 root root   82328 Sep 22  2016 dumpkeys
-rwxr-xr-x  1 root root   31376 Mar  2  2017 echo
-rwxr-xr-x  1 root root      28 Apr 29  2016 egrep
-rwxr-xr-x  1 root root   27280 Mar  2  2017 false
-rwxr-xr-x  1 root root   10544 Sep 22  2016 fgconsole
-rwxr-xr-x  1 root root      28 Apr 29  2016 fgrep
-rwxr-xr-x  1 root root   49576 May 16 15:00 findmnt
-rwxr-xr-x  1 root root   36024 Feb  7  2016 fuser
-rwxr-xr-x  1 root root   23752 Feb  7  2016 getfacl
-rwxr-xr-x  1 root root  211224 Apr 29  2016 grep
-rwxr-xr-x  2 root root    2301 Oct 27  2014 gunzip
-rwxr-xr-x  1 root root    5927 Oct 27  2014 gzexe
-rwxr-xr-x  1 root root   98240 Oct 27  2014 gzip
-rwxr-xr-x  1 root root   14800 Nov 24  2015 hostname
-rwxr-xr-x  1 root root  376192 Dec  7  2017 ip
-rwxr-xr-x  1 root root  498936 Jul 30 21:32 journalctl
-rwxr-xr-x  1 root root   10536 Sep 22  2016 kbd_mode
-rwxr-xr-x  1 root root   23152 May 14 12:42 kill
-rwxr-xr-x  1 root root  150600 Jul 25  2017 kmod
-rwxr-xr-x  1 root root  170728 Apr  5  2017 less
-rwxr-xr-x  1 root root   10256 Apr  5  2017 lessecho
lrwxrwxrwx  1 root root       8 Apr  5  2017 lessfile -> lesspipe
-rwxr-xr-x  1 root root   19824 Apr  5  2017 lesskey
-rwxr-xr-x  1 root root    7764 Apr  5  2017 lesspipe
-rwxr-xr-x  1 root root   56152 Mar  2  2017 ln
-rwxr-xr-x  1 root root  111496 Sep 22  2016 loadkeys
-rwxr-xr-x  1 root root   48128 May 16  2017 login
-rwxr-xr-x  1 root root  453848 Jul 30 21:32 loginctl
-rwxr-xr-x  1 root root  126584 Mar  2  2017 ls
-rwxr-xr-x  1 root root   77280 May 16 15:00 lsblk
lrwxrwxrwx  1 root root       4 Jul 25  2017 lsmod -> kmod
-rwxr-xr-x  1 root root   76848 Mar  2  2017 mkdir
-rwxr-xr-x  1 root root   64496 Mar  2  2017 mknod
-rwxr-xr-x  1 root root   39728 Mar  2  2017 mktemp
-rwxr-xr-x  1 root root   39768 May 16 15:00 more
-rwsr-xr-x  1 root root   40152 May 16 15:00 mount
-rwxr-xr-x  1 root root   14768 May 16 15:00 mountpoint
lrwxrwxrwx  1 root root      20 Nov 11  2017 mt -> /etc/alternatives/mt
-rwxr-xr-x  1 root root   68824 Feb 18  2016 mt-gnu
-rwxr-xr-x  1 root root  130488 Mar  2  2017 mv
lrwxrwxrwx  1 root root      20 Nov 11  2017 nc -> /etc/alternatives/nc
-rwxr-xr-x  1 root root   31248 Dec  4  2012 nc.openbsd
lrwxrwxrwx  1 root root      24 Nov 11  2017 netcat -> /etc/alternatives/netcat
-rwxr-xr-x  1 root root  119624 Jun 30  2014 netstat
-rwxr-xr-x  1 root root  678496 Jul 30 21:32 networkctl
lrwxrwxrwx  1 root root       8 Nov 24  2015 nisdomainname -> hostname
lrwxrwxrwx  1 root root       6 Sep 22  2016 open -> openvt
-rwxr-xr-x  1 root root   18968 Sep 22  2016 openvt
lrwxrwxrwx  1 root root      14 Feb  5  2016 pidof -> /sbin/killall5
-rwsr-xr-x  1 root root   44168 May  7  2014 ping
-rwsr-xr-x  1 root root   44680 May  7  2014 ping6
-rwxr-xr-x  1 root root   97408 May 14 12:42 ps
-rwxr-xr-x  1 root root   31472 Mar  2  2017 pwd
lrwxrwxrwx  1 root root       4 May 16  2017 rbash -> bash
-rwxr-xr-x  1 root root   39632 Mar  2  2017 readlink
-rwxr-xr-x  1 root root   60272 Mar  2  2017 rm
-rwxr-xr-x  1 root root   39632 Mar  2  2017 rmdir
-rwxr-xr-x  1 root root   19320 Jan 26  2016 run-parts
lrwxrwxrwx  1 root root      22 Nov 12  2017 rzsh -> /etc/alternatives/rzsh
-rwxr-xr-x  1 root root   73424 Feb 12  2016 sed
-rwxr-xr-x  1 root root   36296 Feb  7  2016 setfacl
-rwxr-xr-x  1 root root   39952 Sep 22  2016 setfont
-rwxr-xr-x  1 root root   30875 Oct 12  2017 setupcon
lrwxrwxrwx  1 root root       4 Feb 17  2016 sh -> dash
lrwxrwxrwx  1 root root       4 Nov 11  2017 sh.distrib -> dash
-rwxr-xr-x  1 root root   31408 Mar  2  2017 sleep
-rwxr-xr-x  1 root root  115816 Dec  7  2017 ss
-rwxr-xr-x  1 root root   72496 Mar  2  2017 stty
-rwsr-xr-x  1 root root   40128 May 16  2017 su
-rwxr-xr-x  1 root root   31408 Mar  2  2017 sync
-rwxr-xr-x  1 root root  659848 Jul 30 21:32 systemctl
lrwxrwxrwx  1 root root      20 Jul 30 21:31 systemd -> /lib/systemd/systemd
-rwxr-xr-x  1 root root   51656 Jul 30 21:32 systemd-ask-password
-rwxr-xr-x  1 root root   39344 Jul 30 21:32 systemd-escape
-rwxr-xr-x  1 root root   64080 Jul 30 21:32 systemd-hwdb
-rwxr-xr-x  1 root root  281840 Jul 30 21:32 systemd-inhibit
-rwxr-xr-x  1 root root   47544 Jul 30 21:32 systemd-machine-id-setup
-rwxr-xr-x  1 root root   35248 Jul 30 21:32 systemd-notify
-rwxr-xr-x  1 root root  133704 Jul 30 21:32 systemd-tmpfiles
-rwxr-xr-x  1 root root   68032 Jul 30 21:32 systemd-tty-ask-password-agent
-rwxr-xr-x  1 root root   23144 May 16 15:00 tailf
-rwxr-xr-x  1 root root  383632 Nov 17  2016 tar
lrwxrwxrwx  1 root root      13 Nov 12  2017 tcsh -> /usr/bin/tcsh
-rwxr-xr-x  1 root root   10416 Jan 26  2016 tempfile
-rwxr-xr-x  1 root root   64432 Mar  2  2017 touch
-rwxr-xr-x  1 root root   27280 Mar  2  2017 true
-rwxr-xr-x  1 root root  449136 Jul 30 21:32 udevadm
-rwsr-xr-x  1 root root   27608 May 16 15:00 umount
-rwxr-xr-x  1 root root   31440 Mar  2  2017 uname
-rwxr-xr-x  2 root root    2301 Oct 27  2014 uncompress
-rwxr-xr-x  1 root root    2762 Sep 22  2016 unicode_start
-rwxr-xr-x  1 root root  126584 Mar  2  2017 vdir
-rwxr-xr-x  1 root root   31376 May 16 15:00 wdctl
-rwxr-xr-x  1 root root     946 Jan 26  2016 which
-rwxr-xr-x  1 root root   27432 Jan 18  2016 whiptail
lrwxrwxrwx  1 root root       8 Nov 24  2015 ypdomainname -> hostname
-rwxr-xr-x  1 root root    1937 Oct 27  2014 zcat
-rwxr-xr-x  1 root root    1777 Oct 27  2014 zcmp
-rwxr-xr-x  1 root root    5764 Oct 27  2014 zdiff
-rwxr-xr-x  1 root root     140 Oct 27  2014 zegrep
-rwxr-xr-x  1 root root     140 Oct 27  2014 zfgrep
-rwxr-xr-x  1 root root    2131 Oct 27  2014 zforce
-rwxr-xr-x  1 root root    5938 Oct 27  2014 zgrep
-rwxr-xr-x  1 root root    2037 Oct 27  2014 zless
-rwxr-xr-x  1 root root    1910 Oct 27  2014 zmore
-rwxr-xr-x  1 root root    5047 Oct 27  2014 znew
lrwxrwxrwx  1 root root      21 Nov 12  2017 zsh -> /etc/alternatives/zsh
-rwxr-xr-x  1 root root  771552 Sep 10 20:29 zsh5
+ /bin/java -version
/tmp/jenkins7326213354600752790.sh: line 9: /bin/java: No such file or directory
Build step 'Execute shell' marked build as failure
Skipping publisher since build result is FAILURE
Archiving artifacts
No JDK named ?JDK 12 (latest)? found
Skipping publisher since build result is FAILURE
Recording test results
No JDK named ?JDK 12 (latest)? found
ERROR: Step ?Publish JUnit test result report? failed: No test report files were found. Configuration error?
No JDK named ?JDK 12 (latest)? found
No JDK named ?JDK 12 (latest)? found

---------------------------------------------------------------------
To unsubscribe, e-mail: [hidden email]
For additional commands, e-mail: [hidden email]

Reply | Threaded
Open this post in threaded view
|

Build failed in Jenkins: POI-DSL-1.12 #2

Apache Jenkins Server
See <https://builds.apache.org/job/POI-DSL-1.12/2/display/redirect?page=changes>

Changes:

[centic] IDE warnings, slightly more tests and fix test to not leave a modified file behind

[centic] Adjust sample for creating comments to also create a .xlsx file
Enhance workbook factory to allow to create new empty workbooks as well

[centic] Typos and IDE warnings

[centic] Set NOSONAR, adjust test slightly and reformat code

[centic] Ignore directory ooxml-testlib

[centic] Set NOSONAR and reformat code

[centic] Jenkins DSL: Adjust the view-description, but it is still commented out

[centic] Remove the workaround for a bug in JDK 11 which was fixed in ea+28

[fanningpj] fix class cast issur recently introduced in BaseXSSFFormulaEvaluator

[gwoolsey] #62834 FormulaEvaluator.evaluateInCell() throws Exception

added cell type = formula check when looping through the shared formula range, to ignore any non-formula cells.

Also refactored a bit to enable passing in the evaluation context, as getCellFormula() uses it behind the scenes when evaluating a shared formula cell (has to shift the formula references based on the master cell).  Review of these changes is welcome, as always.

Checked all other code referencing the "SHARED" enum, and didn't see anything else that dealt with formula cell values and thus would need to notice non-formula cells.

Added unit test based on the failing file from Bugzilla.  Test failed until the fixed code was in place.

[Nick] Don't fail on comments which contain the word 'modules' (or similar)

[Nick] Have the status generator say more what it is doing, and more in the readme on how (I think...) to use it

[Nick] Couple more changelog updates

[yegor] Bug 62373: Support for FREQUENCY function

[Nick] #62831 Fix WorkbookFactory.create with a subclass of File, eg from JFileChooser

[Nick] Failing unit test for bug #62831

[abearez] fix more LGTM alerts, in tests

[tallison] 62815 -- some numeric values not correctly extracted from xlsb

[abearez] fix most alerts reported by LGTM on OOXML

[fanningpj] update release notes

[kiwiwings] add ignored resources

[kiwiwings] Fix encrypted stream usage

[fanningpj] [bug-62807] fix typo in XSLFTableCell#removeBorder

[fanningpj] add stax entries to forbidden apis due to android issues

[fanningpj] small adjustments to byte sizes in TestPackage zip-bomb tests to try fix test that fails on old-xerces harness

[fanningpj] use jaxp transformer instead of dom serializer to try fix old-xerces test failure

[fanningpj] use jaxp transformer instead of dom serializer to try fix old-xerces test failure

[abearez] adding tricks from other answers on StackOverflow

[abearez] example from StackOverflow question 47065690

[abearez] more XDDF improvements based on SO examples

[fanningpj] [bug-62800] Fix null pointer exception if a picture shape has no blip id

[abearez] XDDF improvements based on StackOverflow examples

[abearez] fix lgtm alerts in examples

[abearez] fixed bug 59625

[abearez] change chart data to experiment diverse scripts

[fanningpj] deprecate unused Nullable class

[fanningpj] change method to get XMLEventFactory due to issues seen on Android SDK

[fanningpj] disable junit xml collection

[fanningpj] get xmlbeans job to build dist artifacts

[fanningpj] get xmlbeans job to build dist artifacts

[fanningpj] rename xmlbeans job

[fanningpj] [bug-62796] remove use of Stax Namespace class from PackagePropertiesMarshaller

[fanningpj] try to fix xmlbeans jenkins job

------------------------------------------
[...truncated 368.96 KB...]
AU        src/documentation/resources/images/old-project-logo.gif
AU        src/documentation/resources/images/logoKarmokar6s.png
AU        src/documentation/resources/images/logoLoicLefevre2.png
A         src/documentation/resources/images/project-header.svg
AU        src/documentation/resources/images/POIFSAddDocument.gif
AU        src/documentation/resources/images/POIFSInitialization.gif
AU        src/documentation/resources/images/usermodel.gif
AU        src/documentation/resources/images/logoWendyWise2.png
AU        src/documentation/resources/images/POIFSLifeCycle.gif
AU        src/documentation/resources/images/POIFSWriteFilesystem.gif
AU        src/documentation/resources/images/logoAdria1.png
AU        src/documentation/resources/images/logoAdria2.png
AU        src/documentation/resources/images/logoAdria3.png
AU        src/documentation/resources/images/poi-logo.png
AU        src/documentation/resources/images/logoRussellBeattie1.png
AU        src/documentation/resources/images/remove.jpg
AU        src/documentation/resources/images/logoRussellBeattie2.png
AU        src/documentation/resources/images/logoRaPiGmbH1.png
AU        src/documentation/resources/images/logoRussellBeattie3.png
AU        src/documentation/resources/images/logoRaPiGmbH2.png
AU        src/documentation/resources/images/logoRussellBeattie4.png
AU        src/documentation/resources/images/logoRussellBeattie5.png
AU        src/documentation/resources/images/logoKarmokar3s.png
AU        src/documentation/resources/images/logoGustafsson1.png
AU        src/documentation/resources/images/logoRaPiGmbH5.png
AU        src/documentation/resources/images/logoGustafsson2.png
AU        src/documentation/resources/images/logoRaPiGmbH6.png
AU        src/documentation/resources/images/logoRaPiGmbH7.png
AU        src/documentation/resources/images/logoRaPiGmbH8.png
AU        src/documentation/resources/images/businessplan.jpg
AU        src/documentation/resources/images/logoRaPiGmbH9.png
AU        src/documentation/resources/images/logoJanssen1.png
AU        src/documentation/resources/images/logoJanssen2.png
AU        src/documentation/resources/images/calendar.jpg
AU        src/documentation/resources/images/loancalc.jpg
AU        src/documentation/resources/images/pb-poi.cdr
AU        src/documentation/resources/images/logoRaPiGmbH10.png
AU        src/documentation/resources/images/utilClasses.gif
AU        src/documentation/resources/images/logoMichaelMosmann.png
AU        src/documentation/resources/images/logoRaPiGmbH11.png
AU        src/documentation/resources/images/logoRaPiGmbH12.png
AU        src/documentation/resources/images/simple-xls-with-function.jpg
AU        src/documentation/resources/images/unknown.jpg
AU        src/documentation/resources/images/logoAndrewClements.png
AU        src/documentation/resources/images/logoKarmokar4s.png
AU        src/documentation/resources/images/ss-features.png
AU        src/documentation/README.txt
A         src/documentation/classes
A         src/documentation/classes/CatalogManager.properties
At revision 1844914

At revision 1844914

No changes for https://svn.apache.org/repos/asf/poi/site/forrest.properties since the previous build
No JDK named ?JDK 12 (latest)? found
[POI-DSL-1.12] $ /bin/bash -xe /tmp/jenkins5417089095229589047.sh
+ svn status
    X   forrest.properties
X       src/documentation

Performing status on external item at 'src/documentation':
+ echo Java-Home:
Java-Home:
+ ls -al /
total 313
drwxr-xr-x   25 root root   4096 Oct 23 06:34 .
drwxr-xr-x   25 root root   4096 Oct 23 06:34 ..
drwxr-xr-x    2 root root   4096 Oct 25 06:21 bin
drwxr-xr-x    4 root root   1024 Oct 25 06:21 boot
-rw-r--r--    1 root root    530 Oct 20 04:07 chboot
drwxr-xr-x   19 root root   3840 Oct 20 04:11 dev
drwxr-xr-x  125 root root  12288 Oct 26 16:27 etc
drwxr-xr-x   24 root root   4096 Oct 20 07:34 home
lrwxrwxrwx    1 root root     33 Oct 23 06:34 initrd.img -> boot/initrd.img-4.4.0-138-generic
lrwxrwxrwx    1 root root     33 Oct 20 04:01 initrd.img.old -> boot/initrd.img-4.4.0-137-generic
drwxr-xr-x   17 root root   4096 Oct 20 05:56 lib
drwxr-xr-x    2 root root   4096 Oct 20 05:50 lib32
drwxr-xr-x    2 root root   4096 Oct 20 04:02 lib64
drwxr-xr-x    2 root root   4096 Oct 20 05:44 libx32
drwx------    2 root root  16384 Oct 20 03:55 lost+found
drwxr-xr-x    2 root root   4096 Oct 20 03:55 media
drwxr-xr-x    2 root root   4096 Oct 20 03:57 mnt
drwxr-xr-x    3 root root   4096 Oct 20 05:55 opt
dr-xr-xr-x  327 root root      0 Oct 20 04:10 proc
drwxr-xr-x    4 root root   4096 Oct 20 08:49 root
drwxr-xr-x   28 root root   1080 Oct 23 06:35 run
drwxr-xr-x    2 root root   4096 Oct 25 06:21 sbin
drwxr-xr-x    6 root root   4096 Oct 20 07:39 snap
drwxr-xr-x    2 root root   4096 Oct 20 03:57 srv
dr-xr-xr-x   13 root root      0 Oct 20 04:10 sys
drwxrwxrwt 1574 root root 212992 Oct 26 16:47 tmp
drwxr-xr-x   14 root root   4096 Oct 20 05:44 usr
drwxr-xr-x   13 root root   4096 Oct 20 05:51 var
lrwxrwxrwx    1 root root     30 Oct 23 06:34 vmlinuz -> boot/vmlinuz-4.4.0-138-generic
lrwxrwxrwx    1 root root     30 Oct 20 04:01 vmlinuz.old -> boot/vmlinuz-4.4.0-137-generic
+ ls -al /bin
total 10520
drwxr-xr-x  2 root root    4096 Oct 25 06:21 .
drwxr-xr-x 25 root root    4096 Oct 23 06:34 ..
-rwxr-xr-x  1 root root 1037528 May 16  2017 bash
-rwxr-xr-x  3 root root   31288 May 20  2015 bunzip2
-rwxr-xr-x  3 root root   31288 May 20  2015 bzcat
lrwxrwxrwx  1 root root       6 May 20  2015 bzcmp -> bzdiff
-rwxr-xr-x  1 root root    2140 May 20  2015 bzdiff
lrwxrwxrwx  1 root root       6 May 20  2015 bzegrep -> bzgrep
-rwxr-xr-x  1 root root    4877 May 20  2015 bzexe
lrwxrwxrwx  1 root root       6 May 20  2015 bzfgrep -> bzgrep
-rwxr-xr-x  1 root root    3642 May 20  2015 bzgrep
-rwxr-xr-x  3 root root   31288 May 20  2015 bzip2
-rwxr-xr-x  1 root root   14616 May 20  2015 bzip2recover
lrwxrwxrwx  1 root root       6 May 20  2015 bzless -> bzmore
-rwxr-xr-x  1 root root    1297 May 20  2015 bzmore
-rwxr-xr-x  1 root root   52080 Mar  2  2017 cat
-rwxr-xr-x  1 root root   14752 Feb  7  2016 chacl
-rwxr-xr-x  1 root root   60272 Mar  2  2017 chgrp
-rwxr-xr-x  1 root root   56112 Mar  2  2017 chmod
-rwxr-xr-x  1 root root   64368 Mar  2  2017 chown
-rwxr-xr-x  1 root root   10536 Sep 22  2016 chvt
-rwxr-xr-x  1 root root  151024 Mar  2  2017 cp
-rwxr-xr-x  1 root root  141472 Feb 18  2016 cpio
lrwxrwxrwx  1 root root      21 Oct 20 05:56 csh -> /etc/alternatives/csh
-rwxr-xr-x  1 root root  154072 Feb 17  2016 dash
-rwxr-xr-x  1 root root   68464 Mar  2  2017 date
-rwxr-xr-x  1 root root   72632 Mar  2  2017 dd
-rwxr-xr-x  1 root root   97912 Mar  2  2017 df
-rwxr-xr-x  1 root root  126584 Mar  2  2017 dir
-rwxr-xr-x  1 root root   60680 May 16 15:00 dmesg
lrwxrwxrwx  1 root root       8 Nov 24  2015 dnsdomainname -> hostname
lrwxrwxrwx  1 root root       8 Nov 24  2015 domainname -> hostname
-rwxr-xr-x  1 root root   82328 Sep 22  2016 dumpkeys
-rwxr-xr-x  1 root root   31376 Mar  2  2017 echo
-rwxr-xr-x  1 root root      28 Apr 29  2016 egrep
-rwxr-xr-x  1 root root   27280 Mar  2  2017 false
-rwxr-xr-x  1 root root   10544 Sep 22  2016 fgconsole
-rwxr-xr-x  1 root root      28 Apr 29  2016 fgrep
-rwxr-xr-x  1 root root   49576 May 16 15:00 findmnt
-rwxr-xr-x  1 root root   36024 Feb  7  2016 fuser
-rwxr-xr-x  1 root root   23752 Feb  7  2016 getfacl
-rwxr-xr-x  1 root root  211224 Apr 29  2016 grep
-rwxr-xr-x  2 root root    2301 Oct 27  2014 gunzip
-rwxr-xr-x  1 root root    5927 Oct 27  2014 gzexe
-rwxr-xr-x  1 root root   98240 Oct 27  2014 gzip
-rwxr-xr-x  1 root root   14800 Nov 24  2015 hostname
-rwxr-xr-x  1 root root  376192 Dec  7  2017 ip
-rwxr-xr-x  1 root root  498936 Oct 10 17:04 journalctl
-rwxr-xr-x  1 root root   10536 Sep 22  2016 kbd_mode
-rwxr-xr-x  1 root root   23152 May 14 12:42 kill
-rwxr-xr-x  1 root root  150600 Jul 25  2017 kmod
-rwxr-xr-x  1 root root  170728 Apr  5  2017 less
-rwxr-xr-x  1 root root   10256 Apr  5  2017 lessecho
lrwxrwxrwx  1 root root       8 Apr  5  2017 lessfile -> lesspipe
-rwxr-xr-x  1 root root   19824 Apr  5  2017 lesskey
-rwxr-xr-x  1 root root    7764 Apr  5  2017 lesspipe
-rwxr-xr-x  1 root root   56152 Mar  2  2017 ln
-rwxr-xr-x  1 root root  111496 Sep 22  2016 loadkeys
-rwxr-xr-x  1 root root   48128 May 16  2017 login
-rwxr-xr-x  1 root root  453848 Oct 10 17:04 loginctl
-rwxr-xr-x  1 root root  126584 Mar  2  2017 ls
-rwxr-xr-x  1 root root   77280 May 16 15:00 lsblk
lrwxrwxrwx  1 root root       4 Jul 25  2017 lsmod -> kmod
-rwxr-xr-x  1 root root   76848 Mar  2  2017 mkdir
-rwxr-xr-x  1 root root   64496 Mar  2  2017 mknod
-rwxr-xr-x  1 root root   39728 Mar  2  2017 mktemp
-rwxr-xr-x  1 root root   39768 May 16 15:00 more
-rwsr-xr-x  1 root root   40152 May 16 15:00 mount
-rwxr-xr-x  1 root root   14768 May 16 15:00 mountpoint
lrwxrwxrwx  1 root root      20 Oct 20 03:59 mt -> /etc/alternatives/mt
-rwxr-xr-x  1 root root   68824 Feb 18  2016 mt-gnu
-rwxr-xr-x  1 root root  130488 Mar  2  2017 mv
lrwxrwxrwx  1 root root      20 Oct 20 03:59 nc -> /etc/alternatives/nc
-rwxr-xr-x  1 root root   31248 Dec  4  2012 nc.openbsd
lrwxrwxrwx  1 root root      24 Oct 20 03:59 netcat -> /etc/alternatives/netcat
-rwxr-xr-x  1 root root  119624 Jun 30  2014 netstat
-rwxr-xr-x  1 root root  678496 Oct 10 17:04 networkctl
lrwxrwxrwx  1 root root       8 Nov 24  2015 nisdomainname -> hostname
lrwxrwxrwx  1 root root       6 Sep 22  2016 open -> openvt
-rwxr-xr-x  1 root root   18968 Sep 22  2016 openvt
lrwxrwxrwx  1 root root      14 Feb  5  2016 pidof -> /sbin/killall5
-rwsr-xr-x  1 root root   44168 May  7  2014 ping
-rwsr-xr-x  1 root root   44680 May  7  2014 ping6
-rwxr-xr-x  1 root root   97408 May 14 12:42 ps
-rwxr-xr-x  1 root root   31472 Mar  2  2017 pwd
lrwxrwxrwx  1 root root       4 May 16  2017 rbash -> bash
-rwxr-xr-x  1 root root   39632 Mar  2  2017 readlink
-rwxr-xr-x  1 root root   60272 Mar  2  2017 rm
-rwxr-xr-x  1 root root   39632 Mar  2  2017 rmdir
-rwxr-xr-x  1 root root   19320 Jan 26  2016 run-parts
lrwxrwxrwx  1 root root      22 Oct 20 05:53 rzsh -> /etc/alternatives/rzsh
-rwxr-xr-x  1 root root   73424 Feb 12  2016 sed
-rwxr-xr-x  1 root root   36296 Feb  7  2016 setfacl
-rwxr-xr-x  1 root root   39952 Sep 22  2016 setfont
-rwxr-xr-x  1 root root   30875 Oct 12  2017 setupcon
lrwxrwxrwx  1 root root       4 Feb 17  2016 sh -> dash
lrwxrwxrwx  1 root root       4 Oct 20 03:57 sh.distrib -> dash
-rwxr-xr-x  1 root root   31408 Mar  2  2017 sleep
-rwxr-xr-x  1 root root  115816 Dec  7  2017 ss
-rwxr-xr-x  1 root root   72496 Mar  2  2017 stty
-rwsr-xr-x  1 root root   40128 May 16  2017 su
-rwxr-xr-x  1 root root   31408 Mar  2  2017 sync
-rwxr-xr-x  1 root root  659848 Oct 10 17:04 systemctl
lrwxrwxrwx  1 root root      20 Oct 10 17:03 systemd -> /lib/systemd/systemd
-rwxr-xr-x  1 root root   51656 Oct 10 17:04 systemd-ask-password
-rwxr-xr-x  1 root root   39344 Oct 10 17:04 systemd-escape
-rwxr-xr-x  1 root root   64080 Oct 10 17:04 systemd-hwdb
-rwxr-xr-x  1 root root  281840 Oct 10 17:04 systemd-inhibit
-rwxr-xr-x  1 root root   47544 Oct 10 17:04 systemd-machine-id-setup
-rwxr-xr-x  1 root root   35248 Oct 10 17:04 systemd-notify
-rwxr-xr-x  1 root root  133704 Oct 10 17:04 systemd-tmpfiles
-rwxr-xr-x  1 root root   68032 Oct 10 17:04 systemd-tty-ask-password-agent
-rwxr-xr-x  1 root root   23144 May 16 15:00 tailf
-rwxr-xr-x  1 root root  383632 Nov 17  2016 tar
lrwxrwxrwx  1 root root      13 Oct 20 05:56 tcsh -> /usr/bin/tcsh
-rwxr-xr-x  1 root root   10416 Jan 26  2016 tempfile
-rwxr-xr-x  1 root root   64432 Mar  2  2017 touch
-rwxr-xr-x  1 root root   27280 Mar  2  2017 true
-rwxr-xr-x  1 root root  449136 Oct 10 17:04 udevadm
-rwsr-xr-x  1 root root   27608 May 16 15:00 umount
-rwxr-xr-x  1 root root   31440 Mar  2  2017 uname
-rwxr-xr-x  2 root root    2301 Oct 27  2014 uncompress
-rwxr-xr-x  1 root root    2762 Sep 22  2016 unicode_start
-rwxr-xr-x  1 root root  126584 Mar  2  2017 vdir
-rwxr-xr-x  1 root root   31376 May 16 15:00 wdctl
-rwxr-xr-x  1 root root     946 Jan 26  2016 which
-rwxr-xr-x  1 root root   27432 Jan 18  2016 whiptail
lrwxrwxrwx  1 root root       8 Nov 24  2015 ypdomainname -> hostname
-rwxr-xr-x  1 root root    1937 Oct 27  2014 zcat
-rwxr-xr-x  1 root root    1777 Oct 27  2014 zcmp
-rwxr-xr-x  1 root root    5764 Oct 27  2014 zdiff
-rwxr-xr-x  1 root root     140 Oct 27  2014 zegrep
-rwxr-xr-x  1 root root     140 Oct 27  2014 zfgrep
-rwxr-xr-x  1 root root    2131 Oct 27  2014 zforce
-rwxr-xr-x  1 root root    5938 Oct 27  2014 zgrep
-rwxr-xr-x  1 root root    2037 Oct 27  2014 zless
-rwxr-xr-x  1 root root    1910 Oct 27  2014 zmore
-rwxr-xr-x  1 root root    5047 Oct 27  2014 znew
lrwxrwxrwx  1 root root      21 Oct 20 05:53 zsh -> /etc/alternatives/zsh
-rwxr-xr-x  1 root root  771552 Sep 10 20:29 zsh5
+ /bin/java -version
/tmp/jenkins5417089095229589047.sh: line 9: /bin/java: No such file or directory
Build step 'Execute shell' marked build as failure
Skipping publisher since build result is FAILURE
Archiving artifacts
No JDK named ?JDK 12 (latest)? found
Skipping publisher since build result is FAILURE
Recording test results
No JDK named ?JDK 12 (latest)? found
ERROR: Step ?Publish JUnit test result report? failed: No test report files were found. Configuration error?
No JDK named ?JDK 12 (latest)? found
No JDK named ?JDK 12 (latest)? found

---------------------------------------------------------------------
To unsubscribe, e-mail: [hidden email]
For additional commands, e-mail: [hidden email]

Reply | Threaded
Open this post in threaded view
|

Build failed in Jenkins: POI-DSL-1.12 #3

Apache Jenkins Server
See <https://builds.apache.org/job/POI-DSL-1.12/3/display/redirect?page=changes>

Changes:

[kiwiwings] exclude H35 because of strange file permission errors

[kiwiwings] exclude H35 because of strange file permission errors

[kiwiwings] Try to fix ImageIO cache error

[centic] One more try to avoid the test-failures related to ImageIO-cache dir

[centic] Try to create the temporary directory for ImageIO to see if that makes
the tests work again when built with Maven

[fanningpj] put back XSSFColor(java.awt.Color clr) constructor

[fanningpj] fix sample code

[fanningpj] remove duplicate attempt to add column headers

[fanningpj] remove unused import

[fanningpj] [bug-62908] populate NamedColors

[fanningpj] fix typo

[fanningpj] add testcase for https://bz.apache.org/bugzilla/show_bug.cgi?id=62906

[fanningpj] add testcase for https://bz.apache.org/bugzilla/show_bug.cgi?id=62906

[kiwiwings] Bug 62872 - Writing large files with 800k rows gives java.io.IOException: This archive contains unclosed entries.

[yegor] Bug 62836: Implementation of Excel TREND function

[tallison] bug 60316 -- until we can implement it properly, gracefully skip the glossary document in XWPF.

[tallison] bug 62624 -- further cleanup

[centic] Remove JavaDoc warnings

[centic] IDE warnings, tried to reproduce Bug 58927, but could not

[Nick] Allow the forrest task to be called from the site sub-project

[tallison] bug 62624 -- ensure streams are closed...thanks to LGTM, and PJ!

[tallison] bug 62624 -- fix loop identified as dodgy by FindBugs; add a other sanity checks.

[tallison] bug 62624 -- fix recursion

[Nick] List additional dependencies from the Ant build file in Eclipse

[Nick] Newer releases first, bit more on dev javadocs

[tallison] bug 62625 -- clean up imports

[tallison] bug 62625 -- add special handling for REFERENCE_NAME record that may only
contain an ascii string, against the spec in VBAMacroReader

[Nick] Correct folder

[Nick] Other release javadoc info

[Nick] Update javadocs references to /apidocs/dev/ , and allow for a real page at /apidocs/index.html

[Nick] More javadoc updates

[Nick] Start on a JavaDocs landing page

[Nick] Update for latest/dev javadocs at /apidocs/dev/

[Nick] Add section on javadocs now we will also keep older ones online

[tallison] bug 62624 -- fix npe by adding processing of module name mapping in VBAMacroReader

[fanningpj] xmlbeans 3.0.2

[fanningpj] update xmlbeans to 3.0.2

[tallison] bug 62859 -- fix two potential NPEs when initializing XWPFSDTContent

------------------------------------------
[...truncated 395.26 KB...]
  [xmlbean] Time to generate code: 4.982 seconds
     [echo] Forking javac with max heap size 1536m
    [javac] Compiling 4576 source files to <https://builds.apache.org/job/POI-DSL-1.12/ws/build/xmlbean-classes>
    [javac] warning: [options] bootstrap class path not set in conjunction with -source 8
    [javac] Note: Some input files use unchecked or unsafe operations.
    [javac] Note: Recompile with -Xlint:unchecked for details.
    [javac] 1 warning
      [jar] Building jar: <https://builds.apache.org/job/POI-DSL-1.12/3/artifact/ooxml-lib/ooxml-schemas-1.4.jar>
      [jar] Building jar: <https://builds.apache.org/job/POI-DSL-1.12/3/artifact/ooxml-lib/ooxml-schemas-1.4-sources.jar>
   [delete] Deleting directory <https://builds.apache.org/job/POI-DSL-1.12/ws/build/xmlbean-xsds>
   [delete] Deleting directory <https://builds.apache.org/job/POI-DSL-1.12/ws/build/xmlbean-sources>
   [delete] Deleting directory <https://builds.apache.org/job/POI-DSL-1.12/ws/build/xmlbean-classes>
    [mkdir] Created dir: <https://builds.apache.org/job/POI-DSL-1.12/ws/build/xmlbean-xsds>
    [mkdir] Created dir: <https://builds.apache.org/job/POI-DSL-1.12/ws/build/xmlbean-sources>
    [mkdir] Created dir: <https://builds.apache.org/job/POI-DSL-1.12/ws/build/xmlbean-classes>
     [copy] Copying 10 files to <https://builds.apache.org/job/POI-DSL-1.12/ws/build/xmlbean-xsds>
     [copy] Copying 2 resources to <https://builds.apache.org/job/POI-DSL-1.12/ws/build/xmlbean-xsds>
  [xmlbean] Time to build schema type system: 0.56 seconds
  [xmlbean] Time to generate code: 0.407 seconds
     [echo] Forking javac with max heap size 1536m
    [javac] Compiling 372 source files to <https://builds.apache.org/job/POI-DSL-1.12/ws/build/xmlbean-classes>
    [javac] warning: [options] bootstrap class path not set in conjunction with -source 8
    [javac] Note: Some input files use unchecked or unsafe operations.
    [javac] Note: Recompile with -Xlint:unchecked for details.
    [javac] 1 warning
      [jar] Building jar: <https://builds.apache.org/job/POI-DSL-1.12/3/artifact/ooxml-lib/ooxml-security-1.1.jar>
      [jar] Building jar: <https://builds.apache.org/job/POI-DSL-1.12/3/artifact/ooxml-lib/ooxml-security-1.1-sources.jar>
   [delete] Deleting directory <https://builds.apache.org/job/POI-DSL-1.12/ws/build/xmlbean-xsds>
   [delete] Deleting directory <https://builds.apache.org/job/POI-DSL-1.12/ws/build/xmlbean-sources>
   [delete] Deleting directory <https://builds.apache.org/job/POI-DSL-1.12/ws/build/xmlbean-classes>

compile-ooxml:
    [javac] Compiling 589 source files to <https://builds.apache.org/job/POI-DSL-1.12/ws/build/ooxml-classes>
    [javac] warning: [options] bootstrap class path not set in conjunction with -source 8
    [javac] Note: Some input files use or override a deprecated API.
    [javac] Note: Recompile with -Xlint:deprecation for details.
    [javac] Note: <https://builds.apache.org/job/POI-DSL-1.12/ws/src/ooxml/java/org/apache/poi/poifs/crypt/dsig/SignaturePart.java> uses unchecked or unsafe operations.
    [javac] Note: Recompile with -Xlint:unchecked for details.
    [javac] 1 warning
    [javac] Compiling 268 source files to <https://builds.apache.org/job/POI-DSL-1.12/ws/build/ooxml-test-classes>
    [javac] warning: [options] bootstrap class path not set in conjunction with -source 8
    [javac] Note: Some input files use or override a deprecated API.
    [javac] Note: Recompile with -Xlint:deprecation for details.
    [javac] 1 warning
     [copy] Copying 3 files to <https://builds.apache.org/job/POI-DSL-1.12/ws/build/ooxml-classes>

compile-examples:
    [javac] Compiling 153 source files to <https://builds.apache.org/job/POI-DSL-1.12/ws/build/examples-classes>
    [javac] warning: [options] bootstrap class path not set in conjunction with -source 8
    [javac] Note: Some input files use or override a deprecated API.
    [javac] Note: Recompile with -Xlint:deprecation for details.
    [javac] 1 warning
     [copy] Copying 1 file to <https://builds.apache.org/job/POI-DSL-1.12/ws/build/examples-classes>

compile-excelant:
    [javac] Compiling 14 source files to <https://builds.apache.org/job/POI-DSL-1.12/ws/build/excelant-classes>
    [javac] warning: [options] bootstrap class path not set in conjunction with -source 8
    [javac] Note: Some input files use or override a deprecated API.
    [javac] Note: Recompile with -Xlint:deprecation for details.
    [javac] 1 warning
    [javac] Compiling 13 source files to <https://builds.apache.org/job/POI-DSL-1.12/ws/build/excelant-test-classes>
    [javac] warning: [options] bootstrap class path not set in conjunction with -source 8
    [javac] 1 warning
     [copy] Copying 1 file to <https://builds.apache.org/job/POI-DSL-1.12/ws/build/excelant-classes>

compile:

-compile-ooxml-lite-check:

compile-ooxml-lite:
     [echo] Running ooxml-lite generator
    [mkdir] Created dir: <https://builds.apache.org/job/POI-DSL-1.12/ws/build/ooxml-lite-merged>
      [jar] Building jar: <https://builds.apache.org/job/POI-DSL-1.12/ws/build/ooxml-lite-merged/ooxml-lite-merged.jar>
     [java] Free memory (bytes): 523667008
     [java] Maximum memory (bytes): 536870912
     [java] Total memory (bytes): 536870912
     [java] Collecting unit tests from <https://builds.apache.org/job/POI-DSL-1.12/ws/build/ooxml-test-classes>
     [java] Class org.apache.poi.ooxml.util.OOXMLLite does not derive from TestCase and does not have a @Test annotation
     [java] Inner class org.apache.poi.ooxml.util.OOXMLLite$2.class not included
     [java] Inner class org.apache.poi.ooxml.util.OOXMLLite$1.class not included
     [java] Inner class org.apache.poi.util.TestTempFileThreaded$1.class not included
     [java] Inner class org.apache.poi.util.TestTempFileThreaded$TestRunnable.class not included
     [java] Inner class org.apache.poi.extractor.ooxml.TestExtractorFactory$FunctionEx.class not included
     [java] Class org.apache.poi.benchmark.generated.AddImageBench_jmhType does not derive from TestCase and does not have a @Test annotation
     [java] Inner class org.apache.poi.ss.TestWorkbookFactory$TestFile.class not included
     [java] Inner class org.apache.poi.xslf.usermodel.TestXSLFFreeformShape$1.class not included
     [java] Inner class org.apache.poi.openxml4j.opc.TestPackage$1.class not included
     [java] Inner class org.apache.poi.openxml4j.opc.ZipFileAssert$IgnoreXMLDeclEvaluator.class not included
     [java] Inner class org.apache.poi.openxml4j.opc.ZipFileAssert$1.class not included
     [java] Inner class org.apache.poi.openxml4j.opc.TestPackage$AnyCauseMatcher.class not included
     [java] Found 244 classes
     [java] ...............................................................................I....................
     [java] 11/244: testGetText(org.apache.poi.xwpf.usermodel.TestXWPFTable)
     [java] .............I.......................................................................................
     [java] 25/244: testShouldEnforceForFillingForms(org.apache.poi.xwpf.TestDocumentProtection)
     [java] .....................................................I.thread: 9, iter: 0: build/tmp/poifiles/TestTempFileThreaded/331/TestTempFile-9-0-16282907246898564425.xlsx
     [java] thread: 4, iter: 0: build/tmp/poifiles/TestTempFileThreaded/326/TestTempFile-4-0-6448383320390775365.xlsx
     [java] thread: 7, iter: 0: build/tmp/poifiles/TestTempFileThreaded/329/TestTempFile-7-0-13969390794262795992.xlsx
     [java] thread: 2, iter: 0: build/tmp/poifiles/TestTempFileThreaded/324/TestTempFile-2-0-12209256844939758077.xlsx
     [java] thread: 0, iter: 0: build/tmp/poifiles/TestTempFileThreaded/322/TestTempFile-0-0-1998202201149203747.xlsx
     [java] thread: 6, iter: 0: build/tmp/poifiles/TestTempFileThreaded/328/TestTempFile-6-0-13250184427213861612.xlsx
     [java] thread: 3, iter: 0: build/tmp/poifiles/TestTempFileThreaded/325/TestTempFile-3-0-2699600562226878910.xlsx
     [java] thread: 5, iter: 0: build/tmp/poifiles/TestTempFileThreaded/327/TestTempFile-5-0-7822184551366861390.xlsx
     [java] thread: 1, iter: 0: build/tmp/poifiles/TestTempFileThreaded/323/TestTempFile-1-0-130189218427544214.xlsx
     [java] thread: 8, iter: 0: build/tmp/poifiles/TestTempFileThreaded/330/TestTempFile-8-0-5702852430631166546.xlsx
     [java] thread: 5, iter: 30: build/tmp/poifiles/TestTempFileThreaded/327/TestTempFile-5-30-172655993915326676.xlsx
     [java] thread: 4, iter: 30: build/tmp/poifiles/TestTempFileThreaded/326/TestTempFile-4-30-8866310357997418437.xlsx
     [java] thread: 7, iter: 30: build/tmp/poifiles/TestTempFileThreaded/329/TestTempFile-7-30-9832162675767475204.xlsx
     [java] thread: 3, iter: 30: build/tmp/poifiles/TestTempFileThreaded/325/TestTempFile-3-30-4942122226026474080.xlsx
     [java] thread: 2, iter: 30: build/tmp/poifiles/TestTempFileThreaded/324/TestTempFile-2-30-3892638317008271346.xlsx
     [java] thread: 8, iter: 30: build/tmp/poifiles/TestTempFileThreaded/330/TestTempFile-8-30-5498440369777211723.xlsx
     [java] thread: 9, iter: 30: build/tmp/poifiles/TestTempFileThreaded/331/TestTempFile-9-30-692463901867147765.xlsx
     [java] thread: 0, iter: 30: build/tmp/poifiles/TestTempFileThreaded/322/TestTempFile-0-30-12501832304382853647.xlsx
     [java] thread: 6, iter: 30: build/tmp/poifiles/TestTempFileThreaded/328/TestTempFile-6-30-10657590047921159168.xlsx
     [java] thread: 1, iter: 30: build/tmp/poifiles/TestTempFileThreaded/323/TestTempFile-1-30-16048152072034199498.xlsx
     [java] thread: 8, iter: 60: build/tmp/poifiles/TestTempFileThreaded/330/TestTempFile-8-60-9439885095687141004.xlsx
     [java] thread: 4, iter: 60: build/tmp/poifiles/TestTempFileThreaded/326/TestTempFile-4-60-17026757369202239046.xlsx
     [java] thread: 5, iter: 60: build/tmp/poifiles/TestTempFileThreaded/327/TestTempFile-5-60-12238315227674903040.xlsx
     [java] thread: 9, iter: 60: build/tmp/poifiles/TestTempFileThreaded/331/TestTempFile-9-60-12674702818302269238.xlsx
     [java] thread: 6, iter: 60: build/tmp/poifiles/TestTempFileThreaded/328/TestTempFile-6-60-12864168495851630873.xlsx
     [java] thread: 2, iter: 60: build/tmp/poifiles/TestTempFileThreaded/324/TestTempFile-2-60-15909736480148012640.xlsx
     [java] thread: 3, iter: 60: build/tmp/poifiles/TestTempFileThreaded/325/TestTempFile-3-60-8727300651658326246.xlsx
     [java] thread: 7, iter: 60: build/tmp/poifiles/TestTempFileThreaded/329/TestTempFile-7-60-5683029927649155746.xlsx
     [java] thread: 1, iter: 60: build/tmp/poifiles/TestTempFileThreaded/323/TestTempFile-1-60-11347170148453129830.xlsx
     [java] thread: 0, iter: 60: build/tmp/poifiles/TestTempFileThreaded/322/TestTempFile-0-60-1341004234725992545.xlsx
     [java] thread: 8, iter: 90: build/tmp/poifiles/TestTempFileThreaded/330/TestTempFile-8-90-3371278063369218788.xlsx
     [java] thread: 4, iter: 90: build/tmp/poifiles/TestTempFileThreaded/326/TestTempFile-4-90-1047632956731712853.xlsx
     [java] thread: 5, iter: 90: build/tmp/poifiles/TestTempFileThreaded/327/TestTempFile-5-90-637273269377371879.xlsx
     [java] thread: 9, iter: 90: build/tmp/poifiles/TestTempFileThreaded/331/TestTempFile-9-90-17227463968097832228.xlsx
     [java] thread: 6, iter: 90: build/tmp/poifiles/TestTempFileThreaded/328/TestTempFile-6-90-6154858256597883736.xlsx
     [java] thread: 3, iter: 90: build/tmp/poifiles/TestTempFileThreaded/325/TestTempFile-3-90-5617446613649432716.xlsx
     [java] thread: 1, iter: 90: build/tmp/poifiles/TestTempFileThreaded/323/TestTempFile-1-90-16864349296535162470.xlsx
     [java] thread: 7, iter: 90: build/tmp/poifiles/TestTempFileThreaded/329/TestTempFile-7-90-1239486231657776676.xlsx
     [java] thread: 2, iter: 90: build/tmp/poifiles/TestTempFileThreaded/324/TestTempFile-2-90-14260254722057183396.xlsx
     [java] thread: 0, iter: 90: build/tmp/poifiles/TestTempFileThreaded/322/TestTempFile-0-90-7477194180987586807.xlsx
     [java] thread: 4, iter: 120: build/tmp/poifiles/TestTempFileThreaded/326/TestTempFile-4-120-12213482539927806847.xlsx
     [java] thread: 8, iter: 120: build/tmp/poifiles/TestTempFileThreaded/330/TestTempFile-8-120-6830181400928408697.xlsx
     [java] thread: 5, iter: 120: build/tmp/poifiles/TestTempFileThreaded/327/TestTempFile-5-120-17587012626568550022.xlsx
     [java] thread: 9, iter: 120: build/tmp/poifiles/TestTempFileThreaded/331/TestTempFile-9-120-10781015663967479343.xlsx
     [java] thread: 6, iter: 120: build/tmp/poifiles/TestTempFileThreaded/328/TestTempFile-6-120-12734362161171841818.xlsx
     [java] thread: 3, iter: 120: build/tmp/poifiles/TestTempFileThreaded/325/TestTempFile-3-120-14059935557139968337.xlsx
     [java] thread: 1, iter: 120: build/tmp/poifiles/TestTempFileThreaded/323/TestTempFile-1-120-16354891524024447892.xlsx
     [java] thread: 0, iter: 120: build/tmp/poifiles/TestTempFileThreaded/322/TestTempFile-0-120-727972531262750560.xlsx
     [java] thread: 7, iter: 120: build/tmp/poifiles/TestTempFileThreaded/329/TestTempFile-7-120-7270311240691281804.xlsx
     [java] thread: 2, iter: 120: build/tmp/poifiles/TestTempFileThreaded/324/TestTempFile-2-120-3297311212885492221.xlsx
     [java] thread: 4, iter: 150: build/tmp/poifiles/TestTempFileThreaded/326/TestTempFile-4-150-11021655694012736758.xlsx
     [java] thread: 7, iter: 150: build/tmp/poifiles/TestTempFileThreaded/329/TestTempFile-7-150-10448496603046988544.xlsx
     [java] thread: 9, iter: 150: build/tmp/poifiles/TestTempFileThreaded/331/TestTempFile-9-150-1594113811347084482.xlsx
     [java] thread: 5, iter: 150: build/tmp/poifiles/TestTempFileThreaded/327/TestTempFile-5-150-18258411014416418374.xlsx
     [java] thread: 6, iter: 150: build/tmp/poifiles/TestTempFileThreaded/328/TestTempFile-6-150-5186419012596204784.xlsx
     [java] thread: 8, iter: 150: build/tmp/poifiles/TestTempFileThreaded/330/TestTempFile-8-150-7517790461299440039.xlsx
     [java] thread: 3, iter: 150: build/tmp/poifiles/TestTempFileThreaded/325/TestTempFile-3-150-6803292928329268917.xlsx
     [java] thread: 2, iter: 150: build/tmp/poifiles/TestTempFileThreaded/324/TestTempFile-2-150-12054915937695303234.xlsx
     [java] thread: 0, iter: 150: build/tmp/poifiles/TestTempFileThreaded/322/TestTempFile-0-150-17869646718521101214.xlsx
     [java] thread: 1, iter: 150: build/tmp/poifiles/TestTempFileThreaded/323/TestTempFile-1-150-8705125525247596464.xlsx
     [java] thread: 7, iter: 180: build/tmp/poifiles/TestTempFileThreaded/329/TestTempFile-7-180-6547299766565268633.xlsx
     [java] thread: 4, iter: 180: build/tmp/poifiles/TestTempFileThreaded/326/TestTempFile-4-180-9679725026466284876.xlsx
     [java] thread: 9, iter: 180: build/tmp/poifiles/TestTempFileThreaded/331/TestTempFile-9-180-5136243320790385627.xlsx
     [java] thread: 6, iter: 180: build/tmp/poifiles/TestTempFileThreaded/328/TestTempFile-6-180-2619860689533404376.xlsx
     [java] thread: 2, iter: 180: build/tmp/poifiles/TestTempFileThreaded/324/TestTempFile-2-180-6613142274268756304.xlsx
     [java] thread: 3, iter: 180: build/tmp/poifiles/TestTempFileThreaded/325/TestTempFile-3-180-16670755284027238581.xlsx
     [java] thread: 5, iter: 180: build/tmp/poifiles/TestTempFileThreaded/327/TestTempFile-5-180-11231241520432682635.xlsx
     [java] thread: 8, iter: 180: build/tmp/poifiles/TestTempFileThreaded/330/TestTempFile-8-180-12322231935602041078.xlsx
     [java] thread: 1, iter: 180: build/tmp/poifiles/TestTempFileThreaded/323/TestTempFile-1-180-2216241064873093532.xlsx
     [java] thread: 0, iter: 180: build/tmp/poifiles/TestTempFileThreaded/322/TestTempFile-0-180-11070266597140424888.xlsx
     [java] ..............................................
     [java] 51/244: testAccessMethods(org.apache.poi.xssf.usermodel.charts.TestXSSFDateAxis)
     [java] ....................................................................................................
     [java] 65/244: testColumnLabelSetDataFormat(org.apache.poi.xssf.usermodel.TestXSSFPivotTableRef)
     [java] ................................................................................................III.I.I.I.
     [java] 75/244: bug21334(org.apache.poi.xssf.usermodel.TestSXSSFBugs)
     [java] [Fatal Error] :1:1: JAXP00010001: The parser has encountered more than "1" entity expansions in this document; this is the limit imposed by the JDK.
     [java] Cleaning up unclosed ZipFile for archive <https://builds.apache.org/job/POI-DSL-1.12/ws/test-data/spreadsheet/54764.xlsx>
     [java] ......I.......I.....I..............................................................................I....
     [java] 76/244: test57236(org.apache.poi.xssf.usermodel.TestXSSFBugs)
     [java] Cleaning up unclosed ZipFile for archive <https://builds.apache.org/job/POI-DSL-1.12/ws/test-data/spreadsheet/54764.xlsx>
     [java] ..II............I...I........................I.........I.....I.............................................
     [java] 77/244: existingHeaderFooter(org.apache.poi.xssf.usermodel.TestXSSFSheet)
     [java] ....................................................................................................
     [java] 82/244: testItalic(org.apache.poi.xssf.usermodel.TestXSSFFont)
     [java] ....................................................................................................
     [java] 90/244: testSetGetScale(org.apache.poi.xssf.usermodel.TestXSSFPrintSetup)
     [java] ....................................I................................................................
     [java] 97/244: testUnicodeNamedRange(org.apache.poi.xssf.usermodel.TestXSSFName)
     [java] ....................................................................................................
     [java] 100/244: processFunctionRow[Acos](org.apache.poi.xssf.usermodel.TestFormulaEvaluatorOnXSSF)
     [java] ....................................................................................................
     [java] 100/244: processFunctionRow[False](org.apache.poi.xssf.usermodel.TestFormulaEvaluatorOnXSSF)
     [java] ....................................................................................................
     [java] 100/244: processFunctionRow[Midb](org.apache.poi.xssf.usermodel.TestFormulaEvaluatorOnXSSF)
     [java] ....................................................................................................
     [java] 100/244: processFunctionRow[Step](org.apache.poi.xssf.usermodel.TestFormulaEvaluatorOnXSSF)
     [java] ....................................................................................................
     [java] 107/244: testXSSFSetArrayFormula_multiCell(org.apache.poi.xssf.usermodel.TestXSSFSheetUpdateArrayFormulas)
     [java] ...............I........................................................I.I.....I.......................
     [java] 118/244: testUpdateCachedFormulaResultFromErrorToNumber_bug46479(org.apache.poi.xssf.usermodel.TestXSSFFormulaEvaluation)
     [java] ......................................................................................I..............
     [java] 133/244: testGetSimpleText(org.apache.poi.xssf.extractor.TestXSSFExcelExtractorUsingFactory)
     [java] .......I.........................................................................I..I.II.................
     [java] 146/244: createSheet(org.apache.poi.xssf.streaming.TestSXSSFWorkbook)
     [java] ....................................................................................................
     [java] 149/244: getFirstLastRowNum(org.apache.poi.xssf.streaming.TestSXSSFSheet)
     [java] ........................................................................II............................
     [java] 164/244: copyRow(org.apache.poi.ss.usermodel.TestXSSFRangeCopier)
     [java] ....................................................................................................
     [java] 183/244: testTextRun(org.apache.poi.xslf.usermodel.TestXSLFAutoShape)
     [java] ....................................................................................................
     [java] 207/244: testMasterBackground(org.apache.poi.xslf.TestXSLFSlideShow)
     [java] WARNING: An illegal reflective access operation has occurred
     [java] WARNING: Illegal reflective access by org.bouncycastle.jcajce.provider.drbg.DRBG (<https://builds.apache.org/job/POI-DSL-1.12/ws/compile-lib/bcprov-ext-jdk15on-1.60.jar)> to constructor sun.security.provider.Sun()
     [java] WARNING: Please consider reporting this to the maintainers of org.bouncycastle.jcajce.provider.drbg.DRBG
     [java] WARNING: Use --illegal-access=warn to enable warnings of further illegal reflective access operations
     [java] WARNING: All illegal access operations will be denied in a future release
     [java] SLF4J: Failed to load class "org.slf4j.impl.StaticLoggerBinder".
     [java] SLF4J: Defaulting to no-operation (NOP) logger implementation
     [java] SLF4J: See http://www.slf4j.org/codes.html#StaticLoggerBinder for further details.
     [java] ...........I.I......................................I..............I....................................
     [java] 218/244: testAgileEncryptionModes[rc2 sha256 cbc](org.apache.poi.poifs.crypt.TestAgileEncryptionParameters)
     [java] ................................................I....................................................
     [java] 230/244: testBug56479(org.apache.poi.openxml4j.opc.TestPackage)
     [java] ........I..............................................I........................
     [java] Exception in thread "main" java.lang.RuntimeException: java.lang.NoSuchFieldException: classes
     [java] at org.apache.poi.ooxml.util.OOXMLLite$2.run(OOXMLLite.java:340)
     [java] at org.apache.poi.ooxml.util.OOXMLLite$2.run(OOXMLLite.java:331)
     [java] at java.base/java.security.AccessController.doPrivileged(Native Method)
     [java] at org.apache.poi.ooxml.util.OOXMLLite.getLoadedClasses(OOXMLLite.java:331)
     [java] at org.apache.poi.ooxml.util.OOXMLLite.build(OOXMLLite.java:196)
     [java] at org.apache.poi.ooxml.util.OOXMLLite.main(OOXMLLite.java:107)
     [java] Caused by: java.lang.NoSuchFieldException: classes
     [java] at java.base/java.lang.Class.getDeclaredField(Class.java:2399)
     [java] at org.apache.poi.ooxml.util.OOXMLLite$2.run(OOXMLLite.java:336)
     [java] ... 5 more
     [java] Time: 132.95
     [java]
     [java] OK (2477 tests)
     [java]
     [java] Copying classes to <https://builds.apache.org/job/POI-DSL-1.12/ws/build/ooxml-lite-classes>

BUILD FAILED
<https://builds.apache.org/job/POI-DSL-1.12/ws/build.xml>:1704: Java returned: 1

Total time: 5 minutes 24 seconds
Build step 'Invoke Ant' marked build as failure
Skipping publisher since build result is FAILURE
Archiving artifacts
[Fast Archiver] No prior successful build to compare, so performing full copy of artifacts
Skipping publisher since build result is FAILURE
Recording test results
ERROR: Step ?Publish JUnit test result report? failed: No test report files were found. Configuration error?

---------------------------------------------------------------------
To unsubscribe, e-mail: [hidden email]
For additional commands, e-mail: [hidden email]

Reply | Threaded
Open this post in threaded view
|

Build failed in Jenkins: POI-DSL-1.12 #4

Apache Jenkins Server
See <https://builds.apache.org/job/POI-DSL-1.12/4/display/redirect?page=changes>

Changes:

[kiwiwings] #62921 - Provide OOXMLLite alternative for Java 12+

[kiwiwings] Multiproject test including Windows slaves

------------------------------------------
[...truncated 77.56 KB...]
    [junit] Tests run: 6, Failures: 0, Errors: 0, Skipped: 0, Time elapsed: 0.002 sec
    [junit] Running org.apache.poi.ss.formula.eval.TestExternalFunction
    [junit] Tests run: 1, Failures: 0, Errors: 0, Skipped: 0, Time elapsed: 0.003 sec
    [junit] Running org.apache.poi.ss.formula.eval.TestFormulaBugs
    [junit] Tests run: 5, Failures: 0, Errors: 0, Skipped: 0, Time elapsed: 0.008 sec
    [junit] Running org.apache.poi.ss.formula.eval.TestFormulasFromSpreadsheet
    [junit] Warning - Row 13 has no cell 1, can't figure out test name
    [junit] Tests run: 379, Failures: 0, Errors: 0, Skipped: 0, Time elapsed: 0.245 sec
    [junit] Running org.apache.poi.ss.formula.eval.TestHSSFCircularReferences
    [junit] Tests run: 4, Failures: 0, Errors: 0, Skipped: 0, Time elapsed: 0.003 sec
    [junit] Running org.apache.poi.ss.formula.eval.TestMinusZeroResult
    [junit] Tests run: 4, Failures: 0, Errors: 0, Skipped: 0, Time elapsed: 0.001 sec
    [junit] Running org.apache.poi.ss.formula.eval.TestMissingArgEval
    [junit] Tests run: 2, Failures: 0, Errors: 0, Skipped: 0, Time elapsed: 0.001 sec
    [junit] Running org.apache.poi.ss.formula.eval.TestMultiSheetEval
    [junit] Tests run: 1, Failures: 0, Errors: 0, Skipped: 0, Time elapsed: 0.003 sec
    [junit] Running org.apache.poi.ss.formula.eval.TestOperandResolver
    [junit] Tests run: 4, Failures: 0, Errors: 0, Skipped: 0, Time elapsed: 0.002 sec
    [junit] Running org.apache.poi.ss.formula.eval.TestPercentEval
    [junit] Tests run: 3, Failures: 0, Errors: 0, Skipped: 0, Time elapsed: 0.002 sec
    [junit] Running org.apache.poi.ss.formula.eval.TestPowerEval
    [junit] Tests run: 6, Failures: 0, Errors: 0, Skipped: 0, Time elapsed: 0.002 sec
    [junit] Running org.apache.poi.ss.formula.eval.TestRangeEval
    [junit] Tests run: 2, Failures: 0, Errors: 0, Skipped: 0, Time elapsed: 0.005 sec
    [junit] Running org.apache.poi.ss.formula.eval.TestUnaryPlusEval
    [junit] Tests run: 1, Failures: 0, Errors: 0, Skipped: 0, Time elapsed: 0.001 sec
    [junit] Running org.apache.poi.ss.formula.eval.forked.TestForkedEvaluator
    [junit] Tests run: 2, Failures: 0, Errors: 0, Skipped: 0, Time elapsed: 0.02 sec
    [junit] Running org.apache.poi.ss.formula.function.TestFunctionMetadataRegistry
    [junit] Tests run: 1, Failures: 0, Errors: 0, Skipped: 0, Time elapsed: 0.002 sec
    [junit] Running org.apache.poi.ss.formula.function.TestParseMissingBuiltInFuncs
    [junit] Tests run: 7, Failures: 0, Errors: 0, Skipped: 0, Time elapsed: 0.012 sec
    [junit] Running org.apache.poi.ss.formula.function.TestReadMissingBuiltInFuncs
    [junit] Tests run: 7, Failures: 0, Errors: 0, Skipped: 0, Time elapsed: 0.004 sec
    [junit] Running org.apache.poi.ss.formula.functions.TestAddress
    [junit] Tests run: 1, Failures: 0, Errors: 0, Skipped: 0, Time elapsed: 0.003 sec
    [junit] Running org.apache.poi.ss.formula.functions.TestAreas
    [junit] Tests run: 1, Failures: 0, Errors: 0, Skipped: 0, Time elapsed: 0.003 sec
    [junit] Running org.apache.poi.ss.formula.functions.TestAverage
    [junit] Tests run: 3, Failures: 0, Errors: 0, Skipped: 0, Time elapsed: 0.001 sec
    [junit] Running org.apache.poi.ss.formula.functions.TestBin2Dec
    [junit] Tests run: 5, Failures: 0, Errors: 0, Skipped: 0, Time elapsed: 0.004 sec
    [junit] Running org.apache.poi.ss.formula.functions.TestCalendarFieldFunction
    [junit] Tests run: 4, Failures: 0, Errors: 0, Skipped: 0, Time elapsed: 0.013 sec
    [junit] Running org.apache.poi.ss.formula.functions.TestClean
    [junit] Tests run: 1, Failures: 0, Errors: 0, Skipped: 0, Time elapsed: 0.003 sec
    [junit] Running org.apache.poi.ss.formula.functions.TestCode
    [junit] Tests run: 2, Failures: 0, Errors: 0, Skipped: 0, Time elapsed: 0.001 sec
    [junit] Running org.apache.poi.ss.formula.functions.TestCodeFunctionsFromSpreadsheet
    [junit] Tests run: 4, Failures: 0, Errors: 0, Skipped: 0, Time elapsed: 0.002 sec
    [junit] Running org.apache.poi.ss.formula.functions.TestComplex
    [junit] Tests run: 2, Failures: 0, Errors: 0, Skipped: 0, Time elapsed: 0.002 sec
    [junit] Running org.apache.poi.ss.formula.functions.TestComplexFunctionsFromSpreadsheet
    [junit] Tests run: 12, Failures: 0, Errors: 0, Skipped: 0, Time elapsed: 0.005 sec
    [junit] Running org.apache.poi.ss.formula.functions.TestCountFuncs
    [junit] Tests run: 16, Failures: 0, Errors: 0, Skipped: 0, Time elapsed: 0.022 sec
    [junit] Running org.apache.poi.ss.formula.functions.TestDGetFunctionsFromSpreadsheet
    [junit] Tests run: 78, Failures: 0, Errors: 0, Skipped: 0, Time elapsed: 0.03 sec
    [junit] Running org.apache.poi.ss.formula.functions.TestDStarFunctionsFromSpreadsheet
    [junit] Tests run: 12, Failures: 0, Errors: 0, Skipped: 0, Time elapsed: 0.005 sec
    [junit] Running org.apache.poi.ss.formula.functions.TestDate
    [junit] Tests run: 3, Failures: 0, Errors: 0, Skipped: 0, Time elapsed: 0.003 sec
    [junit] Running org.apache.poi.ss.formula.functions.TestDays360
    [junit] Tests run: 2, Failures: 0, Errors: 0, Skipped: 0, Time elapsed: 0.011 sec
    [junit] Running org.apache.poi.ss.formula.functions.TestDec2Bin
    [junit] Tests run: 15, Failures: 0, Errors: 0, Skipped: 0, Time elapsed: 0.046 sec
    [junit] Running org.apache.poi.ss.formula.functions.TestDec2Hex
    [junit] Tests run: 12, Failures: 0, Errors: 0, Skipped: 0, Time elapsed: 0.049 sec
    [junit] Running org.apache.poi.ss.formula.functions.TestDelta
    [junit] Tests run: 2, Failures: 0, Errors: 0, Skipped: 0, Time elapsed: 0.001 sec
    [junit] Running org.apache.poi.ss.formula.functions.TestDeltaFunctionsFromSpreadsheet
    [junit] Tests run: 7, Failures: 0, Errors: 0, Skipped: 0, Time elapsed: 0.004 sec
    [junit] Running org.apache.poi.ss.formula.functions.TestEDate
    [junit] Tests run: 9, Failures: 0, Errors: 0, Skipped: 0, Time elapsed: 0.006 sec
    [junit] Running org.apache.poi.ss.formula.functions.TestEOMonth
    [junit] Tests run: 9, Failures: 0, Errors: 0, Skipped: 0, Time elapsed: 0.004 sec
    [junit] Running org.apache.poi.ss.formula.functions.TestFactDoubleFunctionsFromSpreadsheet
    [junit] Tests run: 8, Failures: 0, Errors: 0, Skipped: 0, Time elapsed: 0.003 sec
    [junit] Running org.apache.poi.ss.formula.functions.TestFinanceLib
    [junit] Tests run: 5, Failures: 0, Errors: 0, Skipped: 0, Time elapsed: 0.002 sec
    [junit] Running org.apache.poi.ss.formula.functions.TestFind
    [junit] Tests run: 1, Failures: 0, Errors: 0, Skipped: 0, Time elapsed: 0.003 sec
    [junit] Running org.apache.poi.ss.formula.functions.TestFixed
    [junit] Tests run: 2, Failures: 0, Errors: 0, Skipped: 0, Time elapsed: 0.005 sec
    [junit] Running org.apache.poi.ss.formula.functions.TestFixedFunctionsFromSpreadsheet
    [junit] Tests run: 20, Failures: 0, Errors: 0, Skipped: 0, Time elapsed: 0.007 sec
    [junit] Running org.apache.poi.ss.formula.functions.TestFrequency
    [junit] Tests run: 2, Failures: 0, Errors: 0, Skipped: 0, Time elapsed: 0.025 sec
    [junit] Running org.apache.poi.ss.formula.functions.TestHex2Dec
    [junit] Tests run: 5, Failures: 0, Errors: 0, Skipped: 0, Time elapsed: 0.002 sec
    [junit] Running org.apache.poi.ss.formula.functions.TestIPMT
    [junit] Tests run: 1, Failures: 0, Errors: 0, Skipped: 0, Time elapsed: 0.002 sec
    [junit] Running org.apache.poi.ss.formula.functions.TestImRealFunctionsFromSpreadsheet
    [junit] Tests run: 7, Failures: 0, Errors: 0, Skipped: 0, Time elapsed: 0.003 sec
    [junit] Running org.apache.poi.ss.formula.functions.TestImaginaryFunctionsFromSpreadsheet
    [junit] Tests run: 7, Failures: 0, Errors: 0, Skipped: 0, Time elapsed: 0.016 sec
    [junit] Running org.apache.poi.ss.formula.functions.TestIndex
    [junit] Tests run: 9, Failures: 0, Errors: 0, Skipped: 0, Time elapsed: 0.007 sec
    [junit] Running org.apache.poi.ss.formula.functions.TestIndexFunctionFromSpreadsheet
    [junit] Tests run: 98, Failures: 0, Errors: 0, Skipped: 0, Time elapsed: 0.026 sec
    [junit] Running org.apache.poi.ss.formula.functions.TestIndirect
    [junit] Tests run: 3, Failures: 0, Errors: 0, Skipped: 0, Time elapsed: 0.006 sec
    [junit] Running org.apache.poi.ss.formula.functions.TestIndirectFunctionFromSpreadsheet
    [junit] Tests run: 11, Failures: 0, Errors: 0, Skipped: 0, Time elapsed: 0.005 sec
    [junit] Running org.apache.poi.ss.formula.functions.TestIntercept
    [junit] Tests run: 4, Failures: 0, Errors: 0, Skipped: 0, Time elapsed: 0.003 sec
    [junit] Running org.apache.poi.ss.formula.functions.TestIrr
    [junit] Tests run: 3, Failures: 0, Errors: 0, Skipped: 0, Time elapsed: 0.004 sec
    [junit] Running org.apache.poi.ss.formula.functions.TestIsBlank
    [junit] Tests run: 1, Failures: 0, Errors: 0, Skipped: 0, Time elapsed: 0.002 sec
    [junit] Running org.apache.poi.ss.formula.functions.TestLeftRight
    [junit] Tests run: 2, Failures: 0, Errors: 0, Skipped: 0, Time elapsed: 0.001 sec
    [junit] Running org.apache.poi.ss.formula.functions.TestLen
    [junit] Tests run: 3, Failures: 0, Errors: 0, Skipped: 0, Time elapsed: 0.002 sec
    [junit] Running org.apache.poi.ss.formula.functions.TestLogicalFunction
    [junit] Tests run: 2, Failures: 0, Errors: 0, Skipped: 0, Time elapsed: 0.001 sec
    [junit] Running org.apache.poi.ss.formula.functions.TestLookupFunctionsFromSpreadsheet
    [junit] Tests run: 199, Failures: 0, Errors: 0, Skipped: 0, Time elapsed: 0.062 sec
    [junit] Running org.apache.poi.ss.formula.functions.TestMatch
    [junit] Tests run: 9, Failures: 0, Errors: 0, Skipped: 0, Time elapsed: 0.005 sec
    [junit] Running org.apache.poi.ss.formula.functions.TestMatchFunctionsFromSpreadsheet
    [junit] Tests run: 13, Failures: 0, Errors: 0, Skipped: 0, Time elapsed: 0.006 sec
    [junit] Running org.apache.poi.ss.formula.functions.TestMathX
    [junit] Tests run: 23, Failures: 0, Errors: 0, Skipped: 0, Time elapsed: 0.028 sec
    [junit] Running org.apache.poi.ss.formula.functions.TestMid
    [junit] Tests run: 4, Failures: 0, Errors: 0, Skipped: 0, Time elapsed: 0.002 sec
    [junit] Running org.apache.poi.ss.formula.functions.TestMirr
    [junit] Tests run: 4, Failures: 0, Errors: 0, Skipped: 0, Time elapsed: 0.004 sec
    [junit] Running org.apache.poi.ss.formula.functions.TestMultiOperandNumericFunction
    [junit] Tests run: 1, Failures: 0, Errors: 0, Skipped: 0, Time elapsed: 0.001 sec
    [junit] Running org.apache.poi.ss.formula.functions.TestNper
    [junit] Tests run: 2, Failures: 0, Errors: 0, Skipped: 0, Time elapsed: 0.002 sec
    [junit] Running org.apache.poi.ss.formula.functions.TestNpv
    [junit] Tests run: 2, Failures: 0, Errors: 0, Skipped: 0, Time elapsed: 0.004 sec
    [junit] Running org.apache.poi.ss.formula.functions.TestOct2Dec
    [junit] Tests run: 2, Failures: 0, Errors: 0, Skipped: 0, Time elapsed: 0.002 sec
    [junit] Running org.apache.poi.ss.formula.functions.TestOffset
    [junit] Tests run: 3, Failures: 0, Errors: 0, Skipped: 0, Time elapsed: 0.002 sec
    [junit] Running org.apache.poi.ss.formula.functions.TestPPMT
    [junit] Tests run: 1, Failures: 0, Errors: 0, Skipped: 0, Time elapsed: 0.003 sec
    [junit] Running org.apache.poi.ss.formula.functions.TestPmt
    [junit] Tests run: 2, Failures: 0, Errors: 0, Skipped: 0, Time elapsed: 0.001 sec
    [junit] Running org.apache.poi.ss.formula.functions.TestPoisson
    [junit] Tests run: 6, Failures: 0, Errors: 0, Skipped: 0, Time elapsed: 0.002 sec
    [junit] Running org.apache.poi.ss.formula.functions.TestQuotient
    [junit] Tests run: 2, Failures: 0, Errors: 0, Skipped: 0, Time elapsed: 0.001 sec
    [junit] Running org.apache.poi.ss.formula.functions.TestQuotientFunctionsFromSpreadsheet
    [junit] Tests run: 8, Failures: 0, Errors: 0, Skipped: 0, Time elapsed: 0.003 sec
    [junit] Running org.apache.poi.ss.formula.functions.TestRank
    [junit] Tests run: 1, Failures: 0, Errors: 0, Skipped: 0, Time elapsed: 0.005 sec
    [junit] Running org.apache.poi.ss.formula.functions.TestRelationalOperations
    [junit] Tests run: 5, Failures: 0, Errors: 0, Skipped: 0, Time elapsed: 0.003 sec
    [junit] Running org.apache.poi.ss.formula.functions.TestReptFunctionsFromSpreadsheet
    [junit] Tests run: 5, Failures: 0, Errors: 0, Skipped: 0, Time elapsed: 0.005 sec
    [junit] Running org.apache.poi.ss.formula.functions.TestRomanFunctionsFromSpreadsheet
    [junit] Tests run: 35, Failures: 0, Errors: 0, Skipped: 0, Time elapsed: 0.01 sec
    [junit] Running org.apache.poi.ss.formula.functions.TestRoundFuncs
    [junit] Tests run: 5, Failures: 0, Errors: 0, Skipped: 1, Time elapsed: 0.002 sec
    [junit] Running org.apache.poi.ss.formula.functions.TestRowCol
    [junit] Tests run: 4, Failures: 0, Errors: 0, Skipped: 0, Time elapsed: 0.001 sec
    [junit] Running org.apache.poi.ss.formula.functions.TestSlope
    [junit] Tests run: 3, Failures: 0, Errors: 0, Skipped: 0, Time elapsed: 0.002 sec
    [junit] Running org.apache.poi.ss.formula.functions.TestStatsLib
    [junit] Tests run: 9, Failures: 0, Errors: 0, Skipped: 0, Time elapsed: 0.002 sec
    [junit] Running org.apache.poi.ss.formula.functions.TestSubtotal
    [junit] Tests run: 11, Failures: 0, Errors: 0, Skipped: 0, Time elapsed: 0.01 sec
    [junit] Running org.apache.poi.ss.formula.functions.TestSumif
    [junit] Tests run: 3, Failures: 0, Errors: 0, Skipped: 0, Time elapsed: 0.003 sec
    [junit] Running org.apache.poi.ss.formula.functions.TestSumifs
    [junit] Tests run: 7, Failures: 0, Errors: 0, Skipped: 0, Time elapsed: 0.006 sec
    [junit] Running org.apache.poi.ss.formula.functions.TestSumproduct
    [junit] Tests run: 5, Failures: 0, Errors: 0, Skipped: 0, Time elapsed: 0.002 sec
    [junit] Running org.apache.poi.ss.formula.functions.TestTFunc
    [junit] Tests run: 5, Failures: 0, Errors: 0, Skipped: 0, Time elapsed: 0.03 sec
    [junit] Running org.apache.poi.ss.formula.functions.TestText
    [junit] Tests run: 4, Failures: 0, Errors: 0, Skipped: 0, Time elapsed: 0.003 sec
    [junit] Running org.apache.poi.ss.formula.functions.TestTime
    [junit] Tests run: 2, Failures: 0, Errors: 0, Skipped: 0, Time elapsed: 0.005 sec
    [junit] Running org.apache.poi.ss.formula.functions.TestTrendFunctionsFromSpreadsheet
    [junit] Tests run: 41, Failures: 0, Errors: 0, Skipped: 0, Time elapsed: 0.058 sec
    [junit] Running org.apache.poi.ss.formula.functions.TestTrim
    [junit] Tests run: 3, Failures: 0, Errors: 0, Skipped: 0, Time elapsed: 0.001 sec
    [junit] Running org.apache.poi.ss.formula.functions.TestTrunc
    [junit] Tests run: 5, Failures: 0, Errors: 0, Skipped: 0, Time elapsed: 0.002 sec
    [junit] Running org.apache.poi.ss.formula.functions.TestValue
    [junit] Tests run: 2, Failures: 0, Errors: 0, Skipped: 0, Time elapsed: 0.002 sec
    [junit] Running org.apache.poi.ss.formula.functions.TestWeekNumFunctionsFromSpreadsheet
    [junit] Tests run: 7, Failures: 0, Errors: 0, Skipped: 0, Time elapsed: 0.003 sec
    [junit] Running org.apache.poi.ss.formula.functions.TestWeekNumFunctionsFromSpreadsheet2013
    [junit] Tests run: 7, Failures: 0, Errors: 0, Skipped: 0, Time elapsed: 0.027 sec
    [junit] Running org.apache.poi.ss.formula.functions.TestWeekdayFunc
    [junit] Tests run: 2, Failures: 0, Errors: 0, Skipped: 0, Time elapsed: 0.002 sec
    [junit] Running org.apache.poi.ss.formula.functions.TestXYNumericFunction
    [junit] Tests run: 3, Failures: 0, Errors: 0, Skipped: 0, Time elapsed: 0.002 sec
    [junit] Running org.apache.poi.ss.formula.ptg.TestAbstractFunctionPtg
    [junit] Tests run: 3, Failures: 0, Errors: 0, Skipped: 0, Time elapsed: 0.002 sec
    [junit] Running org.apache.poi.ss.formula.ptg.TestArea3DPtg
    [junit] Tests run: 1, Failures: 0, Errors: 0, Skipped: 0, Time elapsed: 0.001 sec
    [junit] Running org.apache.poi.ss.formula.ptg.TestAreaErrPtg
    [junit] Tests run: 1, Failures: 0, Errors: 0, Skipped: 0, Time elapsed: 0.002 sec
    [junit] Running org.apache.poi.ss.formula.ptg.TestAreaPtg
    [junit] Tests run: 5, Failures: 0, Errors: 0, Skipped: 0, Time elapsed: 0.002 sec
    [junit] Running org.apache.poi.ss.formula.ptg.TestArrayPtg
    [junit] Tests run: 5, Failures: 0, Errors: 0, Skipped: 0, Time elapsed: 0.003 sec
    [junit] Running org.apache.poi.ss.formula.ptg.TestAttrPtg
    [junit] Tests run: 1, Failures: 0, Errors: 0, Skipped: 0, Time elapsed: 0.001 sec
    [junit] Running org.apache.poi.ss.formula.ptg.TestErrPtg
    [junit] Tests run: 1, Failures: 0, Errors: 0, Skipped: 0, Time elapsed: 0.001 sec
    [junit] Running org.apache.poi.ss.formula.ptg.TestExternalFunctionFormulas
    [junit] Tests run: 3, Failures: 0, Errors: 0, Skipped: 0, Time elapsed: 0.004 sec
    [junit] Running org.apache.poi.ss.formula.ptg.TestExternalNameReference
    [junit] Tests run: 3, Failures: 0, Errors: 0, Skipped: 0, Time elapsed: 0.005 sec
    [junit] Running org.apache.poi.ss.formula.ptg.TestFuncPtg
    [junit] Tests run: 2, Failures: 0, Errors: 0, Skipped: 0, Time elapsed: 0.002 sec
    [junit] Running org.apache.poi.ss.formula.ptg.TestFuncVarPtg
    [junit] Tests run: 1, Failures: 0, Errors: 0, Skipped: 0, Time elapsed: 0.002 sec
    [junit] Running org.apache.poi.ss.formula.ptg.TestIntersectionPtg
    [junit] Tests run: 1, Failures: 0, Errors: 0, Skipped: 0, Time elapsed: 0.002 sec
    [junit] Running org.apache.poi.ss.formula.ptg.TestPercentPtg
    [junit] Tests run: 1, Failures: 0, Errors: 0, Skipped: 0, Time elapsed: 0.002 sec
    [junit] Running org.apache.poi.ss.formula.ptg.TestRangePtg
    [junit] Tests run: 1, Failures: 0, Errors: 0, Skipped: 0, Time elapsed: 0.001 sec
    [junit] Running org.apache.poi.ss.formula.ptg.TestRef3DPtg
    [junit] Tests run: 1, Failures: 0, Errors: 0, Skipped: 0, Time elapsed: 0.002 sec
    [junit] Running org.apache.poi.ss.formula.ptg.TestReferencePtg
    [junit] Tests run: 4, Failures: 0, Errors: 0, Skipped: 0, Time elapsed: 0.009 sec
    [junit] Running org.apache.poi.ss.formula.ptg.TestUnionPtg
    [junit] Tests run: 1, Failures: 0, Errors: 0, Skipped: 0, Time elapsed: 0.002 sec
    [junit] Running org.apache.poi.ss.formula.udf.TestAggregatingUDFFinder
    [junit] Tests run: 2, Failures: 0, Errors: 0, Skipped: 0, Time elapsed: 0.001 sec
    [junit] Running org.apache.poi.ss.formula.udf.TestDefaultUDFFinder
    [junit] Tests run: 1, Failures: 0, Errors: 0, Skipped: 0, Time elapsed: 0.001 sec
    [junit] Running org.apache.poi.ss.usermodel.TestDataFormatter
    [junit] Tests run: 33, Failures: 0, Errors: 0, Skipped: 1, Time elapsed: 0.085 sec
    [junit] Running org.apache.poi.ss.usermodel.TestDateUtil
    [junit] Tests run: 5, Failures: 0, Errors: 0, Skipped: 0, Time elapsed: 0.004 sec
    [junit] Running org.apache.poi.ss.usermodel.TestExcelStyleDateFormatter
    [junit] Tests run: 4, Failures: 0, Errors: 1, Skipped: 0, Time elapsed: 0.032 sec

BUILD FAILED
<https://builds.apache.org/job/POI-DSL-1.12/ws/build.xml>:1436: Tests failed

Total time: 4 minutes 43 seconds
Build step 'Invoke Ant' marked build as failure
Skipping publisher since build result is FAILURE
Archiving artifacts
[Fast Archiver] No prior successful build to compare, so performing full copy of artifacts
Skipping publisher since build result is FAILURE
Recording test results

---------------------------------------------------------------------
To unsubscribe, e-mail: [hidden email]
For additional commands, e-mail: [hidden email]

Reply | Threaded
Open this post in threaded view
|

Build failed in Jenkins: POI-DSL-1.12 #5

Apache Jenkins Server
See <https://builds.apache.org/job/POI-DSL-1.12/5/display/redirect?page=changes>

Changes:

[kiwiwings] #62921 - Provide OOXMLLite alternative for Java 12+

------------------------------------------
[...truncated 65.15 KB...]
    [junit] Tests run: 6, Failures: 0, Errors: 0, Skipped: 0, Time elapsed: 0.003 sec
    [junit] Running org.apache.poi.ss.formula.eval.TestExternalFunction
    [junit] Tests run: 1, Failures: 0, Errors: 0, Skipped: 0, Time elapsed: 0.003 sec
    [junit] Running org.apache.poi.ss.formula.eval.TestFormulaBugs
    [junit] Tests run: 5, Failures: 0, Errors: 0, Skipped: 0, Time elapsed: 0.008 sec
    [junit] Running org.apache.poi.ss.formula.eval.TestFormulasFromSpreadsheet
    [junit] Tests run: 379, Failures: 0, Errors: 0, Skipped: 0, Time elapsed: 0.204 sec
    [junit] Running org.apache.poi.ss.formula.eval.TestHSSFCircularReferences
    [junit] Tests run: 4, Failures: 0, Errors: 0, Skipped: 0, Time elapsed: 0.003 sec
    [junit] Running org.apache.poi.ss.formula.eval.TestMinusZeroResult
    [junit] Tests run: 4, Failures: 0, Errors: 0, Skipped: 0, Time elapsed: 0.002 sec
    [junit] Running org.apache.poi.ss.formula.eval.TestMissingArgEval
    [junit] Tests run: 2, Failures: 0, Errors: 0, Skipped: 0, Time elapsed: 0.001 sec
    [junit] Running org.apache.poi.ss.formula.eval.TestMultiSheetEval
    [junit] Warning - Row 13 has no cell 1, can't figure out test name
    [junit] Tests run: 1, Failures: 0, Errors: 0, Skipped: 0, Time elapsed: 0.004 sec
    [junit] Running org.apache.poi.ss.formula.eval.TestOperandResolver
    [junit] Tests run: 4, Failures: 0, Errors: 0, Skipped: 0, Time elapsed: 0.002 sec
    [junit] Running org.apache.poi.ss.formula.eval.TestPercentEval
    [junit] Tests run: 3, Failures: 0, Errors: 0, Skipped: 0, Time elapsed: 0.002 sec
    [junit] Running org.apache.poi.ss.formula.eval.TestPowerEval
    [junit] Tests run: 6, Failures: 0, Errors: 0, Skipped: 0, Time elapsed: 0.002 sec
    [junit] Running org.apache.poi.ss.formula.eval.TestRangeEval
    [junit] Tests run: 2, Failures: 0, Errors: 0, Skipped: 0, Time elapsed: 0.005 sec
    [junit] Running org.apache.poi.ss.formula.eval.TestUnaryPlusEval
    [junit] Tests run: 1, Failures: 0, Errors: 0, Skipped: 0, Time elapsed: 0.001 sec
    [junit] Running org.apache.poi.ss.formula.eval.forked.TestForkedEvaluator
    [junit] Tests run: 2, Failures: 0, Errors: 0, Skipped: 0, Time elapsed: 0.012 sec
    [junit] Running org.apache.poi.ss.formula.function.TestFunctionMetadataRegistry
    [junit] Tests run: 1, Failures: 0, Errors: 0, Skipped: 0, Time elapsed: 0 sec
    [junit] Running org.apache.poi.ss.formula.function.TestParseMissingBuiltInFuncs
    [junit] Tests run: 7, Failures: 0, Errors: 0, Skipped: 0, Time elapsed: 0.002 sec
    [junit] Running org.apache.poi.ss.formula.function.TestReadMissingBuiltInFuncs
    [junit] Tests run: 7, Failures: 0, Errors: 0, Skipped: 0, Time elapsed: 0.003 sec
    [junit] Running org.apache.poi.ss.formula.functions.TestAddress
    [junit] Tests run: 1, Failures: 0, Errors: 0, Skipped: 0, Time elapsed: 0.002 sec
    [junit] Running org.apache.poi.ss.formula.functions.TestAreas
    [junit] Tests run: 1, Failures: 0, Errors: 0, Skipped: 0, Time elapsed: 0.002 sec
    [junit] Running org.apache.poi.ss.formula.functions.TestAverage
    [junit] Tests run: 3, Failures: 0, Errors: 0, Skipped: 0, Time elapsed: 0.002 sec
    [junit] Running org.apache.poi.ss.formula.functions.TestBin2Dec
    [junit] Tests run: 5, Failures: 0, Errors: 0, Skipped: 0, Time elapsed: 0.002 sec
    [junit] Running org.apache.poi.ss.formula.functions.TestCalendarFieldFunction
    [junit] Tests run: 4, Failures: 0, Errors: 0, Skipped: 0, Time elapsed: 0.005 sec
    [junit] Running org.apache.poi.ss.formula.functions.TestClean
    [junit] Tests run: 1, Failures: 0, Errors: 0, Skipped: 0, Time elapsed: 0.002 sec
    [junit] Running org.apache.poi.ss.formula.functions.TestCode
    [junit] Tests run: 2, Failures: 0, Errors: 0, Skipped: 0, Time elapsed: 0.001 sec
    [junit] Running org.apache.poi.ss.formula.functions.TestCodeFunctionsFromSpreadsheet
    [junit] Tests run: 4, Failures: 0, Errors: 0, Skipped: 0, Time elapsed: 0.003 sec
    [junit] Running org.apache.poi.ss.formula.functions.TestComplex
    [junit] Tests run: 2, Failures: 0, Errors: 0, Skipped: 0, Time elapsed: 0.001 sec
    [junit] Running org.apache.poi.ss.formula.functions.TestComplexFunctionsFromSpreadsheet
    [junit] Tests run: 12, Failures: 0, Errors: 0, Skipped: 0, Time elapsed: 0.005 sec
    [junit] Running org.apache.poi.ss.formula.functions.TestCountFuncs
    [junit] Tests run: 16, Failures: 0, Errors: 0, Skipped: 0, Time elapsed: 0.019 sec
    [junit] Running org.apache.poi.ss.formula.functions.TestDGetFunctionsFromSpreadsheet
    [junit] Tests run: 78, Failures: 0, Errors: 0, Skipped: 0, Time elapsed: 0.032 sec
    [junit] Running org.apache.poi.ss.formula.functions.TestDStarFunctionsFromSpreadsheet
    [junit] Tests run: 12, Failures: 0, Errors: 0, Skipped: 0, Time elapsed: 0.005 sec
    [junit] Running org.apache.poi.ss.formula.functions.TestDate
    [junit] Tests run: 3, Failures: 0, Errors: 0, Skipped: 0, Time elapsed: 0.002 sec
    [junit] Running org.apache.poi.ss.formula.functions.TestDays360
    [junit] Tests run: 2, Failures: 0, Errors: 0, Skipped: 0, Time elapsed: 0.012 sec
    [junit] Running org.apache.poi.ss.formula.functions.TestDec2Bin
    [junit] Tests run: 15, Failures: 0, Errors: 0, Skipped: 0, Time elapsed: 0.074 sec
    [junit] Running org.apache.poi.ss.formula.functions.TestDec2Hex
    [junit] Tests run: 12, Failures: 0, Errors: 0, Skipped: 0, Time elapsed: 0.045 sec
    [junit] Running org.apache.poi.ss.formula.functions.TestDelta
    [junit] Tests run: 2, Failures: 0, Errors: 0, Skipped: 0, Time elapsed: 0.002 sec
    [junit] Running org.apache.poi.ss.formula.functions.TestDeltaFunctionsFromSpreadsheet
    [junit] Tests run: 7, Failures: 0, Errors: 0, Skipped: 0, Time elapsed: 0.004 sec
    [junit] Running org.apache.poi.ss.formula.functions.TestEDate
    [junit] Tests run: 9, Failures: 0, Errors: 0, Skipped: 0, Time elapsed: 0.005 sec
    [junit] Running org.apache.poi.ss.formula.functions.TestEOMonth
    [junit] Tests run: 9, Failures: 0, Errors: 0, Skipped: 0, Time elapsed: 0.004 sec
    [junit] Running org.apache.poi.ss.formula.functions.TestFactDoubleFunctionsFromSpreadsheet
    [junit] Tests run: 8, Failures: 0, Errors: 0, Skipped: 0, Time elapsed: 0.003 sec
    [junit] Running org.apache.poi.ss.formula.functions.TestFinanceLib
    [junit] Tests run: 5, Failures: 0, Errors: 0, Skipped: 0, Time elapsed: 0.001 sec
    [junit] Running org.apache.poi.ss.formula.functions.TestFind
    [junit] Tests run: 1, Failures: 0, Errors: 0, Skipped: 0, Time elapsed: 0.002 sec
    [junit] Running org.apache.poi.ss.formula.functions.TestFixed
    [junit] Tests run: 2, Failures: 0, Errors: 0, Skipped: 0, Time elapsed: 0.004 sec
    [junit] Running org.apache.poi.ss.formula.functions.TestFixedFunctionsFromSpreadsheet
    [junit] Tests run: 20, Failures: 0, Errors: 0, Skipped: 0, Time elapsed: 0.007 sec
    [junit] Running org.apache.poi.ss.formula.functions.TestFrequency
    [junit] Tests run: 2, Failures: 0, Errors: 0, Skipped: 0, Time elapsed: 0.007 sec
    [junit] Running org.apache.poi.ss.formula.functions.TestHex2Dec
    [junit] Tests run: 5, Failures: 0, Errors: 0, Skipped: 0, Time elapsed: 0.002 sec
    [junit] Running org.apache.poi.ss.formula.functions.TestIPMT
    [junit] Tests run: 1, Failures: 0, Errors: 0, Skipped: 0, Time elapsed: 0.002 sec
    [junit] Running org.apache.poi.ss.formula.functions.TestImRealFunctionsFromSpreadsheet
    [junit] Tests run: 7, Failures: 0, Errors: 0, Skipped: 0, Time elapsed: 0.067 sec
    [junit] Running org.apache.poi.ss.formula.functions.TestImaginaryFunctionsFromSpreadsheet
    [junit] Tests run: 7, Failures: 0, Errors: 0, Skipped: 0, Time elapsed: 0.003 sec
    [junit] Running org.apache.poi.ss.formula.functions.TestIndex
    [junit] Tests run: 9, Failures: 0, Errors: 0, Skipped: 0, Time elapsed: 0.017 sec
    [junit] Running org.apache.poi.ss.formula.functions.TestIndexFunctionFromSpreadsheet
    [junit] Tests run: 98, Failures: 0, Errors: 0, Skipped: 0, Time elapsed: 0.026 sec
    [junit] Running org.apache.poi.ss.formula.functions.TestIndirect
    [junit] Tests run: 3, Failures: 0, Errors: 0, Skipped: 0, Time elapsed: 0.007 sec
    [junit] Running org.apache.poi.ss.formula.functions.TestIndirectFunctionFromSpreadsheet
    [junit] Tests run: 11, Failures: 0, Errors: 0, Skipped: 0, Time elapsed: 0.004 sec
    [junit] Running org.apache.poi.ss.formula.functions.TestIntercept
    [junit] Tests run: 4, Failures: 0, Errors: 0, Skipped: 0, Time elapsed: 0.003 sec
    [junit] Running org.apache.poi.ss.formula.functions.TestIrr
    [junit] Tests run: 3, Failures: 0, Errors: 0, Skipped: 0, Time elapsed: 0.003 sec
    [junit] Running org.apache.poi.ss.formula.functions.TestIsBlank
    [junit] Tests run: 1, Failures: 0, Errors: 0, Skipped: 0, Time elapsed: 0.002 sec
    [junit] Running org.apache.poi.ss.formula.functions.TestLeftRight
    [junit] Tests run: 2, Failures: 0, Errors: 0, Skipped: 0, Time elapsed: 0.001 sec
    [junit] Running org.apache.poi.ss.formula.functions.TestLen
    [junit] Tests run: 3, Failures: 0, Errors: 0, Skipped: 0, Time elapsed: 0.001 sec
    [junit] Running org.apache.poi.ss.formula.functions.TestLogicalFunction
    [junit] Tests run: 2, Failures: 0, Errors: 0, Skipped: 0, Time elapsed: 0.002 sec
    [junit] Running org.apache.poi.ss.formula.functions.TestLookupFunctionsFromSpreadsheet
    [junit] Tests run: 199, Failures: 0, Errors: 0, Skipped: 0, Time elapsed: 0.079 sec
    [junit] Running org.apache.poi.ss.formula.functions.TestMatch
    [junit] Tests run: 9, Failures: 0, Errors: 0, Skipped: 0, Time elapsed: 0.006 sec
    [junit] Running org.apache.poi.ss.formula.functions.TestMatchFunctionsFromSpreadsheet
    [junit] Tests run: 13, Failures: 0, Errors: 0, Skipped: 0, Time elapsed: 0.005 sec
    [junit] Running org.apache.poi.ss.formula.functions.TestMathX
    [junit] Tests run: 23, Failures: 0, Errors: 0, Skipped: 0, Time elapsed: 0.007 sec
    [junit] Running org.apache.poi.ss.formula.functions.TestMid
    [junit] Tests run: 4, Failures: 0, Errors: 0, Skipped: 0, Time elapsed: 0.002 sec
    [junit] Running org.apache.poi.ss.formula.functions.TestMirr
    [junit] Tests run: 4, Failures: 0, Errors: 0, Skipped: 0, Time elapsed: 0.003 sec
    [junit] Running org.apache.poi.ss.formula.functions.TestMultiOperandNumericFunction
    [junit] Tests run: 1, Failures: 0, Errors: 0, Skipped: 0, Time elapsed: 0.001 sec
    [junit] Running org.apache.poi.ss.formula.functions.TestNper
    [junit] Tests run: 2, Failures: 0, Errors: 0, Skipped: 0, Time elapsed: 0.002 sec
    [junit] Running org.apache.poi.ss.formula.functions.TestNpv
    [junit] Tests run: 2, Failures: 0, Errors: 0, Skipped: 0, Time elapsed: 0.003 sec
    [junit] Running org.apache.poi.ss.formula.functions.TestOct2Dec
    [junit] Tests run: 2, Failures: 0, Errors: 0, Skipped: 0, Time elapsed: 0.001 sec
    [junit] Running org.apache.poi.ss.formula.functions.TestOffset
    [junit] Tests run: 3, Failures: 0, Errors: 0, Skipped: 0, Time elapsed: 0.001 sec
    [junit] Running org.apache.poi.ss.formula.functions.TestPPMT
    [junit] Tests run: 1, Failures: 0, Errors: 0, Skipped: 0, Time elapsed: 0.002 sec
    [junit] Running org.apache.poi.ss.formula.functions.TestPmt
    [junit] Tests run: 2, Failures: 0, Errors: 0, Skipped: 0, Time elapsed: 0.001 sec
    [junit] Running org.apache.poi.ss.formula.functions.TestPoisson
    [junit] Tests run: 6, Failures: 0, Errors: 0, Skipped: 0, Time elapsed: 0.001 sec
    [junit] Running org.apache.poi.ss.formula.functions.TestQuotient
    [junit] Tests run: 2, Failures: 0, Errors: 0, Skipped: 0, Time elapsed: 0.001 sec
    [junit] Running org.apache.poi.ss.formula.functions.TestQuotientFunctionsFromSpreadsheet
    [junit] Tests run: 8, Failures: 0, Errors: 0, Skipped: 0, Time elapsed: 0.003 sec
    [junit] Running org.apache.poi.ss.formula.functions.TestRank
    [junit] Tests run: 1, Failures: 0, Errors: 0, Skipped: 0, Time elapsed: 0.005 sec
    [junit] Running org.apache.poi.ss.formula.functions.TestRelationalOperations
    [junit] Tests run: 5, Failures: 0, Errors: 0, Skipped: 0, Time elapsed: 0.002 sec
    [junit] Running org.apache.poi.ss.formula.functions.TestReptFunctionsFromSpreadsheet
    [junit] Tests run: 5, Failures: 0, Errors: 0, Skipped: 0, Time elapsed: 0.004 sec
    [junit] Running org.apache.poi.ss.formula.functions.TestRomanFunctionsFromSpreadsheet
    [junit] Tests run: 35, Failures: 0, Errors: 0, Skipped: 0, Time elapsed: 0.01 sec
    [junit] Running org.apache.poi.ss.formula.functions.TestRoundFuncs
    [junit] Tests run: 5, Failures: 0, Errors: 0, Skipped: 1, Time elapsed: 0.001 sec
    [junit] Running org.apache.poi.ss.formula.functions.TestRowCol
    [junit] Tests run: 4, Failures: 0, Errors: 0, Skipped: 0, Time elapsed: 0.001 sec
    [junit] Running org.apache.poi.ss.formula.functions.TestSlope
    [junit] Tests run: 3, Failures: 0, Errors: 0, Skipped: 0, Time elapsed: 0.001 sec
    [junit] Running org.apache.poi.ss.formula.functions.TestStatsLib
    [junit] Tests run: 9, Failures: 0, Errors: 0, Skipped: 0, Time elapsed: 0.002 sec
    [junit] Running org.apache.poi.ss.formula.functions.TestSubtotal
    [junit] Tests run: 11, Failures: 0, Errors: 0, Skipped: 0, Time elapsed: 0.01 sec
    [junit] Running org.apache.poi.ss.formula.functions.TestSumif
    [junit] Tests run: 3, Failures: 0, Errors: 0, Skipped: 0, Time elapsed: 0.002 sec
    [junit] Running org.apache.poi.ss.formula.functions.TestSumifs
    [junit] Tests run: 7, Failures: 0, Errors: 0, Skipped: 0, Time elapsed: 0.005 sec
    [junit] Running org.apache.poi.ss.formula.functions.TestSumproduct
    [junit] Tests run: 5, Failures: 0, Errors: 0, Skipped: 0, Time elapsed: 0.002 sec
    [junit] Running org.apache.poi.ss.formula.functions.TestTFunc
    [junit] Tests run: 5, Failures: 0, Errors: 0, Skipped: 0, Time elapsed: 0.001 sec
    [junit] Running org.apache.poi.ss.formula.functions.TestText
    [junit] Tests run: 4, Failures: 0, Errors: 0, Skipped: 0, Time elapsed: 0.003 sec
    [junit] Running org.apache.poi.ss.formula.functions.TestTime
    [junit] Tests run: 2, Failures: 0, Errors: 0, Skipped: 0, Time elapsed: 0.005 sec
    [junit] Running org.apache.poi.ss.formula.functions.TestTrendFunctionsFromSpreadsheet
    [junit] Tests run: 41, Failures: 0, Errors: 0, Skipped: 0, Time elapsed: 0.03 sec
    [junit] Running org.apache.poi.ss.formula.functions.TestTrim
    [junit] Tests run: 3, Failures: 0, Errors: 0, Skipped: 0, Time elapsed: 0.002 sec
    [junit] Running org.apache.poi.ss.formula.functions.TestTrunc
    [junit] Tests run: 5, Failures: 0, Errors: 0, Skipped: 0, Time elapsed: 0.001 sec
    [junit] Running org.apache.poi.ss.formula.functions.TestValue
    [junit] Tests run: 2, Failures: 0, Errors: 0, Skipped: 0, Time elapsed: 0.002 sec
    [junit] Running org.apache.poi.ss.formula.functions.TestWeekNumFunctionsFromSpreadsheet
    [junit] Tests run: 7, Failures: 0, Errors: 0, Skipped: 0, Time elapsed: 0.003 sec
    [junit] Running org.apache.poi.ss.formula.functions.TestWeekNumFunctionsFromSpreadsheet2013
    [junit] Tests run: 7, Failures: 0, Errors: 0, Skipped: 0, Time elapsed: 0.003 sec
    [junit] Running org.apache.poi.ss.formula.functions.TestWeekdayFunc
    [junit] Tests run: 2, Failures: 0, Errors: 0, Skipped: 0, Time elapsed: 0.002 sec
    [junit] Running org.apache.poi.ss.formula.functions.TestXYNumericFunction
    [junit] Tests run: 3, Failures: 0, Errors: 0, Skipped: 0, Time elapsed: 0.003 sec
    [junit] Running org.apache.poi.ss.formula.ptg.TestAbstractFunctionPtg
    [junit] Tests run: 3, Failures: 0, Errors: 0, Skipped: 0, Time elapsed: 0.001 sec
    [junit] Running org.apache.poi.ss.formula.ptg.TestArea3DPtg
    [junit] Tests run: 1, Failures: 0, Errors: 0, Skipped: 0, Time elapsed: 0.001 sec
    [junit] Running org.apache.poi.ss.formula.ptg.TestAreaErrPtg
    [junit] Tests run: 1, Failures: 0, Errors: 0, Skipped: 0, Time elapsed: 0.001 sec
    [junit] Running org.apache.poi.ss.formula.ptg.TestAreaPtg
    [junit] Tests run: 5, Failures: 0, Errors: 0, Skipped: 0, Time elapsed: 0.002 sec
    [junit] Running org.apache.poi.ss.formula.ptg.TestArrayPtg
    [junit] Tests run: 5, Failures: 0, Errors: 0, Skipped: 0, Time elapsed: 0.002 sec
    [junit] Running org.apache.poi.ss.formula.ptg.TestAttrPtg
    [junit] Tests run: 1, Failures: 0, Errors: 0, Skipped: 0, Time elapsed: 0.001 sec
    [junit] Running org.apache.poi.ss.formula.ptg.TestErrPtg
    [junit] Tests run: 1, Failures: 0, Errors: 0, Skipped: 0, Time elapsed: 0.001 sec
    [junit] Running org.apache.poi.ss.formula.ptg.TestExternalFunctionFormulas
    [junit] Tests run: 3, Failures: 0, Errors: 0, Skipped: 0, Time elapsed: 0.004 sec
    [junit] Running org.apache.poi.ss.formula.ptg.TestExternalNameReference
    [junit] Tests run: 3, Failures: 0, Errors: 0, Skipped: 0, Time elapsed: 0.005 sec
    [junit] Running org.apache.poi.ss.formula.ptg.TestFuncPtg
    [junit] Tests run: 2, Failures: 0, Errors: 0, Skipped: 0, Time elapsed: 0.001 sec
    [junit] Running org.apache.poi.ss.formula.ptg.TestFuncVarPtg
    [junit] Tests run: 1, Failures: 0, Errors: 0, Skipped: 0, Time elapsed: 0.001 sec
    [junit] Running org.apache.poi.ss.formula.ptg.TestIntersectionPtg
    [junit] Tests run: 1, Failures: 0, Errors: 0, Skipped: 0, Time elapsed: 0.001 sec
    [junit] Running org.apache.poi.ss.formula.ptg.TestPercentPtg
    [junit] Tests run: 1, Failures: 0, Errors: 0, Skipped: 0, Time elapsed: 0.001 sec
    [junit] Running org.apache.poi.ss.formula.ptg.TestRangePtg
    [junit] Tests run: 1, Failures: 0, Errors: 0, Skipped: 0, Time elapsed: 0.001 sec
    [junit] Running org.apache.poi.ss.formula.ptg.TestRef3DPtg
    [junit] Tests run: 1, Failures: 0, Errors: 0, Skipped: 0, Time elapsed: 0.014 sec
    [junit] Running org.apache.poi.ss.formula.ptg.TestReferencePtg
    [junit] Tests run: 4, Failures: 0, Errors: 0, Skipped: 0, Time elapsed: 0.008 sec
    [junit] Running org.apache.poi.ss.formula.ptg.TestUnionPtg
    [junit] Tests run: 1, Failures: 0, Errors: 0, Skipped: 0, Time elapsed: 0.002 sec
    [junit] Running org.apache.poi.ss.formula.udf.TestAggregatingUDFFinder
    [junit] Tests run: 2, Failures: 0, Errors: 0, Skipped: 0, Time elapsed: 0.001 sec
    [junit] Running org.apache.poi.ss.formula.udf.TestDefaultUDFFinder
    [junit] Tests run: 1, Failures: 0, Errors: 0, Skipped: 0, Time elapsed: 0.001 sec
    [junit] Running org.apache.poi.ss.usermodel.TestDataFormatter
    [junit] Tests run: 33, Failures: 0, Errors: 0, Skipped: 1, Time elapsed: 0.049 sec
    [junit] Running org.apache.poi.ss.usermodel.TestDateUtil
    [junit] Tests run: 5, Failures: 0, Errors: 0, Skipped: 0, Time elapsed: 0.002 sec
    [junit] Running org.apache.poi.ss.usermodel.TestExcelStyleDateFormatter
    [junit] Tests run: 4, Failures: 1, Errors: 0, Skipped: 0, Time elapsed: 0.012 sec

BUILD FAILED
<https://builds.apache.org/job/POI-DSL-1.12/ws/build.xml>:1436: Tests failed

Total time: 4 minutes 6 seconds
Build step 'Invoke Ant' marked build as failure
Skipping publisher since build result is FAILURE
Archiving artifacts
[Fast Archiver] No prior successful build to compare, so performing full copy of artifacts
Skipping publisher since build result is FAILURE
Recording test results

---------------------------------------------------------------------
To unsubscribe, e-mail: [hidden email]
For additional commands, e-mail: [hidden email]

Reply | Threaded
Open this post in threaded view
|

Build failed in Jenkins: POI-DSL-1.12 #6

Apache Jenkins Server
See <https://builds.apache.org/job/POI-DSL-1.12/6/display/redirect?page=changes>

Changes:

[kiwiwings] #62921 - Provide OOXMLLite alternative for Java 12+

------------------------------------------
[...truncated 950.63 KB...]
 [findbugs]   javax.xml.transform.OutputKeys
 [findbugs]   java.awt.geom.Arc2D
 [findbugs]   java.lang.ClassNotFoundException
 [findbugs]   javax.xml.crypto.XMLStructure
 [findbugs]   java.nio.charset.UnsupportedCharsetException
 [findbugs]   java.nio.MappedByteBuffer
 [findbugs]   java.lang.NoSuchFieldException
 [findbugs]   java.security.DigestException
 [findbugs]   java.security.spec.AlgorithmParameterSpec
 [findbugs]   org.ietf.jgss.GSSException
 [findbugs]   javax.xml.xpath.XPathExpressionException
 [findbugs]   java.security.SignatureException
 [findbugs]   java.security.AccessControlException
 [findbugs]   javax.xml.crypto.dsig.spec.C14NMethodParameterSpec
 [findbugs]   org.xml.sax.ContentHandler
 [findbugs]   java.awt.geom.RoundRectangle2D
 [findbugs]   javax.xml.crypto.Data
 [findbugs]   javax.crypto.ShortBufferException
 [findbugs] Warnings generated: 74
 [findbugs] Missing classes: 362
 [findbugs] Calculating exit code...
 [findbugs] Setting 'missing class' flag (2)
 [findbugs] Setting 'bugs found' flag (1)
 [findbugs] Exit code set to: 3
 [findbugs] Java Result: 3
 [findbugs] Classes needed for analysis were missing
 [findbugs] Output saved to build/findbugs.xml
     [xslt] Transforming into <https://builds.apache.org/job/POI-DSL-1.12/ws/build>
     [xslt] Processing <https://builds.apache.org/job/POI-DSL-1.12/ws/build/findbugs.xml> to <https://builds.apache.org/job/POI-DSL-1.12/6/artifact/build/findbugs.html>
     [xslt] Loading stylesheet jar:<https://builds.apache.org/job/POI-DSL-1.12/ws/build/findbugs/lib/findbugs.jar!/fancy-hist.xsl>

release-notes:
     [copy] Copying 1 file to <https://builds.apache.org/job/POI-DSL-1.12/ws/build/dist>

rat-check:
    [mkdir] Created dir: <https://builds.apache.org/job/POI-DSL-1.12/ws/build/rat>
     [echo]
     [echo] *****************************************************
     [echo] Summary
     [echo] -------
     [echo] Generated at: 2018-11-18T01:19:28+00:00
     [echo]
     [echo] Notes: 0
     [echo] Binaries: 102
     [echo] Archives: 0
     [echo] Standards: 3745
     [echo]
     [echo] Apache Licensed: 3745
     [echo] Generated Documents: 0
     [echo]
     [echo] JavaDocs are generated, thus a license header is optional.
     [echo] Generated files do not require license headers.
     [echo]
     [echo] 0 Unknown Licenses
     [echo]
     [echo] *****************************************************
     [echo]   Files with Apache License headers will be marked AL
     [echo]   Binary files (which do not require any license headers) will be marked B
     [echo]   Compressed archives will be marked A
     [echo]   Notices, licenses etc. will be marked N
     [echo]  
     [echo] *****************************************************

forbidden-apis-check:
[forbiddenapis] Reading bundled API signatures: jdk-unsafe-1.8
[forbiddenapis] Reading bundled API signatures: jdk-deprecated-1.8
[forbiddenapis] Reading bundled API signatures: jdk-internal-1.8
[forbiddenapis] Reading bundled API signatures: jdk-non-portable
[forbiddenapis] Reading bundled API signatures: jdk-reflection
[forbiddenapis] Reading API signatures: <https://builds.apache.org/job/POI-DSL-1.12/ws/src/resources/devtools/forbidden-signatures.txt>
[forbiddenapis] Loading classes to check...
[forbiddenapis] Scanning classes for violations...
[forbiddenapis] Scanned 4216 class file(s) for forbidden API invocations (in 10.20s), 0 error(s).
[forbiddenapis] Reading API signatures: <https://builds.apache.org/job/POI-DSL-1.12/ws/src/resources/devtools/forbidden-signatures-prod.txt>
[forbiddenapis] Loading classes to check...
[forbiddenapis] Scanning classes for violations...
[forbiddenapis] Scanned 3282 class file(s) for forbidden API invocations (in 2.08s), 0 error(s).

jenkins:

BUILD SUCCESSFUL
Total time: 26 minutes 25 seconds
[integrationtest] $ /home/jenkins/tools/ant/apache-ant-1.9.9/bin/ant -file build.xml run -Djava9addmods=-Dthis.is.a.dummy=true -Djavadoc9addmods=-Dthis.is.a.dummy=true -Djava9addmodsvalue=-Dsun.reflect.debugModuleAccessChecks=true -Djava9addopens1=--add-opens=java.xml/com.sun.org.apache.xerces.internal.util=ALL-UNNAMED -Djava9addopens2=--add-opens=java.base/java.io=ALL-UNNAMED -Djava9addopens3=--add-opens=java.base/java.nio=ALL-UNNAMED -Djava9addopens4=--add-opens=java.base/java.lang=ALL-UNNAMED -Djava9addopens5=--add-opens=java.base/jdk.internal.ref=ALL-UNNAMED -Djava9addopens6=-Dthis.is.a.dummy=true -Djava.locale.providers=JRE,CLDR
Buildfile: <https://builds.apache.org/job/POI-DSL-1.12/ws/src/integrationtest/build.xml>

init:

runSourceBuild:
    [mkdir] Created dir: <https://builds.apache.org/job/POI-DSL-1.12/ws/build/distsourcebuild>
     [echo] Found source package at <https://builds.apache.org/job/POI-DSL-1.12/ws/build/dist/poi-src-4.0.1-SNAPSHOT-20181118.zip>
    [unzip] Expanding: <https://builds.apache.org/job/POI-DSL-1.12/ws/build/dist/poi-src-4.0.1-SNAPSHOT-20181118.zip> into <https://builds.apache.org/job/POI-DSL-1.12/ws/build/distsourcebuild>
    [mkdir] Created dir: <https://builds.apache.org/job/POI-DSL-1.12/ws/build/distsourcebuild/poi-4.0.1-SNAPSHOT/lib>
    [mkdir] Created dir: <https://builds.apache.org/job/POI-DSL-1.12/ws/build/distsourcebuild/poi-4.0.1-SNAPSHOT/ooxml-lib>
    [mkdir] Created dir: <https://builds.apache.org/job/POI-DSL-1.12/ws/build/distsourcebuild/poi-4.0.1-SNAPSHOT/compile-lib>
     [copy] Copying 35 files to <https://builds.apache.org/job/POI-DSL-1.12/ws/build/distsourcebuild/poi-4.0.1-SNAPSHOT/lib>
     [copy] Copying 13 files to <https://builds.apache.org/job/POI-DSL-1.12/ws/build/distsourcebuild/poi-4.0.1-SNAPSHOT/ooxml-lib>
     [copy] Copying 4 files to <https://builds.apache.org/job/POI-DSL-1.12/ws/build/distsourcebuild/poi-4.0.1-SNAPSHOT/compile-lib>
     [echo] Building in temporary dir <https://builds.apache.org/job/POI-DSL-1.12/ws/build/distsourcebuild/poi-4.0.1-SNAPSHOT/>
[propertyreset] Warning: Nashorn engine is planned to be removed from a future JDK release
[propertyreset] Warning: Nashorn engine is planned to be removed from a future JDK release

check-jars:

fetch-jars:

check-ooxml-jars:

fetch-ooxml-jars:

init:
    [mkdir] Created dir: <https://builds.apache.org/job/POI-DSL-1.12/ws/build/distsourcebuild/poi-4.0.1-SNAPSHOT/build>
    [mkdir] Created dir: <https://builds.apache.org/job/POI-DSL-1.12/ws/build/distsourcebuild/poi-4.0.1-SNAPSHOT/build/classes>
    [mkdir] Created dir: <https://builds.apache.org/job/POI-DSL-1.12/ws/build/distsourcebuild/poi-4.0.1-SNAPSHOT/build/test-classes>
    [mkdir] Created dir: <https://builds.apache.org/job/POI-DSL-1.12/ws/build/distsourcebuild/poi-4.0.1-SNAPSHOT/build/test-results>
    [mkdir] Created dir: <https://builds.apache.org/job/POI-DSL-1.12/ws/build/distsourcebuild/poi-4.0.1-SNAPSHOT/build/scratchpad-classes>
    [mkdir] Created dir: <https://builds.apache.org/job/POI-DSL-1.12/ws/build/distsourcebuild/poi-4.0.1-SNAPSHOT/build/scratchpad-test-classes>
    [mkdir] Created dir: <https://builds.apache.org/job/POI-DSL-1.12/ws/build/distsourcebuild/poi-4.0.1-SNAPSHOT/build/scratchpad-test-results>
    [mkdir] Created dir: <https://builds.apache.org/job/POI-DSL-1.12/ws/build/distsourcebuild/poi-4.0.1-SNAPSHOT/build/geometry-java>
    [mkdir] Created dir: <https://builds.apache.org/job/POI-DSL-1.12/ws/build/distsourcebuild/poi-4.0.1-SNAPSHOT/build/ooxml-classes>
    [mkdir] Created dir: <https://builds.apache.org/job/POI-DSL-1.12/ws/build/distsourcebuild/poi-4.0.1-SNAPSHOT/build/ooxml-test-classes>
    [mkdir] Created dir: <https://builds.apache.org/job/POI-DSL-1.12/ws/build/distsourcebuild/poi-4.0.1-SNAPSHOT/build/ooxml-test-results>
    [mkdir] Created dir: <https://builds.apache.org/job/POI-DSL-1.12/ws/build/distsourcebuild/poi-4.0.1-SNAPSHOT/build/excelant-classes>
    [mkdir] Created dir: <https://builds.apache.org/job/POI-DSL-1.12/ws/build/distsourcebuild/poi-4.0.1-SNAPSHOT/build/excelant-test-classes>
    [mkdir] Created dir: <https://builds.apache.org/job/POI-DSL-1.12/ws/build/distsourcebuild/poi-4.0.1-SNAPSHOT/build/excelant-test-results>
    [mkdir] Created dir: <https://builds.apache.org/job/POI-DSL-1.12/ws/build/distsourcebuild/poi-4.0.1-SNAPSHOT/build/examples-classes>
    [mkdir] Created dir: <https://builds.apache.org/job/POI-DSL-1.12/ws/build/distsourcebuild/poi-4.0.1-SNAPSHOT/build/integration-test-classes>
    [mkdir] Created dir: <https://builds.apache.org/job/POI-DSL-1.12/ws/build/distsourcebuild/poi-4.0.1-SNAPSHOT/build/integration-test-results>
    [mkdir] Created dir: <https://builds.apache.org/job/POI-DSL-1.12/ws/build/distsourcebuild/poi-4.0.1-SNAPSHOT/build/dist>
    [mkdir] Created dir: <https://builds.apache.org/job/POI-DSL-1.12/ws/build/distsourcebuild/poi-4.0.1-SNAPSHOT/build/site>
     [echo] Using Ant: Apache Ant(TM) version 1.9.9 compiled on February 2 2017 from /home/jenkins/tools/ant/apache-ant-1.9.9, Ant detected Java 9 (may be different than actual Java sometimes...)
     [echo] Using Java: 12-ea/12-ea+18/12-ea+18/OpenJDK 64-Bit Server VM from Oracle Corporation on Linux: 4.4.0-138-generic
[release_tag] Warning: Nashorn engine is planned to be removed from a future JDK release

compile-main:
    [javac] Compiling 1211 source files to <https://builds.apache.org/job/POI-DSL-1.12/ws/build/distsourcebuild/poi-4.0.1-SNAPSHOT/build/classes>
    [javac] warning: [options] bootstrap class path not set in conjunction with -source 8
    [javac] Note: Some input files use or override a deprecated API.
    [javac] Note: Recompile with -Xlint:deprecation for details.
    [javac] Note: Some input files use unchecked or unsafe operations.
    [javac] Note: Recompile with -Xlint:unchecked for details.
    [javac] 1 warning
    [javac] Creating empty <https://builds.apache.org/job/POI-DSL-1.12/ws/build/distsourcebuild/poi-4.0.1-SNAPSHOT/build/classes/org/apache/poi/poifs/dev/package-info.class>
    [javac] Creating empty <https://builds.apache.org/job/POI-DSL-1.12/ws/build/distsourcebuild/poi-4.0.1-SNAPSHOT/build/classes/org/apache/poi/poifs/common/package-info.class>
    [javac] Creating empty <https://builds.apache.org/job/POI-DSL-1.12/ws/build/distsourcebuild/poi-4.0.1-SNAPSHOT/build/classes/org/apache/poi/poifs/filesystem/package-info.class>
    [javac] Creating empty <https://builds.apache.org/job/POI-DSL-1.12/ws/build/distsourcebuild/poi-4.0.1-SNAPSHOT/build/classes/org/apache/poi/poifs/storage/package-info.class>
    [javac] Creating empty <https://builds.apache.org/job/POI-DSL-1.12/ws/build/distsourcebuild/poi-4.0.1-SNAPSHOT/build/classes/org/apache/poi/poifs/package-info.class>
    [javac] Creating empty <https://builds.apache.org/job/POI-DSL-1.12/ws/build/distsourcebuild/poi-4.0.1-SNAPSHOT/build/classes/org/apache/poi/poifs/crypt/package-info.class>
    [javac] Creating empty <https://builds.apache.org/job/POI-DSL-1.12/ws/build/distsourcebuild/poi-4.0.1-SNAPSHOT/build/classes/org/apache/poi/poifs/eventfilesystem/package-info.class>
    [javac] Creating empty <https://builds.apache.org/job/POI-DSL-1.12/ws/build/distsourcebuild/poi-4.0.1-SNAPSHOT/build/classes/org/apache/poi/poifs/property/package-info.class>
    [javac] Compiling 535 source files to <https://builds.apache.org/job/POI-DSL-1.12/ws/build/distsourcebuild/poi-4.0.1-SNAPSHOT/build/test-classes>
    [javac] warning: [options] bootstrap class path not set in conjunction with -source 8
    [javac] Note: Some input files use or override a deprecated API.
    [javac] Note: Recompile with -Xlint:deprecation for details.
    [javac] Note: <https://builds.apache.org/job/POI-DSL-1.12/ws/build/distsourcebuild/poi-4.0.1-SNAPSHOT/src/testcases/org/apache/poi/sl/usermodel/BaseTestSlideShow.java> uses unchecked or unsafe operations.
    [javac] Note: Recompile with -Xlint:unchecked for details.
    [javac] 1 warning
     [copy] Copying 4 files to <https://builds.apache.org/job/POI-DSL-1.12/ws/build/distsourcebuild/poi-4.0.1-SNAPSHOT/build/classes>

check-ooxml-xsds:

fetch-ooxml-xsds:

generate-geometry:

compile-scratchpad:
    [javac] Compiling 488 source files to <https://builds.apache.org/job/POI-DSL-1.12/ws/build/distsourcebuild/poi-4.0.1-SNAPSHOT/build/scratchpad-classes>
    [javac] warning: [options] bootstrap class path not set in conjunction with -source 8
    [javac] Note: Some input files use or override a deprecated API.
    [javac] Note: Recompile with -Xlint:deprecation for details.
    [javac] Note: <https://builds.apache.org/job/POI-DSL-1.12/ws/build/distsourcebuild/poi-4.0.1-SNAPSHOT/src/scratchpad/src/org/apache/poi/extractor/ole2/OLE2ScratchpadExtractorFactory.java> uses unchecked or unsafe operations.
    [javac] Note: Recompile with -Xlint:unchecked for details.
    [javac] 1 warning
    [javac] Compiling 191 source files to <https://builds.apache.org/job/POI-DSL-1.12/ws/build/distsourcebuild/poi-4.0.1-SNAPSHOT/build/scratchpad-test-classes>
    [javac] warning: [options] bootstrap class path not set in conjunction with -source 8
    [javac] Note: Some input files use or override a deprecated API.
    [javac] Note: Recompile with -Xlint:deprecation for details.
    [javac] Note: <https://builds.apache.org/job/POI-DSL-1.12/ws/build/distsourcebuild/poi-4.0.1-SNAPSHOT/src/scratchpad/testcases/org/apache/poi/hslf/usermodel/TestBugs.java> uses unchecked or unsafe operations.
    [javac] Note: Recompile with -Xlint:unchecked for details.
    [javac] 1 warning
     [copy] Copying 2 files to <https://builds.apache.org/job/POI-DSL-1.12/ws/build/distsourcebuild/poi-4.0.1-SNAPSHOT/build/scratchpad-classes>

check-compiled-ooxml-xsds:

compile-ooxml-xsds:

compile-ooxml:
    [javac] Compiling 589 source files to <https://builds.apache.org/job/POI-DSL-1.12/ws/build/distsourcebuild/poi-4.0.1-SNAPSHOT/build/ooxml-classes>
    [javac] warning: [options] bootstrap class path not set in conjunction with -source 8
    [javac] Note: Some input files use or override a deprecated API.
    [javac] Note: Recompile with -Xlint:deprecation for details.
    [javac] Note: <https://builds.apache.org/job/POI-DSL-1.12/ws/build/distsourcebuild/poi-4.0.1-SNAPSHOT/src/ooxml/java/org/apache/poi/poifs/crypt/dsig/SignaturePart.java> uses unchecked or unsafe operations.
    [javac] Note: Recompile with -Xlint:unchecked for details.
    [javac] 1 warning
    [javac] Compiling 268 source files to <https://builds.apache.org/job/POI-DSL-1.12/ws/build/distsourcebuild/poi-4.0.1-SNAPSHOT/build/ooxml-test-classes>
    [javac] warning: [options] bootstrap class path not set in conjunction with -source 8
    [javac] Note: Some input files use or override a deprecated API.
    [javac] Note: Recompile with -Xlint:deprecation for details.
    [javac] 1 warning
     [copy] Copying 3 files to <https://builds.apache.org/job/POI-DSL-1.12/ws/build/distsourcebuild/poi-4.0.1-SNAPSHOT/build/ooxml-classes>

compile-examples:
    [javac] Compiling 153 source files to <https://builds.apache.org/job/POI-DSL-1.12/ws/build/distsourcebuild/poi-4.0.1-SNAPSHOT/build/examples-classes>
    [javac] warning: [options] bootstrap class path not set in conjunction with -source 8
    [javac] Note: Some input files use or override a deprecated API.
    [javac] Note: Recompile with -Xlint:deprecation for details.
    [javac] 1 warning
     [copy] Copying 1 file to <https://builds.apache.org/job/POI-DSL-1.12/ws/build/distsourcebuild/poi-4.0.1-SNAPSHOT/build/examples-classes>

compile-excelant:
    [javac] Compiling 14 source files to <https://builds.apache.org/job/POI-DSL-1.12/ws/build/distsourcebuild/poi-4.0.1-SNAPSHOT/build/excelant-classes>
    [javac] warning: [options] bootstrap class path not set in conjunction with -source 8
    [javac] Note: Some input files use or override a deprecated API.
    [javac] Note: Recompile with -Xlint:deprecation for details.
    [javac] 1 warning
    [javac] Compiling 13 source files to <https://builds.apache.org/job/POI-DSL-1.12/ws/build/distsourcebuild/poi-4.0.1-SNAPSHOT/build/excelant-test-classes>
    [javac] warning: [options] bootstrap class path not set in conjunction with -source 8
    [javac] 1 warning
     [copy] Copying 1 file to <https://builds.apache.org/job/POI-DSL-1.12/ws/build/distsourcebuild/poi-4.0.1-SNAPSHOT/build/excelant-classes>

compile:

compile-version:
     [copy] Copying 1 file to <https://builds.apache.org/job/POI-DSL-1.12/ws/build/distsourcebuild/poi-4.0.1-SNAPSHOT/build/classes/org/apache/poi>
    [javac] Compiling 1 source file to <https://builds.apache.org/job/POI-DSL-1.12/ws/build/distsourcebuild/poi-4.0.1-SNAPSHOT/build/classes>
    [javac] warning: [options] bootstrap class path not set in conjunction with -source 8
    [javac] 1 warning
   [delete] Deleting: <https://builds.apache.org/job/POI-DSL-1.12/ws/build/distsourcebuild/poi-4.0.1-SNAPSHOT/build/classes/org/apache/poi/Version.java>

-manifest:

jar:
      [jar] Building jar: <https://builds.apache.org/job/POI-DSL-1.12/ws/build/distsourcebuild/poi-4.0.1-SNAPSHOT/build/dist/maven/poi/poi-4.0.1-SNAPSHOT.jar>
      [jar] Building jar: <https://builds.apache.org/job/POI-DSL-1.12/ws/build/distsourcebuild/poi-4.0.1-SNAPSHOT/build/dist/maven/poi-scratchpad/poi-scratchpad-4.0.1-SNAPSHOT.jar>
      [jar] Building jar: <https://builds.apache.org/job/POI-DSL-1.12/ws/build/distsourcebuild/poi-4.0.1-SNAPSHOT/build/dist/maven/poi-ooxml/poi-ooxml-4.0.1-SNAPSHOT.jar>
      [jar] Building jar: <https://builds.apache.org/job/POI-DSL-1.12/ws/build/distsourcebuild/poi-4.0.1-SNAPSHOT/build/dist/maven/poi-examples/poi-examples-4.0.1-SNAPSHOT.jar>
      [jar] Building jar: <https://builds.apache.org/job/POI-DSL-1.12/ws/build/distsourcebuild/poi-4.0.1-SNAPSHOT/build/dist/maven/poi-excelant/poi-excelant-4.0.1-SNAPSHOT.jar>

BUILD FAILED
<https://builds.apache.org/job/POI-DSL-1.12/ws/src/integrationtest/build.xml>:80: The following error occurred while executing this line:
<https://builds.apache.org/job/POI-DSL-1.12/ws/build/distsourcebuild/poi-4.0.1-SNAPSHOT/build.xml>:1978: The following error occurred while executing this line:
<https://builds.apache.org/job/POI-DSL-1.12/ws/build/distsourcebuild/poi-4.0.1-SNAPSHOT/build.xml>:1964: The archive ooxml-lite-classes.jar doesn't exist

Total time: 1 minute 29 seconds
Build step 'Invoke Ant' marked build as failure
Skipping publisher since build result is FAILURE
Archiving artifacts
[Fast Archiver] No prior successful build to compare, so performing full copy of artifacts
Skipping publisher since build result is FAILURE
Recording test results

---------------------------------------------------------------------
To unsubscribe, e-mail: [hidden email]
For additional commands, e-mail: [hidden email]

Reply | Threaded
Open this post in threaded view
|

Jenkins build is back to normal : POI-DSL-1.12 #7

Apache Jenkins Server
See <https://builds.apache.org/job/POI-DSL-1.12/7/display/redirect?page=changes>


---------------------------------------------------------------------
To unsubscribe, e-mail: [hidden email]
For additional commands, e-mail: [hidden email]