Build failed in Jenkins: POI-DSL-1.10 #127

classic Classic list List threaded Threaded
2 messages Options
Reply | Threaded
Open this post in threaded view
|

Build failed in Jenkins: POI-DSL-1.10 #127

Apache Jenkins Server
See <https://builds.apache.org/job/POI-DSL-1.10/127/display/redirect?page=changes>

Changes:

[fanningpj] remove some deprecated classes

[fanningpj] remove some deprecated classes

[fanningpj] remove some deprecated classes

[fanningpj] remove some deprecated classes

[fanningpj] update deprecation version

[fanningpj] remove some deprecated methods from Cell

[fanningpj] remove some deprecated Font methods from Workbook

[fanningpj] try to fix test compile

[fanningpj] try to fix test compile

[fanningpj] remove some deprecated Name methods from Workbook

[fanningpj] move docx added to wrong test dir

[fanningpj] [bug-64561] XWPFSDTContent.getText() is empty for nested SDT elements

[kiwiwings] fix ASL headers

[kiwiwings] XmlBeans now generates the beans including the modifications which were applied by the POI build (r1879130) ... so those modifications are now obsolete

[tallison] improve memory safety in HWPFDocumentCore


------------------------------------------
[...truncated 4.95 KB...]
drwxr-xr-x   4 root root 4096 Aug 26  2019 conf
drwxr-xr-x   3 root root 4096 Aug 26  2019 include
drwxr-xr-x   2 root root 4096 Aug 26  2019 jmods
drwxr-xr-x 101 root root 4096 Aug 26  2019 legal
drwxr-xr-x  12 root root 4096 Aug 26  2019 lib
-r--r--r--   1 root root  158 Mar 27  2018 README.html
-rw-r--r--   1 root root 1656 Mar 27  2018 release
+ ls -al /home/jenkins/tools/java/latest10/bin
total 832
drwxr-xr-x 2 root root   4096 Aug 26  2019 .
drwxr-xr-x 8 root root   4096 Aug 26  2019 ..
-rwxr-xr-x 1 root root   9920 Mar 27  2018 appletviewer
-rwxr-xr-x 1 root root   9864 Mar 27  2018 idlj
-rwxr-xr-x 1 root root  11112 Mar 27  2018 jaotc
-rwxr-xr-x 1 root root   9864 Mar 27  2018 jar
-rwxr-xr-x 1 root root   9872 Mar 27  2018 jarsigner
-rwxr-xr-x 1 root root   9048 Mar 27  2018 java
-rwxr-xr-x 1 root root   9912 Mar 27  2018 javac
-rwxr-xr-x 1 root root   9920 Mar 27  2018 javadoc
-rwxr-xr-x 1 root root   9864 Mar 27  2018 javap
-rwxr-xr-x 1 root root   3088 Mar 27  2018 javapackager
-rwxr-xr-x 1 root root 136032 Mar 27  2018 javaws
-rwxr-xr-x 1 root root   9864 Mar 27  2018 jcmd
-rwxr-xr-x 1 root root   9928 Mar 27  2018 jconsole
-rwxr-xr-x 1 root root  18904 Mar 27  2018 jcontrol
-rwxr-xr-x 1 root root   9864 Mar 27  2018 jdb
-rwxr-xr-x 1 root root   9872 Mar 27  2018 jdeprscan
-rwxr-xr-x 1 root root   9864 Mar 27  2018 jdeps
-rwxr-xr-x 1 root root   9864 Mar 27  2018 jhsdb
-rwxr-xr-x 1 root root   9872 Mar 27  2018 jimage
-rwxr-xr-x 1 root root   9912 Mar 27  2018 jinfo
-rwxr-xr-x 1 root root   9912 Mar 27  2018 jjs
-rwxr-xr-x 1 root root   9912 Mar 27  2018 jlink
-rwxr-xr-x 1 root root   9912 Mar 27  2018 jmap
-rwxr-xr-x 1 root root    143 Mar 27  2018 jmc
-rwxr-xr-x 1 root root   9864 Mar 27  2018 jmod
-rwxr-xr-x 1 root root   9864 Mar 27  2018 jps
-rwxr-xr-x 1 root root   9920 Mar 27  2018 jrunscript
-rwxr-xr-x 1 root root   9872 Mar 27  2018 jshell
-rwxr-xr-x 1 root root   9920 Mar 27  2018 jstack
-rwxr-xr-x 1 root root   9864 Mar 27  2018 jstat
-rwxr-xr-x 1 root root   9872 Mar 27  2018 jstatd
-rwxr-xr-x 1 root root  65952 Mar 27  2018 jweblauncher
-rwxr-xr-x 1 root root   9872 Mar 27  2018 keytool
-rwxr-xr-x 1 root root   9920 Mar 27  2018 orbd
-rwxr-xr-x 1 root root   9872 Mar 27  2018 pack200
-rwxr-xr-x 1 root root   9864 Mar 27  2018 rmic
-rwxr-xr-x 1 root root   9864 Mar 27  2018 rmid
-rwxr-xr-x 1 root root   9872 Mar 27  2018 rmiregistry
-rwxr-xr-x 1 root root   9872 Mar 27  2018 schemagen
-rwxr-xr-x 1 root root   9872 Mar 27  2018 serialver
-rwxr-xr-x 1 root root   9872 Mar 27  2018 servertool
-rwxr-xr-x 1 root root   9928 Mar 27  2018 tnameserv
-rwxr-xr-x 1 root root 112880 Mar 27  2018 unpack200
-rwxr-xr-x 1 root root   9864 Mar 27  2018 wsgen
-rwxr-xr-x 1 root root   9872 Mar 27  2018 wsimport
-rwxr-xr-x 1 root root   9864 Mar 27  2018 xjc
+ /home/jenkins/tools/java/latest10/bin/java -version
java version "10.0.1" 2018-04-17
Java(TM) SE Runtime Environment 18.3 (build 10.0.1+10)
Java HotSpot(TM) 64-Bit Server VM 18.3 (build 10.0.1+10, mixed mode)
+ echo which java
which java
+ which java
/home/jenkins/tools/java/latest10/bin/java
+ java -version
java version "10.0.1" 2018-04-17
Java(TM) SE Runtime Environment 18.3 (build 10.0.1+10)
Java HotSpot(TM) 64-Bit Server VM 18.3 (build 10.0.1+10, mixed mode)
+ echo which javac
which javac
+ which javac
/home/jenkins/tools/java/latest10/bin/javac
+ javac -version
javac 10.0.1
+ echo Ant-Home:
Ant-Home:
+ ls -al
total 548
drwxr-xr-x  14 jenkins jenkins   4096 Jun 21 06:31 .
drwxr-xr-x 744 jenkins jenkins  69632 Jun 28 03:33 ..
drwxr-xr-x  26 jenkins jenkins   4096 Jun 21 06:43 build
-rw-r--r--   1 jenkins jenkins  11264 May 24 06:09 build.gradle
-rw-r--r--   1 jenkins jenkins  11312 Nov 17  2019 build.gradle.mine
-rw-r--r--   1 jenkins jenkins  11321 Nov 17  2019 build.gradle.r1868641
-rw-r--r--   1 jenkins jenkins  11175 Nov 17  2019 build.gradle.r1869915
-rw-r--r--   1 jenkins jenkins    172 Jun 21 06:06 build.javacheck.xml
-rw-r--r--   1 jenkins jenkins 137785 Jun 28 06:06 build.xml
-rw-r--r--   1 jenkins jenkins   3341 Jun  7 06:06 .classpath
-rw-r--r--   1 jenkins jenkins   6160 Feb 16 06:05 doap_POI.rdf
-rw-r--r--   1 jenkins jenkins   2847 Mar 15 06:06 file-leak-detector.exclude
-rw-r--r--   1 jenkins jenkins   6229 Oct 20  2019 forrest.properties
-rw-r--r--   1 jenkins jenkins     53 Oct 13  2019 .gitattributes
-rw-r--r--   1 jenkins jenkins    493 Oct 13  2019 .gitignore
drwxr-xr-x   3 jenkins jenkins   4096 Oct 13  2019 gradle
-rwxr-xr-x   1 jenkins jenkins   5917 Nov 17  2019 gradlew
-rw-r--r--   1 jenkins jenkins   2842 Nov 17  2019 gradlew.bat
drwxr-xr-x   2 jenkins jenkins   4096 Jun 21 06:06 jenkins
-rw-r--r--   1 jenkins jenkins 166411 Oct 13  2019 KEYS
drwxr-xr-x   2 jenkins jenkins   4096 Oct 13  2019 legal
drwxr-xr-x   9 jenkins jenkins   4096 May 10 06:07 lib
drwxr-xr-x   2 jenkins jenkins   4096 Mar 15 06:06 maven
drwxr-xr-x   4 jenkins jenkins   4096 May 24 06:09 osgi
-rw-r--r--   1 jenkins jenkins   4813 Oct 13  2019 patch.xml
-rw-r--r--   1 jenkins jenkins    426 Oct 13  2019 .project
-rw-r--r--   1 jenkins jenkins   4266 Apr 26 06:06 README.rst
drwxr-xr-x   2 jenkins jenkins   4096 Oct 13  2019 .settings
-rw-r--r--   1 jenkins jenkins    556 Oct 13  2019 settings.gradle
drwxr-xr-x  11 jenkins jenkins   4096 May 24 06:08 sonar
drwxr-xr-x  16 jenkins jenkins   4096 May 10 06:06 src
drwxr-xr-x   4 jenkins jenkins   4096 Jun 28 06:06 .svn
drwxr-xr-x  14 jenkins jenkins   4096 Oct 13  2019 test-data
-rw-r--r--   1 jenkins jenkins    136 Oct 13  2019 .travis.yml
+ echo which ant
which ant
+ which ant
/usr/bin/ant
+ ant -version
Apache Ant(TM) version 1.10.5 compiled on March 28 2019
+ echo '<project default="test"><target name="test"><echo>Java ${ant.java.version}/${java.version}</echo><exec executable="javac"><arg value="-version"/></exec></target></project>'
+ ant -f build.javacheck.xml -v
Apache Ant(TM) version 1.10.5 compiled on March 28 2019
Buildfile: <https://builds.apache.org/job/POI-DSL-1.10/ws/build.javacheck.xml>
Detected Java version: 10 in: /usr/local/asfpackages/java/jdk-10.0.1
Detected OS: Linux
parsing buildfile <https://builds.apache.org/job/POI-DSL-1.10/ws/build.javacheck.xml> with URI = <https://builds.apache.org/job/POI-DSL-1.10/ws/build.javacheck.xml>
Project base dir set to: <https://builds.apache.org/job/POI-DSL-1.10/ws/>
Build sequence for target(s) `test' is [test]
Complete build sequence is [test, ]

test:
parsing buildfile jar:file:/usr/share/ant/lib/ant.jar!/org/apache/tools/ant/antlib.xml with URI = jar:file:/usr/share/ant/lib/ant.jar!/org/apache/tools/ant/antlib.xml from a zip file
     [echo] Java 10/10.0.1
     [exec] Current OS is Linux
     [exec] Executing 'javac' with arguments:
     [exec] '-version'
     [exec]
     [exec] The ' characters around the executable and arguments are
     [exec] not part of the command.
     [exec] javac 10.0.1

BUILD SUCCESSFUL
Total time: 0 seconds
+ exit 0
[POI-DSL-1.10] $ /home/jenkins/tools/ant/latest1.9/bin/ant -Dcoverage.enabled=true clean jenkins
Buildfile: <https://builds.apache.org/job/POI-DSL-1.10/ws/build.xml>

clean:
   [delete] Deleting directory <https://builds.apache.org/job/POI-DSL-1.10/ws/build>

replaceVersion:

check-jars:

fetch-jars:

check-ooxml-jars:

fetch-ooxml-jars:
      [get] Destination already exists (skipping): <https://builds.apache.org/job/POI-DSL-1.10/127/artifact/lib/ooxml/curvesapi-1.06.jar>
      [get] Getting: https://builds.apache.org/view/P/view/POI/job/POI-XMLBeans-DSL-1.8/lastSuccessfulBuild/artifact/build/xmlbeans-4.0.0.jar
      [get] To: <https://builds.apache.org/job/POI-DSL-1.10/127/artifact/lib/ooxml/xmlbeans-4.0.0.jar>
      [get] Destination already exists (skipping): <https://builds.apache.org/job/POI-DSL-1.10/127/artifact/lib/ooxml/commons-compress-1.20.jar>
      [get] Destination already exists (skipping): <https://builds.apache.org/job/POI-DSL-1.10/ws/lib/ooxml-tests/reflections-0.9.11.jar>
      [get] Destination already exists (skipping): <https://builds.apache.org/job/POI-DSL-1.10/ws/lib/ooxml-tests/guava-20.0.jar>
      [get] Destination already exists (skipping): <https://builds.apache.org/job/POI-DSL-1.10/ws/lib/ooxml-tests/javassist-3.21.0-GA.jar>
      [get] Destination already exists (skipping): <https://builds.apache.org/job/POI-DSL-1.10/ws/lib/ooxml-provided/batik-all-1.12.jar>
      [get] Destination already exists (skipping): <https://builds.apache.org/job/POI-DSL-1.10/ws/lib/ooxml-provided/xml-apis-ext-1.3.04.jar>
      [get] Destination already exists (skipping): <https://builds.apache.org/job/POI-DSL-1.10/ws/lib/ooxml-provided/xmlgraphics-commons-2.3.jar>

init:
    [mkdir] Created dir: <https://builds.apache.org/job/POI-DSL-1.10/ws/build>
    [mkdir] Created dir: <https://builds.apache.org/job/POI-DSL-1.10/ws/build/classes>
    [mkdir] Created dir: <https://builds.apache.org/job/POI-DSL-1.10/ws/build/test-classes>
    [mkdir] Created dir: <https://builds.apache.org/job/POI-DSL-1.10/ws/build/test-results>
    [mkdir] Created dir: <https://builds.apache.org/job/POI-DSL-1.10/ws/build/scratchpad-classes>
    [mkdir] Created dir: <https://builds.apache.org/job/POI-DSL-1.10/ws/build/scratchpad-test-classes>
    [mkdir] Created dir: <https://builds.apache.org/job/POI-DSL-1.10/ws/build/scratchpad-test-results>
    [mkdir] Created dir: <https://builds.apache.org/job/POI-DSL-1.10/ws/build/geometry-java>
    [mkdir] Created dir: <https://builds.apache.org/job/POI-DSL-1.10/ws/build/ooxml-classes>
    [mkdir] Created dir: <https://builds.apache.org/job/POI-DSL-1.10/ws/build/ooxml-test-classes>
    [mkdir] Created dir: <https://builds.apache.org/job/POI-DSL-1.10/ws/build/ooxml-test-results>
    [mkdir] Created dir: <https://builds.apache.org/job/POI-DSL-1.10/ws/build/excelant-classes>
    [mkdir] Created dir: <https://builds.apache.org/job/POI-DSL-1.10/ws/build/excelant-test-classes>
    [mkdir] Created dir: <https://builds.apache.org/job/POI-DSL-1.10/ws/build/excelant-test-results>
    [mkdir] Created dir: <https://builds.apache.org/job/POI-DSL-1.10/ws/build/examples-classes>
    [mkdir] Created dir: <https://builds.apache.org/job/POI-DSL-1.10/ws/build/integration-test-classes>
    [mkdir] Created dir: <https://builds.apache.org/job/POI-DSL-1.10/127/artifact/build/integration-test-results>
    [mkdir] Created dir: <https://builds.apache.org/job/POI-DSL-1.10/ws/build/dist>
    [mkdir] Created dir: <https://builds.apache.org/job/POI-DSL-1.10/ws/build/site>
     [echo] Using Ant: Apache Ant(TM) version 1.9.14 compiled on March 12 2019 from /home/jenkins/tools/ant/latest1.9, Ant detected Java 10 (may be different than actual Java sometimes...)
     [echo] Using Java: 10.0.1/10.0.1+10/10.0.1+10/Java HotSpot(TM) 64-Bit Server VM from "Oracle Corporation" on Linux: 4.15.0-76-generic
     [echo] Building Apache POI version 5.0.0-SNAPSHOT and RC: RC1

compile-main:
    [javac] Compiling 1164 source files to <https://builds.apache.org/job/POI-DSL-1.10/ws/build/classes>
    [javac] warning: [options] bootstrap class path not set in conjunction with -source 8
    [javac] Note: Some input files use or override a deprecated API.
    [javac] Note: Recompile with -Xlint:deprecation for details.
    [javac] Note: Some input files use unchecked or unsafe operations.
    [javac] Note: Recompile with -Xlint:unchecked for details.
    [javac] 1 warning
    [javac] Creating empty <https://builds.apache.org/job/POI-DSL-1.10/ws/build/classes/org/apache/poi/ddf/package-info.class>
    [javac] Creating empty <https://builds.apache.org/job/POI-DSL-1.10/ws/build/classes/org/apache/poi/hssf/package-info.class>
    [javac] Creating empty <https://builds.apache.org/job/POI-DSL-1.10/ws/build/classes/org/apache/poi/poifs/dev/package-info.class>
    [javac] Creating empty <https://builds.apache.org/job/POI-DSL-1.10/ws/build/classes/org/apache/poi/util/package-info.class>
    [javac] Creating empty <https://builds.apache.org/job/POI-DSL-1.10/ws/build/classes/org/apache/poi/poifs/common/package-info.class>
    [javac] Creating empty <https://builds.apache.org/job/POI-DSL-1.10/ws/build/classes/org/apache/poi/hssf/record/package-info.class>
    [javac] Creating empty <https://builds.apache.org/job/POI-DSL-1.10/ws/build/classes/org/apache/poi/poifs/package-info.class>
    [javac] Creating empty <https://builds.apache.org/job/POI-DSL-1.10/ws/build/classes/org/apache/poi/poifs/crypt/package-info.class>
    [javac] Creating empty <https://builds.apache.org/job/POI-DSL-1.10/ws/build/classes/org/apache/poi/hpsf/wellknown/package-info.class>
    [javac] Creating empty <https://builds.apache.org/job/POI-DSL-1.10/ws/build/classes/org/apache/poi/hssf/dev/package-info.class>
    [javac] Creating empty <https://builds.apache.org/job/POI-DSL-1.10/ws/build/classes/org/apache/poi/ss/formula/package-info.class>
    [javac] Creating empty <https://builds.apache.org/job/POI-DSL-1.10/ws/build/classes/org/apache/poi/hpsf/package-info.class>
    [javac] Creating empty <https://builds.apache.org/job/POI-DSL-1.10/ws/build/classes/org/apache/poi/poifs/property/package-info.class>
    [javac] Creating empty <https://builds.apache.org/job/POI-DSL-1.10/ws/build/classes/org/apache/poi/poifs/filesystem/package-info.class>
    [javac] Creating empty <https://builds.apache.org/job/POI-DSL-1.10/ws/build/classes/org/apache/poi/ss/formula/ptg/package-info.class>
    [javac] Creating empty <https://builds.apache.org/job/POI-DSL-1.10/ws/build/classes/org/apache/poi/poifs/storage/package-info.class>
    [javac] Creating empty <https://builds.apache.org/job/POI-DSL-1.10/ws/build/classes/org/apache/poi/hssf/eventusermodel/package-info.class>
    [javac] Creating empty <https://builds.apache.org/job/POI-DSL-1.10/ws/build/classes/org/apache/poi/hssf/record/aggregates/package-info.class>
    [javac] Creating empty <https://builds.apache.org/job/POI-DSL-1.10/ws/build/classes/org/apache/poi/ss/format/package-info.class>
    [javac] Creating empty <https://builds.apache.org/job/POI-DSL-1.10/ws/build/classes/org/apache/poi/hssf/model/package-info.class>
    [javac] Creating empty <https://builds.apache.org/job/POI-DSL-1.10/ws/build/classes/org/apache/poi/hssf/usermodel/package-info.class>
    [javac] Creating empty <https://builds.apache.org/job/POI-DSL-1.10/ws/build/classes/org/apache/poi/hssf/util/package-info.class>
    [javac] Creating empty <https://builds.apache.org/job/POI-DSL-1.10/ws/build/classes/org/apache/poi/poifs/eventfilesystem/package-info.class>
    [javac] Compiling 547 source files to <https://builds.apache.org/job/POI-DSL-1.10/ws/build/test-classes>
    [javac] warning: [options] bootstrap class path not set in conjunction with -source 8
    [javac] Note: Some input files use or override a deprecated API.
    [javac] Note: Recompile with -Xlint:deprecation for details.
    [javac] 1 warning
     [copy] Copying 5 files to <https://builds.apache.org/job/POI-DSL-1.10/ws/build/classes>
    [mkdir] Created dir: <https://builds.apache.org/job/POI-DSL-1.10/ws/build/classes/META-INF/versions/9>
    [javac] Compiling 1 source file to <https://builds.apache.org/job/POI-DSL-1.10/ws/build/classes/META-INF/versions/9>
    [javac] <https://builds.apache.org/job/POI-DSL-1.10/ws/src/multimodule/poi/java9/module-info.java>:81: error: package is empty or does not exist: org.apache.poi.ss.usermodel.charts
    [javac]     exports org.apache.poi.ss.usermodel.charts;
    [javac]                                        ^
    [javac] 1 error

BUILD FAILED
<https://builds.apache.org/job/POI-DSL-1.10/ws/build.xml>:958: Compile failed; see the compiler error output for details.

Total time: 38 seconds
Build step 'Invoke Ant' marked build as failure
Skipping publisher since build result is FAILURE
Archiving artifacts
[Fast Archiver] Compressed 3.04 MB of artifacts by 22.6% relative to #126
Skipping publisher since build result is FAILURE
Recording test results
ERROR: Step ?Publish JUnit test result report? failed: No test report files were found. Configuration error?

---------------------------------------------------------------------
To unsubscribe, e-mail: [hidden email]
For additional commands, e-mail: [hidden email]

Reply | Threaded
Open this post in threaded view
|

Jenkins build is back to normal : POI-DSL-1.10 #128

Apache Jenkins Server
See <https://builds.apache.org/job/POI-DSL-1.10/128/display/redirect?page=changes>


---------------------------------------------------------------------
To unsubscribe, e-mail: [hidden email]
For additional commands, e-mail: [hidden email]