[Bug 62042] New: gradle build fails

classic Classic list List threaded Threaded
7 messages Options
Reply | Threaded
Open this post in threaded view
|

[Bug 62042] New: gradle build fails

Bugzilla from bugzilla@apache.org
https://bz.apache.org/bugzilla/show_bug.cgi?id=62042

            Bug ID: 62042
           Summary: gradle build fails
           Product: POI
           Version: 4.0-dev
          Hardware: PC
                OS: Mac OS X 10.1
            Status: NEW
          Severity: normal
          Priority: P2
         Component: POI Overall
          Assignee: [hidden email]
          Reporter: [hidden email]
  Target Milestone: ---

org.apache.poi.hssf.usermodel.AllUserModelTests >
org.apache.poi.hssf.usermodel.TestHSSFDataFormat.test58532 FAILED
    org.junit.ComparisonFailure at TestHSSFDataFormat.java:76

org.apache.poi.hssf.usermodel.AllUserModelTests >
org.apache.poi.hssf.usermodel.TestHSSFDataFormat.test58536 FAILED
    org.junit.ComparisonFailure

16502 tests completed, 2 failed, 839 skipped
:main:test FAILED

--
You are receiving this mail because:
You are the assignee for the bug.
---------------------------------------------------------------------
To unsubscribe, e-mail: [hidden email]
For additional commands, e-mail: [hidden email]

Reply | Threaded
Open this post in threaded view
|

[Bug 62042] gradle build fails

Bugzilla from bugzilla@apache.org
https://bz.apache.org/bugzilla/show_bug.cgi?id=62042

Wolfgang Fahl <[hidden email]> changed:

           What    |Removed                     |Added
----------------------------------------------------------------------------
                 OS|Mac OS X 10.1               |Mac OS X 10.9

--- Comment #1 from Wolfgang Fahl <[hidden email]> ---
This is on High Sierra Mac Os 10.13.2 javac 1.8.0_152

--
You are receiving this mail because:
You are the assignee for the bug.
---------------------------------------------------------------------
To unsubscribe, e-mail: [hidden email]
For additional commands, e-mail: [hidden email]

Reply | Threaded
Open this post in threaded view
|

[Bug 62042] gradle build fails

Bugzilla from bugzilla@apache.org
In reply to this post by Bugzilla from bugzilla@apache.org
https://bz.apache.org/bugzilla/show_bug.cgi?id=62042

Dominik Stadler <[hidden email]> changed:

           What    |Removed                     |Added
----------------------------------------------------------------------------
                 OS|                            |All
             Status|NEW                         |NEEDINFO

--- Comment #2 from Dominik Stadler <[hidden email]> ---
Please attach the Gradle test-results which should be somewhere under
build/main/build

--
You are receiving this mail because:
You are the assignee for the bug.
---------------------------------------------------------------------
To unsubscribe, e-mail: [hidden email]
For additional commands, e-mail: [hidden email]

Reply | Threaded
Open this post in threaded view
|

[Bug 62042] gradle build fails

Bugzilla from bugzilla@apache.org
In reply to this post by Bugzilla from bugzilla@apache.org
https://bz.apache.org/bugzilla/show_bug.cgi?id=62042

Wolfgang Fahl <[hidden email]> changed:

           What    |Removed                     |Added
----------------------------------------------------------------------------
             Status|NEEDINFO                    |NEW

--- Comment #3 from Wolfgang Fahl <[hidden email]> ---
est58532

org.junit.ComparisonFailure: Wrong formatting of 1.02 for row 1
expected:<1[.]020> but was:<1[,]020>
        at org.junit.Assert.assertEquals(Assert.java:115)
        at
org.apache.poi.ss.usermodel.BaseTestDataFormat.doTest58532Core(BaseTestDataFormat.java:166)
        at
org.apache.poi.hssf.usermodel.TestHSSFDataFormat.test58532(TestHSSFDataFormat.java:76)
        at sun.reflect.NativeMethodAccessorImpl.invoke0(Native Method)
        at
sun.reflect.NativeMethodAccessorImpl.invoke(NativeMethodAccessorImpl.java:62)
        at
sun.reflect.DelegatingMethodAccessorImpl.invoke(DelegatingMethodAccessorImpl.java:43)
        at java.lang.reflect.Method.invoke(Method.java:498)
        at
org.junit.runners.model.FrameworkMethod$1.runReflectiveCall(FrameworkMethod.java:50)
        at
org.junit.internal.runners.model.ReflectiveCallable.run(ReflectiveCallable.java:12)
        at
org.junit.runners.model.FrameworkMethod.invokeExplosively(FrameworkMethod.java:47)
        at
org.junit.internal.runners.statements.InvokeMethod.evaluate(InvokeMethod.java:17)
        at org.junit.runners.ParentRunner.runLeaf(ParentRunner.java:325)
        at
org.junit.runners.BlockJUnit4ClassRunner.runChild(BlockJUnit4ClassRunner.java:78)
        at
org.junit.runners.BlockJUnit4ClassRunner.runChild(BlockJUnit4ClassRunner.java:57)
        at org.junit.runners.ParentRunner$3.run(ParentRunner.java:290)
        at org.junit.runners.ParentRunner$1.schedule(ParentRunner.java:71)
        at org.junit.runners.ParentRunner.runChildren(ParentRunner.java:288)
        at org.junit.runners.ParentRunner.access$000(ParentRunner.java:58)
        at org.junit.runners.ParentRunner$2.evaluate(ParentRunner.java:268)
        at org.junit.runners.ParentRunner.run(ParentRunner.java:363)
        at org.junit.runners.Suite.runChild(Suite.java:128)
        at org.junit.runners.Suite.runChild(Suite.java:27)
        at org.junit.runners.ParentRunner$3.run(ParentRunner.java:290)
        at org.junit.runners.ParentRunner$1.schedule(ParentRunner.java:71)
        at org.junit.runners.ParentRunner.runChildren(ParentRunner.java:288)
        at org.junit.runners.ParentRunner.access$000(ParentRunner.java:58)
        at org.junit.runners.ParentRunner$2.evaluate(ParentRunner.java:268)
        at org.junit.runners.ParentRunner.run(ParentRunner.java:363)
        at
org.gradle.api.internal.tasks.testing.junit.JUnitTestClassExecuter.runTestClass(JUnitTestClassExecuter.java:114)
        at
org.gradle.api.internal.tasks.testing.junit.JUnitTestClassExecuter.execute(JUnitTestClassExecuter.java:57)
        at
org.gradle.api.internal.tasks.testing.junit.JUnitTestClassProcessor.processTestClass(JUnitTestClassProcessor.java:66)
        at
org.gradle.api.internal.tasks.testing.SuiteTestClassProcessor.processTestClass(SuiteTestClassProcessor.java:51)
        at sun.reflect.GeneratedMethodAccessor19.invoke(Unknown Source)
        at
sun.reflect.DelegatingMethodAccessorImpl.invoke(DelegatingMethodAccessorImpl.java:43)
        at java.lang.reflect.Method.invoke(Method.java:498)
        at
org.gradle.internal.dispatch.ReflectionDispatch.dispatch(ReflectionDispatch.java:35)
        at
org.gradle.internal.dispatch.ReflectionDispatch.dispatch(ReflectionDispatch.java:24)
        at
org.gradle.internal.dispatch.ContextClassLoaderDispatch.dispatch(ContextClassLoaderDispatch.java:32)
        at
org.gradle.internal.dispatch.ProxyDispatchAdapter$DispatchingInvocationHandler.invoke(ProxyDispatchAdapter.java:93)
        at com.sun.proxy.$Proxy2.processTestClass(Unknown Source)
        at
org.gradle.api.internal.tasks.testing.worker.TestWorker.processTestClass(TestWorker.java:109)
        at sun.reflect.GeneratedMethodAccessor18.invoke(Unknown Source)
        at
sun.reflect.DelegatingMethodAccessorImpl.invoke(DelegatingMethodAccessorImpl.java:43)
        at java.lang.reflect.Method.invoke(Method.java:498)
        at
org.gradle.internal.dispatch.ReflectionDispatch.dispatch(ReflectionDispatch.java:35)
        at
org.gradle.internal.dispatch.ReflectionDispatch.dispatch(ReflectionDispatch.java:24)
        at
org.gradle.internal.remote.internal.hub.MessageHubBackedObjectConnection$DispatchWrapper.dispatch(MessageHubBackedObjectConnection.java:147)
        at
org.gradle.internal.remote.internal.hub.MessageHubBackedObjectConnection$DispatchWrapper.dispatch(MessageHubBackedObjectConnection.java:129)
        at
org.gradle.internal.remote.internal.hub.MessageHub$Handler.run(MessageHub.java:404)
        at
org.gradle.internal.concurrent.ExecutorPolicy$CatchAndRecordFailures.onExecute(ExecutorPolicy.java:63)
        at
org.gradle.internal.concurrent.StoppableExecutorImpl$1.run(StoppableExecutorImpl.java:46)
        at
java.util.concurrent.ThreadPoolExecutor.runWorker(ThreadPoolExecutor.java:1149)
        at
java.util.concurrent.ThreadPoolExecutor$Worker.run(ThreadPoolExecutor.java:624)
        at java.lang.Thread.run(Thread.java:748)

test58536

org.junit.ComparisonFailure: expected:<£   12[,]345> but was:<£   12[.]345>
        at org.junit.Assert.assertEquals(Assert.java:115)
        at org.junit.Assert.assertEquals(Assert.java:144)
        at
org.apache.poi.ss.usermodel.BaseTestDataFormat.test58536(BaseTestDataFormat.java:200)
        at sun.reflect.NativeMethodAccessorImpl.invoke0(Native Method)
        at
sun.reflect.NativeMethodAccessorImpl.invoke(NativeMethodAccessorImpl.java:62)
        at
sun.reflect.DelegatingMethodAccessorImpl.invoke(DelegatingMethodAccessorImpl.java:43)
        at java.lang.reflect.Method.invoke(Method.java:498)
        at
org.junit.runners.model.FrameworkMethod$1.runReflectiveCall(FrameworkMethod.java:50)
        at
org.junit.internal.runners.model.ReflectiveCallable.run(ReflectiveCallable.java:12)
        at
org.junit.runners.model.FrameworkMethod.invokeExplosively(FrameworkMethod.java:47)
        at
org.junit.internal.runners.statements.InvokeMethod.evaluate(InvokeMethod.java:17)
        at org.junit.runners.ParentRunner.runLeaf(ParentRunner.java:325)
        at
org.junit.runners.BlockJUnit4ClassRunner.runChild(BlockJUnit4ClassRunner.java:78)
        at
org.junit.runners.BlockJUnit4ClassRunner.runChild(BlockJUnit4ClassRunner.java:57)
        at org.junit.runners.ParentRunner$3.run(ParentRunner.java:290)
        at org.junit.runners.ParentRunner$1.schedule(ParentRunner.java:71)
        at org.junit.runners.ParentRunner.runChildren(ParentRunner.java:288)
        at org.junit.runners.ParentRunner.access$000(ParentRunner.java:58)
        at org.junit.runners.ParentRunner$2.evaluate(ParentRunner.java:268)
        at org.junit.runners.ParentRunner.run(ParentRunner.java:363)
        at org.junit.runners.Suite.runChild(Suite.java:128)
        at org.junit.runners.Suite.runChild(Suite.java:27)
        at org.junit.runners.ParentRunner$3.run(ParentRunner.java:290)
        at org.junit.runners.ParentRunner$1.schedule(ParentRunner.java:71)
        at org.junit.runners.ParentRunner.runChildren(ParentRunner.java:288)
        at org.junit.runners.ParentRunner.access$000(ParentRunner.java:58)
        at org.junit.runners.ParentRunner$2.evaluate(ParentRunner.java:268)
        at org.junit.runners.ParentRunner.run(ParentRunner.java:363)
        at
org.gradle.api.internal.tasks.testing.junit.JUnitTestClassExecuter.runTestClass(JUnitTestClassExecuter.java:114)
        at
org.gradle.api.internal.tasks.testing.junit.JUnitTestClassExecuter.execute(JUnitTestClassExecuter.java:57)
        at
org.gradle.api.internal.tasks.testing.junit.JUnitTestClassProcessor.processTestClass(JUnitTestClassProcessor.java:66)
        at
org.gradle.api.internal.tasks.testing.SuiteTestClassProcessor.processTestClass(SuiteTestClassProcessor.java:51)
        at sun.reflect.GeneratedMethodAccessor19.invoke(Unknown Source)
        at
sun.reflect.DelegatingMethodAccessorImpl.invoke(DelegatingMethodAccessorImpl.java:43)
        at java.lang.reflect.Method.invoke(Method.java:498)
        at
org.gradle.internal.dispatch.ReflectionDispatch.dispatch(ReflectionDispatch.java:35)
        at
org.gradle.internal.dispatch.ReflectionDispatch.dispatch(ReflectionDispatch.java:24)
        at
org.gradle.internal.dispatch.ContextClassLoaderDispatch.dispatch(ContextClassLoaderDispatch.java:32)
        at
org.gradle.internal.dispatch.ProxyDispatchAdapter$DispatchingInvocationHandler.invoke(ProxyDispatchAdapter.java:93)
        at com.sun.proxy.$Proxy2.processTestClass(Unknown Source)
        at
org.gradle.api.internal.tasks.testing.worker.TestWorker.processTestClass(TestWorker.java:109)
        at sun.reflect.GeneratedMethodAccessor18.invoke(Unknown Source)
        at
sun.reflect.DelegatingMethodAccessorImpl.invoke(DelegatingMethodAccessorImpl.java:43)
        at java.lang.reflect.Method.invoke(Method.java:498)
        at
org.gradle.internal.dispatch.ReflectionDispatch.dispatch(ReflectionDispatch.java:35)
        at
org.gradle.internal.dispatch.ReflectionDispatch.dispatch(ReflectionDispatch.java:24)
        at
org.gradle.internal.remote.internal.hub.MessageHubBackedObjectConnection$DispatchWrapper.dispatch(MessageHubBackedObjectConnection.java:147)
        at
org.gradle.internal.remote.internal.hub.MessageHubBackedObjectConnection$DispatchWrapper.dispatch(MessageHubBackedObjectConnection.java:129)
        at
org.gradle.internal.remote.internal.hub.MessageHub$Handler.run(MessageHub.java:404)
        at
org.gradle.internal.concurrent.ExecutorPolicy$CatchAndRecordFailures.onExecute(ExecutorPolicy.java:63)
        at
org.gradle.internal.concurrent.StoppableExecutorImpl$1.run(StoppableExecutorImpl.java:46)
        at
java.util.concurrent.ThreadPoolExecutor.runWorker(ThreadPoolExecutor.java:1149)
        at
java.util.concurrent.ThreadPoolExecutor$Worker.run(ThreadPoolExecutor.java:624)
        at java.lang.Thread.run(Thread.java:748)

--
You are receiving this mail because:
You are the assignee for the bug.
---------------------------------------------------------------------
To unsubscribe, e-mail: [hidden email]
For additional commands, e-mail: [hidden email]

Reply | Threaded
Open this post in threaded view
|

[Bug 62042] gradle build fails

Bugzilla from bugzilla@apache.org
In reply to this post by Bugzilla from bugzilla@apache.org
https://bz.apache.org/bugzilla/show_bug.cgi?id=62042

--- Comment #4 from Wolfgang Fahl <[hidden email]> ---
looks like the tests choke on my german locality.

--
You are receiving this mail because:
You are the assignee for the bug.
---------------------------------------------------------------------
To unsubscribe, e-mail: [hidden email]
For additional commands, e-mail: [hidden email]

Reply | Threaded
Open this post in threaded view
|

[Bug 62042] gradle build fails

Bugzilla from bugzilla@apache.org
In reply to this post by Bugzilla from bugzilla@apache.org
https://bz.apache.org/bugzilla/show_bug.cgi?id=62042

--- Comment #5 from Dominik Stadler <[hidden email]> ---
Yes, tests require english locale, but the Gradle build should set that when
running tests...

--
You are receiving this mail because:
You are the assignee for the bug.
---------------------------------------------------------------------
To unsubscribe, e-mail: [hidden email]
For additional commands, e-mail: [hidden email]

Reply | Threaded
Open this post in threaded view
|

[Bug 62042] gradle build fails

Bugzilla from bugzilla@apache.org
In reply to this post by Bugzilla from bugzilla@apache.org
https://bz.apache.org/bugzilla/show_bug.cgi?id=62042

Dominik Stadler <[hidden email]> changed:

           What    |Removed                     |Added
----------------------------------------------------------------------------
         Resolution|---                         |FIXED
             Status|NEW                         |RESOLVED

--- Comment #6 from Dominik Stadler <[hidden email]> ---
This should be fixed via r1823596, you can also use the following as a
workaround:

LANG=en_US.UTF-8 LANGUAGE= LC_ALL= gradle check

--
You are receiving this mail because:
You are the assignee for the bug.
---------------------------------------------------------------------
To unsubscribe, e-mail: [hidden email]
For additional commands, e-mail: [hidden email]